deltaspike-commits mailing list archives

Site index · List index
Message view « Date » · « Thread »
Top « Date » · « Thread »
From Apache Jenkins Server <jenk...@builds.apache.org>
Subject Build failed in Jenkins: DeltaSpike OWB 1.2.3 #634
Date Tue, 10 Nov 2015 06:02:46 GMT
See <https://builds.apache.org/job/DeltaSpike%20OWB%201.2.3/634/changes>

Changes:

[struberg] improve JavaDoc for MessageBundles

------------------------------------------
[...truncated 374 lines...]
[INFO] 
[INFO] --- maven-bundle-plugin:2.3.7:cleanVersions (versions) @ deltaspike-core-api ---
[INFO] 
[INFO] --- maven-antrun-plugin:1.7:run (javadoc.resources) @ deltaspike-core-api ---
[WARNING] Parameter tasks is deprecated, use target instead
[INFO] Executing tasks

main:
[INFO] Executed tasks
[INFO] 
[INFO] --- maven-remote-resources-plugin:1.5:process (default) @ deltaspike-core-api ---
[INFO] 
[INFO] --- maven-resources-plugin:2.6:resources (default-resources) @ deltaspike-core-api
---
[INFO] Using 'UTF-8' encoding to copy filtered resources.
[INFO] Copying 2 resources
[INFO] Copying 3 resources
[INFO] 
[INFO] --- maven-compiler-plugin:2.5:compile (default-compile) @ deltaspike-core-api ---
[INFO] Compiling 164 source files to <https://builds.apache.org/job/DeltaSpike%20OWB%201.2.3/ws/deltaspike/core/api/target/classes>
[INFO] 
[INFO] --- maven-resources-plugin:2.6:testResources (default-testResources) @ deltaspike-core-api
---
[INFO] Using 'UTF-8' encoding to copy filtered resources.
[INFO] Copying 5 resources
[INFO] Copying 3 resources
[INFO] 
[INFO] --- maven-compiler-plugin:2.5:testCompile (default-testCompile) @ deltaspike-core-api
---
[INFO] Compiling 18 source files to <https://builds.apache.org/job/DeltaSpike%20OWB%201.2.3/ws/deltaspike/core/api/target/test-classes>
[INFO] 
[INFO] --- maven-surefire-plugin:2.11:test (default-test) @ deltaspike-core-api ---
[INFO] Surefire report directory: <https://builds.apache.org/job/DeltaSpike%20OWB%201.2.3/ws/deltaspike/core/api/target/surefire-reports>
[INFO] Using configured provider org.apache.maven.surefire.junitcore.JUnitCoreProvider

-------------------------------------------------------
 T E S T S
-------------------------------------------------------
Concurrency config is parallel='none', perCoreThreadCount=true, threadCount=2, useUnlimitedThreads=false
Running org.apache.deltaspike.test.api.config.PropertyLoaderTest
Nov 10, 2015 6:02:23 AM org.apache.deltaspike.core.api.config.PropertyLoader loadAllProperties
INFO: could not find any property files with name notexistingProperty
Nov 10, 2015 6:02:23 AM org.apache.deltaspike.core.api.config.PropertyLoader loadAllProperties
INFO: could not find any property files with name notexistingProperty
Tests run: 3, Failures: 0, Errors: 0, Skipped: 0, Time elapsed: 0.155 sec
Running org.apache.deltaspike.test.api.config.ConfigResolverTest
Tests run: 6, Failures: 0, Errors: 0, Skipped: 0, Time elapsed: 0.019 sec
Running org.apache.deltaspike.test.api.config.TypedResolverTest
Tests run: 7, Failures: 0, Errors: 0, Skipped: 0, Time elapsed: 0.006 sec
Running org.apache.deltaspike.test.api.metadata.AnnotatedTypeBuilderTest
Tests run: 4, Failures: 0, Errors: 0, Skipped: 0, Time elapsed: 0.062 sec
Running org.apache.deltaspike.test.api.util.StringUtilsTest
Tests run: 1, Failures: 0, Errors: 0, Skipped: 0, Time elapsed: 0.001 sec
Running org.apache.deltaspike.test.api.util.metadata.AnnotationInstanceProviderTest
Tests run: 19, Failures: 0, Errors: 0, Skipped: 0, Time elapsed: 0.022 sec
Running org.apache.deltaspike.test.api.util.ExceptionUtilsTest
Tests run: 4, Failures: 0, Errors: 0, Skipped: 0, Time elapsed: 0.002 sec
Running org.apache.deltaspike.core.util.activation.ProjectStageDependentClassDeactivationTest
Nov 10, 2015 6:02:23 AM org.apache.deltaspike.core.util.ClassDeactivationUtils cacheResult
INFO: class: org.apache.deltaspike.core.util.activation.ProjectStageDependentClassDeactivationTest$TestDeactivatable
activated=true
Nov 10, 2015 6:02:23 AM org.apache.deltaspike.core.util.ClassDeactivationUtils cacheResult
INFO: class: org.apache.deltaspike.core.util.activation.ProjectStageDependentClassDeactivationTest$TestDeactivatable
activated=false
Nov 10, 2015 6:02:23 AM org.apache.deltaspike.core.util.ClassDeactivationUtils cacheResult
INFO: class: org.apache.deltaspike.core.util.activation.ProjectStageDependentClassDeactivationTest$TestDeactivatable
activated=true
Nov 10, 2015 6:02:23 AM org.apache.deltaspike.core.util.ClassDeactivationUtils cacheResult
INFO: class: org.apache.deltaspike.core.util.activation.ProjectStageDependentClassDeactivationTest$TestDeactivatable
activated=false
Nov 10, 2015 6:02:23 AM org.apache.deltaspike.core.util.ClassDeactivationUtils cacheResult
INFO: class: org.apache.deltaspike.core.util.activation.ProjectStageDependentClassDeactivationTest$TestDeactivatable
activated=true
Nov 10, 2015 6:02:23 AM org.apache.deltaspike.core.util.ClassDeactivationUtils cacheResult
INFO: class: org.apache.deltaspike.core.util.activation.ProjectStageDependentClassDeactivationTest$TestDeactivatable
activated=true
Nov 10, 2015 6:02:23 AM org.apache.deltaspike.core.util.ClassDeactivationUtils cacheResult
INFO: class: org.apache.deltaspike.core.util.activation.ProjectStageDependentClassDeactivationTest$TestDeactivatable
activated=true
Nov 10, 2015 6:02:23 AM org.apache.deltaspike.core.util.ClassDeactivationUtils cacheResult
INFO: class: org.apache.deltaspike.core.util.activation.ProjectStageDependentClassDeactivationTest$TestDeactivatable
activated=true
Tests run: 6, Failures: 0, Errors: 0, Skipped: 0, Time elapsed: 0.013 sec

Results :

Tests run: 50, Failures: 0, Errors: 0, Skipped: 0

[JENKINS] Recording test results
log4j:WARN No appenders could be found for logger (org.apache.commons.beanutils.converters.BooleanConverter).
log4j:WARN Please initialize the log4j system properly.
[INFO] 
[INFO] --- maven-bundle-plugin:2.3.7:bundle (default-bundle) @ deltaspike-core-api ---
[WARNING] Bundle org.apache.deltaspike.core:deltaspike-core-api:bundle:1.5.2-SNAPSHOT : Did
not find matching referal for !org.apache.deltaspike.core.*
[INFO] 
[INFO] --- maven-site-plugin:3.3:attach-descriptor (attach-descriptor) @ deltaspike-core-api
---
[INFO] 
[INFO] --- maven-jar-plugin:2.4:test-jar (default) @ deltaspike-core-api ---
[INFO] Building jar: <https://builds.apache.org/job/DeltaSpike%20OWB%201.2.3/ws/deltaspike/core/api/target/deltaspike-core-api-1.5.2-SNAPSHOT-tests.jar>
[INFO] 
[INFO] --- maven-bundle-plugin:2.3.7:cleanVersions (versions) @ deltaspike-core-api ---
[INFO] 
[INFO] --- maven-antrun-plugin:1.7:run (javadoc.resources) @ deltaspike-core-api ---
[WARNING] Parameter tasks is deprecated, use target instead
[INFO] Executing tasks

main:
[INFO] Executed tasks
[WARNING] Failed to getClass for org.apache.maven.plugin.source.SourceJarMojo
[INFO] 
[INFO] --- maven-source-plugin:2.2.1:jar (attach-sources) @ deltaspike-core-api ---
[INFO] Building jar: <https://builds.apache.org/job/DeltaSpike%20OWB%201.2.3/ws/deltaspike/core/api/target/deltaspike-core-api-1.5.2-SNAPSHOT-sources.jar>
[INFO] 
[INFO] --- maven-checkstyle-plugin:2.9.1:check (verify-style) @ deltaspike-core-api ---
[INFO] Starting audit...
<https://builds.apache.org/job/DeltaSpike%20OWB%201.2.3/ws/deltaspike/core/api/src/main/java/org/apache/deltaspike/core/api/message/MessageBundle.java>:65:
Line is longer than 120 characters.
Audit done.

[INFO] There are 1 checkstyle errors.
[INFO] ------------------------------------------------------------------------
[INFO] Reactor Summary:
[INFO] 
[INFO] Apache DeltaSpike Sources ......................... SUCCESS [3.753s]
[INFO] Apache DeltaSpike CheckStyle-rules ................ SUCCESS [2.187s]
[INFO] Apache DeltaSpike Parent .......................... SUCCESS [9.400s]
[INFO] Apache DeltaSpike Test-Utils ...................... SUCCESS [9.021s]
[INFO] Apache DeltaSpike Code Parent ..................... SUCCESS [2.561s]
[INFO] Apache DeltaSpike Core ............................ SUCCESS [1.434s]
[INFO] Apache DeltaSpike Core-API ........................ FAILURE [10.355s]
[INFO] Apache DeltaSpike Core-Implementation ............. SKIPPED
[INFO] Apache DeltaSpike ContainerControl parent ......... SKIPPED
[INFO] Apache DeltaSpike CDI ContainerControl API ........ SKIPPED
[INFO] Apache DeltaSpike CDI ContainerControl TCK ........ SKIPPED
[INFO] Apache DeltaSpike CDI OWB-ContainerControl ........ SKIPPED
[INFO] Apache DeltaSpike CDI Weld-ContainerControl ....... SKIPPED
[INFO] Apache DeltaSpike CDI OpenEJB-ContainerControl .... SKIPPED
[INFO] Apache DeltaSpike CDI Servlet-ContainerControl .... SKIPPED
[INFO] Apache DeltaSpike Modules ......................... SKIPPED
[INFO] Apache DeltaSpike Proxy-Module .................... SKIPPED
[INFO] Apache DeltaSpike Proxy-Module API ................ SKIPPED
[INFO] Apache DeltaSpike Proxy-Module Impl ASM5 .......... SKIPPED
[INFO] Apache DeltaSpike Security-Module ................. SKIPPED
[INFO] Apache DeltaSpike Security-Module API ............. SKIPPED
[INFO] Apache DeltaSpike Security-Module Impl ............ SKIPPED
[INFO] Apache DeltaSpike JPA-Module ...................... SKIPPED
[INFO] Apache DeltaSpike JPA-Module API .................. SKIPPED
[INFO] Apache DeltaSpike JPA-Module Impl ................. SKIPPED
[INFO] Apache DeltaSpike Servlet-Module .................. SKIPPED
[INFO] Apache DeltaSpike Servlet-Module API .............. SKIPPED
[INFO] Apache DeltaSpike Servlet-Module Impl ............. SKIPPED
[INFO] Apache DeltaSpike JSF-Module ...................... SKIPPED
[INFO] Apache DeltaSpike JSF-Module API .................. SKIPPED
[INFO] Apache DeltaSpike JSF-Module Impl ................. SKIPPED
[INFO] Apache DeltaSpike JSF-Module Impl (EE6 only) ...... SKIPPED
[INFO] Apache DeltaSpike Partial-Bean-Module ............. SKIPPED
[INFO] Apache DeltaSpike Partial-Bean-Module API ......... SKIPPED
[INFO] Apache DeltaSpike Partial-Bean-Module Impl ........ SKIPPED
[INFO] Apache DeltaSpike BeanValidation-Module ........... SKIPPED
[INFO] Apache DeltaSpike BeanValidation-Module API ....... SKIPPED
[INFO] Apache DeltaSpike BeanValidation-Module Impl ...... SKIPPED
[INFO] Apache DeltaSpike Data-Module ..................... SKIPPED
[INFO] Apache DeltaSpike Data-Module API ................. SKIPPED
[INFO] Apache DeltaSpike Data-Module Impl ................ SKIPPED
[INFO] Apache DeltaSpike Scheduler-Module ................ SKIPPED
[INFO] Apache DeltaSpike Scheduler-Module API ............ SKIPPED
[INFO] Apache DeltaSpike Scheduler-Module Impl ........... SKIPPED
[INFO] Apache DeltaSpike Test-Control-Module ............. SKIPPED
[INFO] Apache DeltaSpike Test-Control-Module API ......... SKIPPED
[INFO] Apache DeltaSpike Test-Control-Module Impl ........ SKIPPED
[INFO] Apache DeltaSpike Examples ........................ SKIPPED
[INFO] Apache DeltaSpike Java-SE Examples ................ SKIPPED
[INFO] Apache DeltaSpike JSF Examples .................... SKIPPED
[INFO] Apache DeltaSpike JSF Playground .................. SKIPPED
[INFO] Apache DeltaSpike Security Example CDI ............ SKIPPED
[INFO] Apache DeltaSpike Security Example PicketLink ..... SKIPPED
[INFO] Apache DeltaSpike Java-SE Scheduler Examples ...... SKIPPED
[INFO] ------------------------------------------------------------------------
[INFO] BUILD FAILURE
[INFO] ------------------------------------------------------------------------
[INFO] Total time: 44.997s
[INFO] Finished at: Tue Nov 10 06:02:30 UTC 2015
[INFO] Final Memory: 41M/241M
[INFO] ------------------------------------------------------------------------
Waiting for Jenkins to finish collecting data
[ERROR] Failed to execute goal org.apache.maven.plugins:maven-checkstyle-plugin:2.9.1:check
(verify-style) on project deltaspike-core-api: You have 1 Checkstyle violation. -> [Help
1]
[ERROR] 
[ERROR] To see the full stack trace of the errors, re-run Maven with the -e switch.
[ERROR] Re-run Maven using the -X switch to enable full debug logging.
[ERROR] 
[ERROR] For more information about the errors and possible solutions, please read the following
articles:
[ERROR] [Help 1] http://cwiki.apache.org/confluence/display/MAVEN/MojoFailureException
[ERROR] 
[ERROR] After correcting the problems, you can resume the build with the command
[ERROR]   mvn <goals> -rf :deltaspike-core-api
[JENKINS] Archiving <https://builds.apache.org/job/DeltaSpike%20OWB%201.2.3/ws/deltaspike/examples/jse-examples/pom.xml>
to org.apache.deltaspike.examples/deltaspike-jse-example/1.5.2-SNAPSHOT/deltaspike-jse-example-1.5.2-SNAPSHOT.pom
[JENKINS] Archiving <https://builds.apache.org/job/DeltaSpike%20OWB%201.2.3/ws/deltaspike/examples/security-requested-page-after-login-cdi/pom.xml>
to org.apache.deltaspike.examples/deltaspike-security-requested-page-after-login-cdi/1.5.2-SNAPSHOT/deltaspike-security-requested-page-after-login-cdi-1.5.2-SNAPSHOT.pom
[JENKINS] Archiving <https://builds.apache.org/job/DeltaSpike%20OWB%201.2.3/ws/deltaspike/test-utils/pom.xml>
to org.apache.deltaspike.test/test-utils/1.5.2-SNAPSHOT/test-utils-1.5.2-SNAPSHOT.pom
[JENKINS] Archiving <https://builds.apache.org/job/DeltaSpike%20OWB%201.2.3/ws/deltaspike/test-utils/target/test-utils-1.5.2-SNAPSHOT.jar>
to org.apache.deltaspike.test/test-utils/1.5.2-SNAPSHOT/test-utils-1.5.2-SNAPSHOT.jar
[JENKINS] Archiving <https://builds.apache.org/job/DeltaSpike%20OWB%201.2.3/ws/deltaspike/test-utils/target/test-utils-1.5.2-SNAPSHOT-sources.jar>
to org.apache.deltaspike.test/test-utils/1.5.2-SNAPSHOT/test-utils-1.5.2-SNAPSHOT-sources.jar
[JENKINS] Archiving <https://builds.apache.org/job/DeltaSpike%20OWB%201.2.3/ws/deltaspike/modules/data/impl/pom.xml>
to org.apache.deltaspike.modules/deltaspike-data-module-impl/1.5.2-SNAPSHOT/deltaspike-data-module-impl-1.5.2-SNAPSHOT.pom
[JENKINS] Archiving <https://builds.apache.org/job/DeltaSpike%20OWB%201.2.3/ws/deltaspike/modules/data/api/pom.xml>
to org.apache.deltaspike.modules/deltaspike-data-module-api/1.5.2-SNAPSHOT/deltaspike-data-module-api-1.5.2-SNAPSHOT.pom
[JENKINS] Archiving <https://builds.apache.org/job/DeltaSpike%20OWB%201.2.3/ws/deltaspike/core/impl/pom.xml>
to org.apache.deltaspike.core/deltaspike-core-impl/1.5.2-SNAPSHOT/deltaspike-core-impl-1.5.2-SNAPSHOT.pom
[JENKINS] Archiving <https://builds.apache.org/job/DeltaSpike%20OWB%201.2.3/ws/deltaspike/modules/pom.xml>
to org.apache.deltaspike.modules/modules-project/1.5.2-SNAPSHOT/modules-project-1.5.2-SNAPSHOT.pom
[JENKINS] Archiving <https://builds.apache.org/job/DeltaSpike%20OWB%201.2.3/ws/deltaspike/modules/test-control/pom.xml>
to org.apache.deltaspike.modules/test-control-module-project/1.5.2-SNAPSHOT/test-control-module-project-1.5.2-SNAPSHOT.pom
[JENKINS] Archiving <https://builds.apache.org/job/DeltaSpike%20OWB%201.2.3/ws/deltaspike/examples/jsf-examples/pom.xml>
to org.apache.deltaspike.examples/deltaspike-jsf-example/1.5.2-SNAPSHOT/deltaspike-jsf-example-1.5.2-SNAPSHOT.pom
[JENKINS] Archiving <https://builds.apache.org/job/DeltaSpike%20OWB%201.2.3/ws/deltaspike/cdictrl/servlet/pom.xml>
to org.apache.deltaspike.cdictrl/deltaspike-cdictrl-servlet/1.5.2-SNAPSHOT/deltaspike-cdictrl-servlet-1.5.2-SNAPSHOT.pom
[JENKINS] Archiving <https://builds.apache.org/job/DeltaSpike%20OWB%201.2.3/ws/deltaspike/cdictrl/api/pom.xml>
to org.apache.deltaspike.cdictrl/deltaspike-cdictrl-api/1.5.2-SNAPSHOT/deltaspike-cdictrl-api-1.5.2-SNAPSHOT.pom
[JENKINS] Archiving <https://builds.apache.org/job/DeltaSpike%20OWB%201.2.3/ws/deltaspike/examples/scheduler-playground/pom.xml>
to org.apache.deltaspike.examples/deltaspike-scheduler-example/1.5.2-SNAPSHOT/deltaspike-scheduler-example-1.5.2-SNAPSHOT.pom
[JENKINS] Archiving <https://builds.apache.org/job/DeltaSpike%20OWB%201.2.3/ws/deltaspike/checkstyle-rules/pom.xml>
to org.apache.deltaspike/checkstyle-rules/1.5.2-SNAPSHOT/checkstyle-rules-1.5.2-SNAPSHOT.pom
[JENKINS] Archiving <https://builds.apache.org/job/DeltaSpike%20OWB%201.2.3/ws/deltaspike/checkstyle-rules/target/checkstyle-rules-1.5.2-SNAPSHOT.jar>
to org.apache.deltaspike/checkstyle-rules/1.5.2-SNAPSHOT/checkstyle-rules-1.5.2-SNAPSHOT.jar
[JENKINS] Archiving <https://builds.apache.org/job/DeltaSpike%20OWB%201.2.3/ws/deltaspike/parent/code/pom.xml>
to org.apache.deltaspike/parent-code/1.5.2-SNAPSHOT/parent-code-1.5.2-SNAPSHOT.pom
[JENKINS] Archiving <https://builds.apache.org/job/DeltaSpike%20OWB%201.2.3/ws/deltaspike/parent/code/target/parent-code-1.5.2-SNAPSHOT-tests.jar>
to org.apache.deltaspike/parent-code/1.5.2-SNAPSHOT/parent-code-1.5.2-SNAPSHOT-tests.jar
Compressed 75.21 KB of artifacts by 42.5% relative to #633
[JENKINS] Archiving <https://builds.apache.org/job/DeltaSpike%20OWB%201.2.3/ws/deltaspike/modules/jsf/impl/pom.xml>
to org.apache.deltaspike.modules/deltaspike-jsf-module-impl/1.5.2-SNAPSHOT/deltaspike-jsf-module-impl-1.5.2-SNAPSHOT.pom
[JENKINS] Archiving <https://builds.apache.org/job/DeltaSpike%20OWB%201.2.3/ws/deltaspike/modules/partial-bean/pom.xml>
to org.apache.deltaspike.modules/partial-bean-module-project/1.5.2-SNAPSHOT/partial-bean-module-project-1.5.2-SNAPSHOT.pom
[JENKINS] Archiving <https://builds.apache.org/job/DeltaSpike%20OWB%201.2.3/ws/deltaspike/examples/pom.xml>
to org.apache.deltaspike.examples/examples-project/1.5.2-SNAPSHOT/examples-project-1.5.2-SNAPSHOT.pom
[JENKINS] Archiving <https://builds.apache.org/job/DeltaSpike%20OWB%201.2.3/ws/deltaspike/cdictrl/impl-openejb/pom.xml>
to org.apache.deltaspike.cdictrl/deltaspike-cdictrl-openejb/1.5.2-SNAPSHOT/deltaspike-cdictrl-openejb-1.5.2-SNAPSHOT.pom
[JENKINS] Archiving <https://builds.apache.org/job/DeltaSpike%20OWB%201.2.3/ws/deltaspike/modules/jsf/pom.xml>
to org.apache.deltaspike.modules/jsf-module-project/1.5.2-SNAPSHOT/jsf-module-project-1.5.2-SNAPSHOT.pom
[JENKINS] Archiving <https://builds.apache.org/job/DeltaSpike%20OWB%201.2.3/ws/deltaspike/cdictrl/tck/pom.xml>
to org.apache.deltaspike.test/deltaspike-cdictrl-tck/1.5.2-SNAPSHOT/deltaspike-cdictrl-tck-1.5.2-SNAPSHOT.pom
[JENKINS] Archiving <https://builds.apache.org/job/DeltaSpike%20OWB%201.2.3/ws/deltaspike/modules/jsf/api/pom.xml>
to org.apache.deltaspike.modules/deltaspike-jsf-module-api/1.5.2-SNAPSHOT/deltaspike-jsf-module-api-1.5.2-SNAPSHOT.pom
[JENKINS] Archiving <https://builds.apache.org/job/DeltaSpike%20OWB%201.2.3/ws/deltaspike/modules/security/pom.xml>
to org.apache.deltaspike.modules/security-module-project/1.5.2-SNAPSHOT/security-module-project-1.5.2-SNAPSHOT.pom
[JENKINS] Archiving <https://builds.apache.org/job/DeltaSpike%20OWB%201.2.3/ws/deltaspike/modules/bean-validation/pom.xml>
to org.apache.deltaspike.modules/bean-validation-module-project/1.5.2-SNAPSHOT/bean-validation-module-project-1.5.2-SNAPSHOT.pom
[JENKINS] Archiving <https://builds.apache.org/job/DeltaSpike%20OWB%201.2.3/ws/deltaspike/modules/partial-bean/impl/pom.xml>
to org.apache.deltaspike.modules/deltaspike-partial-bean-module-impl/1.5.2-SNAPSHOT/deltaspike-partial-bean-module-impl-1.5.2-SNAPSHOT.pom
[JENKINS] Archiving <https://builds.apache.org/job/DeltaSpike%20OWB%201.2.3/ws/deltaspike/modules/proxy/api/pom.xml>
to org.apache.deltaspike.modules/deltaspike-proxy-module-api/1.5.2-SNAPSHOT/deltaspike-proxy-module-api-1.5.2-SNAPSHOT.pom
[JENKINS] Archiving <https://builds.apache.org/job/DeltaSpike%20OWB%201.2.3/ws/deltaspike/cdictrl/impl-weld/pom.xml>
to org.apache.deltaspike.cdictrl/deltaspike-cdictrl-weld/1.5.2-SNAPSHOT/deltaspike-cdictrl-weld-1.5.2-SNAPSHOT.pom
[JENKINS] Archiving <https://builds.apache.org/job/DeltaSpike%20OWB%201.2.3/ws/deltaspike/modules/jpa/api/pom.xml>
to org.apache.deltaspike.modules/deltaspike-jpa-module-api/1.5.2-SNAPSHOT/deltaspike-jpa-module-api-1.5.2-SNAPSHOT.pom
[JENKINS] Archiving <https://builds.apache.org/job/DeltaSpike%20OWB%201.2.3/ws/deltaspike/modules/servlet/api/pom.xml>
to org.apache.deltaspike.modules/deltaspike-servlet-module-api/1.5.2-SNAPSHOT/deltaspike-servlet-module-api-1.5.2-SNAPSHOT.pom
[JENKINS] Archiving <https://builds.apache.org/job/DeltaSpike%20OWB%201.2.3/ws/deltaspike/modules/jpa/pom.xml>
to org.apache.deltaspike.modules/jpa-module-project/1.5.2-SNAPSHOT/jpa-module-project-1.5.2-SNAPSHOT.pom
[JENKINS] Archiving <https://builds.apache.org/job/DeltaSpike%20OWB%201.2.3/ws/deltaspike/cdictrl/pom.xml>
to org.apache.deltaspike.cdictrl/cdictrl-project/1.5.2-SNAPSHOT/cdictrl-project-1.5.2-SNAPSHOT.pom
[JENKINS] Archiving <https://builds.apache.org/job/DeltaSpike%20OWB%201.2.3/ws/deltaspike/modules/scheduler/api/pom.xml>
to org.apache.deltaspike.modules/deltaspike-scheduler-module-api/1.5.2-SNAPSHOT/deltaspike-scheduler-module-api-1.5.2-SNAPSHOT.pom
[JENKINS] Archiving <https://builds.apache.org/job/DeltaSpike%20OWB%201.2.3/ws/deltaspike/modules/test-control/impl/pom.xml>
to org.apache.deltaspike.modules/deltaspike-test-control-module-impl/1.5.2-SNAPSHOT/deltaspike-test-control-module-impl-1.5.2-SNAPSHOT.pom
[JENKINS] Archiving <https://builds.apache.org/job/DeltaSpike%20OWB%201.2.3/ws/deltaspike/modules/servlet/pom.xml>
to org.apache.deltaspike.modules/servlet-module-project/1.5.2-SNAPSHOT/servlet-module-project-1.5.2-SNAPSHOT.pom
[JENKINS] Archiving <https://builds.apache.org/job/DeltaSpike%20OWB%201.2.3/ws/deltaspike/modules/test-control/api/pom.xml>
to org.apache.deltaspike.modules/deltaspike-test-control-module-api/1.5.2-SNAPSHOT/deltaspike-test-control-module-api-1.5.2-SNAPSHOT.pom
[JENKINS] Archiving <https://builds.apache.org/job/DeltaSpike%20OWB%201.2.3/ws/deltaspike/modules/jsf/impl-ee6/pom.xml>
to org.apache.deltaspike.modules/deltaspike-jsf-module-impl-ee6/1.5.2-SNAPSHOT/deltaspike-jsf-module-impl-ee6-1.5.2-SNAPSHOT.pom
[JENKINS] Archiving <https://builds.apache.org/job/DeltaSpike%20OWB%201.2.3/ws/deltaspike/modules/proxy/pom.xml>
to org.apache.deltaspike.modules/proxy-module-project/1.5.2-SNAPSHOT/proxy-module-project-1.5.2-SNAPSHOT.pom
[JENKINS] Archiving <https://builds.apache.org/job/DeltaSpike%20OWB%201.2.3/ws/deltaspike/modules/partial-bean/api/pom.xml>
to org.apache.deltaspike.modules/deltaspike-partial-bean-module-api/1.5.2-SNAPSHOT/deltaspike-partial-bean-module-api-1.5.2-SNAPSHOT.pom
[JENKINS] Archiving <https://builds.apache.org/job/DeltaSpike%20OWB%201.2.3/ws/deltaspike/modules/scheduler/impl/pom.xml>
to org.apache.deltaspike.modules/deltaspike-scheduler-module-impl/1.5.2-SNAPSHOT/deltaspike-scheduler-module-impl-1.5.2-SNAPSHOT.pom
[JENKINS] Archiving <https://builds.apache.org/job/DeltaSpike%20OWB%201.2.3/ws/deltaspike/parent/pom.xml>
to org.apache.deltaspike/parent/1.5.2-SNAPSHOT/parent-1.5.2-SNAPSHOT.pom
Compressed 39.62 KB of artifacts by 80.8% relative to #633
[JENKINS] Archiving <https://builds.apache.org/job/DeltaSpike%20OWB%201.2.3/ws/deltaspike/core/pom.xml>
to org.apache.deltaspike.core/core-project/1.5.2-SNAPSHOT/core-project-1.5.2-SNAPSHOT.pom
[JENKINS] Archiving <https://builds.apache.org/job/DeltaSpike%20OWB%201.2.3/ws/deltaspike/core/target/core-project-1.5.2-SNAPSHOT-tests.jar>
to org.apache.deltaspike.core/core-project/1.5.2-SNAPSHOT/core-project-1.5.2-SNAPSHOT-tests.jar
[JENKINS] Archiving <https://builds.apache.org/job/DeltaSpike%20OWB%201.2.3/ws/deltaspike/modules/bean-validation/api/pom.xml>
to org.apache.deltaspike.modules/deltaspike-bean-validation-module-api/1.5.2-SNAPSHOT/deltaspike-bean-validation-module-api-1.5.2-SNAPSHOT.pom
[JENKINS] Archiving <https://builds.apache.org/job/DeltaSpike%20OWB%201.2.3/ws/deltaspike/core/api/pom.xml>
to org.apache.deltaspike.core/deltaspike-core-api/1.5.2-SNAPSHOT/deltaspike-core-api-1.5.2-SNAPSHOT.pom
[JENKINS] Archiving <https://builds.apache.org/job/DeltaSpike%20OWB%201.2.3/ws/deltaspike/core/api/target/deltaspike-core-api-1.5.2-SNAPSHOT.jar>
to org.apache.deltaspike.core/deltaspike-core-api/1.5.2-SNAPSHOT/deltaspike-core-api-1.5.2-SNAPSHOT.jar
[JENKINS] Archiving <https://builds.apache.org/job/DeltaSpike%20OWB%201.2.3/ws/deltaspike/core/api/target/deltaspike-core-api-1.5.2-SNAPSHOT-tests.jar>
to org.apache.deltaspike.core/deltaspike-core-api/1.5.2-SNAPSHOT/deltaspike-core-api-1.5.2-SNAPSHOT-tests.jar
[JENKINS] Archiving <https://builds.apache.org/job/DeltaSpike%20OWB%201.2.3/ws/deltaspike/core/api/target/deltaspike-core-api-1.5.2-SNAPSHOT-sources.jar>
to org.apache.deltaspike.core/deltaspike-core-api/1.5.2-SNAPSHOT/deltaspike-core-api-1.5.2-SNAPSHOT-sources.jar
[JENKINS] Archiving <https://builds.apache.org/job/DeltaSpike%20OWB%201.2.3/ws/deltaspike/modules/security/impl/pom.xml>
to org.apache.deltaspike.modules/deltaspike-security-module-impl/1.5.2-SNAPSHOT/deltaspike-security-module-impl-1.5.2-SNAPSHOT.pom
[JENKINS] Archiving <https://builds.apache.org/job/DeltaSpike%20OWB%201.2.3/ws/deltaspike/modules/scheduler/pom.xml>
to org.apache.deltaspike.modules/scheduler-module-project/1.5.2-SNAPSHOT/scheduler-module-project-1.5.2-SNAPSHOT.pom
[JENKINS] Archiving <https://builds.apache.org/job/DeltaSpike%20OWB%201.2.3/ws/deltaspike/modules/proxy/impl-asm5/pom.xml>
to org.apache.deltaspike.modules/deltaspike-proxy-module-impl-asm5/1.5.2-SNAPSHOT/deltaspike-proxy-module-impl-asm5-1.5.2-SNAPSHOT.pom
[JENKINS] Archiving <https://builds.apache.org/job/DeltaSpike%20OWB%201.2.3/ws/deltaspike/examples/jsf-playground/pom.xml>
to org.apache.deltaspike.examples/deltaspike-jsf-playground/1.5.2-SNAPSHOT/deltaspike-jsf-playground-1.5.2-SNAPSHOT.pom
[JENKINS] Archiving <https://builds.apache.org/job/DeltaSpike%20OWB%201.2.3/ws/deltaspike/modules/servlet/impl/pom.xml>
to org.apache.deltaspike.modules/deltaspike-servlet-module-impl/1.5.2-SNAPSHOT/deltaspike-servlet-module-impl-1.5.2-SNAPSHOT.pom
[JENKINS] Archiving <https://builds.apache.org/job/DeltaSpike%20OWB%201.2.3/ws/deltaspike/modules/bean-validation/impl/pom.xml>
to org.apache.deltaspike.modules/deltaspike-bean-validation-module-impl/1.5.2-SNAPSHOT/deltaspike-bean-validation-module-impl-1.5.2-SNAPSHOT.pom
[JENKINS] Archiving <https://builds.apache.org/job/DeltaSpike%20OWB%201.2.3/ws/deltaspike/cdictrl/impl-owb/pom.xml>
to org.apache.deltaspike.cdictrl/deltaspike-cdictrl-owb/1.5.2-SNAPSHOT/deltaspike-cdictrl-owb-1.5.2-SNAPSHOT.pom
[JENKINS] Archiving <https://builds.apache.org/job/DeltaSpike%20OWB%201.2.3/ws/deltaspike/modules/jpa/impl/pom.xml>
to org.apache.deltaspike.modules/deltaspike-jpa-module-impl/1.5.2-SNAPSHOT/deltaspike-jpa-module-impl-1.5.2-SNAPSHOT.pom
[JENKINS] Archiving <https://builds.apache.org/job/DeltaSpike%20OWB%201.2.3/ws/deltaspike/modules/data/pom.xml>
to org.apache.deltaspike.modules/data-module-project/1.5.2-SNAPSHOT/data-module-project-1.5.2-SNAPSHOT.pom
[JENKINS] Archiving <https://builds.apache.org/job/DeltaSpike%20OWB%201.2.3/ws/deltaspike/examples/security-requested-page-after-login-picketlink/pom.xml>
to org.apache.deltaspike.examples/deltaspike-security-requested-page-after-login-picketlink/1.5.2-SNAPSHOT/deltaspike-security-requested-page-after-login-picketlink-1.5.2-SNAPSHOT.pom
[JENKINS] Archiving <https://builds.apache.org/job/DeltaSpike%20OWB%201.2.3/ws/deltaspike/pom.xml>
to org.apache.deltaspike/deltaspike-project/1.5.2-SNAPSHOT/deltaspike-project-1.5.2-SNAPSHOT.pom
[JENKINS] Archiving <https://builds.apache.org/job/DeltaSpike%20OWB%201.2.3/ws/deltaspike/modules/security/api/pom.xml>
to org.apache.deltaspike.modules/deltaspike-security-module-api/1.5.2-SNAPSHOT/deltaspike-security-module-api-1.5.2-SNAPSHOT.pom
Sending e-mails to: commits@deltaspike.apache.org
channel stopped

Mime
View raw message