deltaspike-commits mailing list archives

Site index · List index
Message view « Date » · « Thread »
Top « Date » · « Thread »
From Apache Jenkins Server <jenk...@builds.apache.org>
Subject Build failed in Jenkins: DeltaSpike Weld 2.1.0 #592
Date Mon, 23 Nov 2015 10:41:25 GMT
See <https://builds.apache.org/job/DeltaSpike%20Weld%202.1.0/592/changes>

Changes:

[struberg] DELTASPIKE-1015 support for hierarchic BeanManager

------------------------------------------
[...truncated 2083 lines...]
jdk1.7.0_80/man/man1/jconsole.1
jdk1.7.0_80/man/man1/extcheck.1
jdk1.7.0_80/man/man1/wsimport.1
jdk1.7.0_80/man/man1/pack200.1
jdk1.7.0_80/man/man1/schemagen.1
jdk1.7.0_80/man/man1/javadoc.1
jdk1.7.0_80/man/man1/rmic.1
jdk1.7.0_80/man/man1/serialver.1
jdk1.7.0_80/man/man1/apt.1
jdk1.7.0_80/man/man1/javah.1
jdk1.7.0_80/man/man1/wsgen.1
jdk1.7.0_80/man/man1/jvisualvm.1
jdk1.7.0_80/man/man1/appletviewer.1
jdk1.7.0_80/man/man1/jsadebugd.1
jdk1.7.0_80/man/man1/orbd.1
jdk1.7.0_80/man/man1/javaws.1
jdk1.7.0_80/man/man1/jdb.1
jdk1.7.0_80/man/man1/jstatd.1
jdk1.7.0_80/man/man1/javap.1
jdk1.7.0_80/man/man1/jhat.1
jdk1.7.0_80/man/man1/xjc.1
jdk1.7.0_80/man/man1/jar.1
jdk1.7.0_80/man/man1/policytool.1
jdk1.7.0_80/man/man1/rmiregistry.1
jdk1.7.0_80/man/man1/idlj.1
jdk1.7.0_80/man/man1/jps.1
jdk1.7.0_80/man/man1/unpack200.1
jdk1.7.0_80/man/man1/tnameserv.1
jdk1.7.0_80/man/man1/jrunscript.1
jdk1.7.0_80/man/man1/jmap.1
jdk1.7.0_80/man/man1/jstack.1
jdk1.7.0_80/man/man1/servertool.1
jdk1.7.0_80/man/man1/javafxpackager.1
jdk1.7.0_80/man/man1/jstat.1
jdk1.7.0_80/man/man1/jmc.1
jdk1.7.0_80/man/man1/javac.1
jdk1.7.0_80/man/ja
jdk1.7.0_80/man/ja_JP.UTF-8/
jdk1.7.0_80/man/ja_JP.UTF-8/man1/
jdk1.7.0_80/man/ja_JP.UTF-8/man1/jinfo.1
jdk1.7.0_80/man/ja_JP.UTF-8/man1/rmid.1
jdk1.7.0_80/man/ja_JP.UTF-8/man1/native2ascii.1
jdk1.7.0_80/man/ja_JP.UTF-8/man1/jcmd.1
jdk1.7.0_80/man/ja_JP.UTF-8/man1/java.1
jdk1.7.0_80/man/ja_JP.UTF-8/man1/jarsigner.1
jdk1.7.0_80/man/ja_JP.UTF-8/man1/keytool.1
jdk1.7.0_80/man/ja_JP.UTF-8/man1/jconsole.1
jdk1.7.0_80/man/ja_JP.UTF-8/man1/extcheck.1
jdk1.7.0_80/man/ja_JP.UTF-8/man1/wsimport.1
jdk1.7.0_80/man/ja_JP.UTF-8/man1/pack200.1
jdk1.7.0_80/man/ja_JP.UTF-8/man1/schemagen.1
jdk1.7.0_80/man/ja_JP.UTF-8/man1/javadoc.1
jdk1.7.0_80/man/ja_JP.UTF-8/man1/rmic.1
jdk1.7.0_80/man/ja_JP.UTF-8/man1/serialver.1
jdk1.7.0_80/man/ja_JP.UTF-8/man1/apt.1
jdk1.7.0_80/man/ja_JP.UTF-8/man1/javah.1
jdk1.7.0_80/man/ja_JP.UTF-8/man1/wsgen.1
jdk1.7.0_80/man/ja_JP.UTF-8/man1/jvisualvm.1
jdk1.7.0_80/man/ja_JP.UTF-8/man1/appletviewer.1
jdk1.7.0_80/man/ja_JP.UTF-8/man1/jsadebugd.1
jdk1.7.0_80/man/ja_JP.UTF-8/man1/orbd.1
jdk1.7.0_80/man/ja_JP.UTF-8/man1/javaws.1
jdk1.7.0_80/man/ja_JP.UTF-8/man1/jdb.1
jdk1.7.0_80/man/ja_JP.UTF-8/man1/jstatd.1
jdk1.7.0_80/man/ja_JP.UTF-8/man1/javap.1
jdk1.7.0_80/man/ja_JP.UTF-8/man1/jhat.1
jdk1.7.0_80/man/ja_JP.UTF-8/man1/xjc.1
jdk1.7.0_80/man/ja_JP.UTF-8/man1/jar.1
jdk1.7.0_80/man/ja_JP.UTF-8/man1/policytool.1
jdk1.7.0_80/man/ja_JP.UTF-8/man1/rmiregistry.1
jdk1.7.0_80/man/ja_JP.UTF-8/man1/idlj.1
jdk1.7.0_80/man/ja_JP.UTF-8/man1/jps.1
jdk1.7.0_80/man/ja_JP.UTF-8/man1/unpack200.1
jdk1.7.0_80/man/ja_JP.UTF-8/man1/tnameserv.1
jdk1.7.0_80/man/ja_JP.UTF-8/man1/jrunscript.1
jdk1.7.0_80/man/ja_JP.UTF-8/man1/jmap.1
jdk1.7.0_80/man/ja_JP.UTF-8/man1/jstack.1
jdk1.7.0_80/man/ja_JP.UTF-8/man1/servertool.1
jdk1.7.0_80/man/ja_JP.UTF-8/man1/javafxpackager.1
jdk1.7.0_80/man/ja_JP.UTF-8/man1/jstat.1
jdk1.7.0_80/man/ja_JP.UTF-8/man1/jmc.1
jdk1.7.0_80/man/ja_JP.UTF-8/man1/javac.1
jdk1.7.0_80/include/
jdk1.7.0_80/include/jvmti.h
jdk1.7.0_80/include/classfile_constants.h
jdk1.7.0_80/include/jdwpTransport.h
jdk1.7.0_80/include/jvmticmlr.h
jdk1.7.0_80/include/jni.h
jdk1.7.0_80/include/linux/
jdk1.7.0_80/include/linux/jni_md.h
jdk1.7.0_80/include/linux/jawt_md.h
jdk1.7.0_80/include/jawt.h
jdk1.7.0_80/src.zip
jdk1.7.0_80/THIRDPARTYLICENSEREADME-JAVAFX.txt
jdk1.7.0_80/COPYRIGHT
jdk1.7.0_80/db/
jdk1.7.0_80/db/LICENSE
jdk1.7.0_80/db/RELEASE-NOTES.html
jdk1.7.0_80/db/lib/
jdk1.7.0_80/db/lib/derbyLocale_zh_CN.jar
jdk1.7.0_80/db/lib/derbynet.jar
jdk1.7.0_80/db/lib/derbyLocale_ja_JP.jar
jdk1.7.0_80/db/lib/derbyLocale_ru.jar
jdk1.7.0_80/db/lib/derbyLocale_es.jar
jdk1.7.0_80/db/lib/derbyLocale_it.jar
jdk1.7.0_80/db/lib/derby.jar
jdk1.7.0_80/db/lib/derbytools.jar
jdk1.7.0_80/db/lib/derbyLocale_hu.jar
jdk1.7.0_80/db/lib/derby.war
jdk1.7.0_80/db/lib/derbyrun.jar
jdk1.7.0_80/db/lib/derbyLocale_zh_TW.jar
jdk1.7.0_80/db/lib/derbyLocale_fr.jar
jdk1.7.0_80/db/lib/derbyclient.jar
jdk1.7.0_80/db/lib/derbyLocale_cs.jar
jdk1.7.0_80/db/lib/derbyLocale_pl.jar
jdk1.7.0_80/db/lib/derbyLocale_de_DE.jar
jdk1.7.0_80/db/lib/derbyLocale_ko_KR.jar
jdk1.7.0_80/db/lib/derbyLocale_pt_BR.jar
jdk1.7.0_80/db/3RDPARTY
jdk1.7.0_80/db/bin/
jdk1.7.0_80/db/bin/setNetworkClientCP.bat
jdk1.7.0_80/db/bin/dblook
jdk1.7.0_80/db/bin/NetworkServerControl
jdk1.7.0_80/db/bin/setEmbeddedCP
jdk1.7.0_80/db/bin/stopNetworkServer.bat
jdk1.7.0_80/db/bin/NetworkServerControl.bat
jdk1.7.0_80/db/bin/sysinfo
jdk1.7.0_80/db/bin/ij
jdk1.7.0_80/db/bin/setNetworkServerCP
jdk1.7.0_80/db/bin/setEmbeddedCP.bat
jdk1.7.0_80/db/bin/ij.bat
jdk1.7.0_80/db/bin/dblook.bat
jdk1.7.0_80/db/bin/sysinfo.bat
jdk1.7.0_80/db/bin/setNetworkClientCP
jdk1.7.0_80/db/bin/derby_common.bat
jdk1.7.0_80/db/bin/startNetworkServer.bat
jdk1.7.0_80/db/bin/startNetworkServer
jdk1.7.0_80/db/bin/setNetworkServerCP.bat
jdk1.7.0_80/db/bin/stopNetworkServer
jdk1.7.0_80/db/README-JDK.html
jdk1.7.0_80/db/NOTICE
jdk1.7.0_80/README.html
jdk1.7.0_80/THIRDPARTYLICENSEREADME.txt
Building remotely on jenkins-ubuntu-1404-4gb-bb9 (jenkins-cloud-4GB cloud-slave Ubuntu ubuntu)
in workspace <https://builds.apache.org/job/DeltaSpike%20Weld%202.1.0/ws/>
Cloning the remote Git repository
Cloning repository https://git-wip-us.apache.org/repos/asf/deltaspike.git
 > git init <https://builds.apache.org/job/DeltaSpike%20Weld%202.1.0/ws/> # timeout=10
Fetching upstream changes from https://git-wip-us.apache.org/repos/asf/deltaspike.git
 > git --version # timeout=10
 > git -c core.askpass=true fetch --tags --progress https://git-wip-us.apache.org/repos/asf/deltaspike.git
+refs/heads/*:refs/remotes/origin/*
 > git config remote.origin.url https://git-wip-us.apache.org/repos/asf/deltaspike.git
# timeout=10
 > git config --add remote.origin.fetch +refs/heads/*:refs/remotes/origin/* # timeout=10
 > git config remote.origin.url https://git-wip-us.apache.org/repos/asf/deltaspike.git
# timeout=10
Fetching upstream changes from https://git-wip-us.apache.org/repos/asf/deltaspike.git
 > git -c core.askpass=true fetch --tags --progress https://git-wip-us.apache.org/repos/asf/deltaspike.git
+refs/heads/*:refs/remotes/origin/*
 > git rev-parse origin/master^{commit} # timeout=10
Checking out Revision bbd5fa8b24a08f0c0cda8e0dca61403872a00594 (origin/master)
 > git config core.sparsecheckout # timeout=10
 > git checkout -f bbd5fa8b24a08f0c0cda8e0dca61403872a00594
 > git rev-list ada7480c8ee145298d871cc071cfa0c5dfdc9135 # timeout=10
Parsing POMs
Downloaded artifact http://repo.maven.apache.org/maven2/org/apache/apache/14/apache-14.pom
Failed to transfer Could not find artifact org.jboss.arquillian:arquillian-bom:pom:1.1.8.Final
in Apache Repository (https://repository.apache.org/content/repositories/releases)
Failed to transfer Could not find artifact org.jboss.arquillian:arquillian-bom:pom:1.1.8.Final
in Apache Snapshot Repository (https://repository.apache.org/content/repositories/snapshots)
Downloaded artifact http://repo.maven.apache.org/maven2/org/jboss/arquillian/arquillian-bom/1.1.8.Final/arquillian-bom-1.1.8.Final.pom
Failed to transfer Could not find artifact org.jboss.shrinkwrap:shrinkwrap-bom:pom:1.2.2 in
Apache Repository (https://repository.apache.org/content/repositories/releases)
Failed to transfer Could not find artifact org.jboss.shrinkwrap:shrinkwrap-bom:pom:1.2.2 in
Apache Snapshot Repository (https://repository.apache.org/content/repositories/snapshots)
Downloaded artifact http://repo.maven.apache.org/maven2/org/jboss/shrinkwrap/shrinkwrap-bom/1.2.2/shrinkwrap-bom-1.2.2.pom
Failed to transfer Could not find artifact org.jboss.shrinkwrap.resolver:shrinkwrap-resolver-bom:pom:2.1.1
in Apache Repository (https://repository.apache.org/content/repositories/releases)
Failed to transfer Could not find artifact org.jboss.shrinkwrap.resolver:shrinkwrap-resolver-bom:pom:2.1.1
in Apache Snapshot Repository (https://repository.apache.org/content/repositories/snapshots)
Downloaded artifact http://repo.maven.apache.org/maven2/org/jboss/shrinkwrap/resolver/shrinkwrap-resolver-bom/2.1.1/shrinkwrap-resolver-bom-2.1.1.pom
Failed to transfer Could not find artifact org.jboss.shrinkwrap.descriptors:shrinkwrap-descriptors-bom:pom:2.0.0-alpha-7
in Apache Repository (https://repository.apache.org/content/repositories/releases)
Failed to transfer Could not find artifact org.jboss.shrinkwrap.descriptors:shrinkwrap-descriptors-bom:pom:2.0.0-alpha-7
in Apache Snapshot Repository (https://repository.apache.org/content/repositories/snapshots)
Downloaded artifact http://repo.maven.apache.org/maven2/org/jboss/shrinkwrap/descriptors/shrinkwrap-descriptors-bom/2.0.0-alpha-7/shrinkwrap-descriptors-bom-2.0.0-alpha-7.pom
Failed to transfer Could not find artifact org.jboss.weld:weld-core-bom:pom:1.1.28.Final in
Apache Repository (https://repository.apache.org/content/repositories/releases)
Failed to transfer Could not find artifact org.jboss.weld:weld-core-bom:pom:1.1.28.Final in
Apache Snapshot Repository (https://repository.apache.org/content/repositories/snapshots)
Downloaded artifact http://repo.maven.apache.org/maven2/org/jboss/weld/weld-core-bom/1.1.28.Final/weld-core-bom-1.1.28.Final.pom
Failed to transfer Could not find artifact org.jboss.weld:weld-core-parent:pom:1.1.28.Final
in Apache Repository (https://repository.apache.org/content/repositories/releases)
Failed to transfer Could not find artifact org.jboss.weld:weld-core-parent:pom:1.1.28.Final
in Apache Snapshot Repository (https://repository.apache.org/content/repositories/snapshots)
Downloaded artifact http://repository.jboss.org/nexus/content/groups/public/org/jboss/weld/weld-core-parent/1.1.28.Final/weld-core-parent-1.1.28.Final.pom
Failed to transfer Could not find artifact org.jboss.weld:weld-parent:pom:21 in Apache Repository
(https://repository.apache.org/content/repositories/releases)
Failed to transfer Could not find artifact org.jboss.weld:weld-parent:pom:21 in Apache Snapshot
Repository (https://repository.apache.org/content/repositories/snapshots)
Downloaded artifact http://repository.jboss.org/nexus/content/groups/public/org/jboss/weld/weld-parent/21/weld-parent-21.pom
Failed to transfer Could not find artifact org.jboss.weld:weld-api-bom:pom:1.1.Final in Apache
Repository (https://repository.apache.org/content/repositories/releases)
Failed to transfer Could not find artifact org.jboss.weld:weld-api-bom:pom:1.1.Final in Apache
Snapshot Repository (https://repository.apache.org/content/repositories/snapshots)
Downloaded artifact http://repository.jboss.org/nexus/content/groups/public/org/jboss/weld/weld-api-bom/1.1.Final/weld-api-bom-1.1.Final.pom
Failed to transfer Could not find artifact org.jboss.weld:weld-parent:pom:17 in Apache Repository
(https://repository.apache.org/content/repositories/releases)
Failed to transfer Could not find artifact org.jboss.weld:weld-parent:pom:17 in Apache Snapshot
Repository (https://repository.apache.org/content/repositories/snapshots)
Downloaded artifact http://repository.jboss.org/nexus/content/groups/public/org/jboss/weld/weld-parent/17/weld-parent-17.pom
Failed to transfer Could not find artifact org.jboss.shrinkwrap.resolver:shrinkwrap-resolver-bom:pom:2.0.0
in Apache Repository (https://repository.apache.org/content/repositories/releases)
Failed to transfer Could not find artifact org.jboss.shrinkwrap.resolver:shrinkwrap-resolver-bom:pom:2.0.0
in Apache Snapshot Repository (https://repository.apache.org/content/repositories/snapshots)
Downloaded artifact http://repo.maven.apache.org/maven2/org/jboss/shrinkwrap/resolver/shrinkwrap-resolver-bom/2.0.0/shrinkwrap-resolver-bom-2.0.0.pom
Modules changed, recalculating dependency graph
Established TCP socket on 34545
Copied maven3-agent.jar
Copied maven3-interceptor.jar
Copied maven3-interceptor-commons.jar
[deltaspike] $ /jenkins/tools/hudson.model.JDK/JDK_1.7_latest_/bin/java -Xmx2g -Xms256m -XX:MaxPermSize=512m
-cp /jenkins/maven3-agent.jar:/home/jenkins/tools/maven/apache-maven-3.0.4/boot/plexus-classworlds-2.4.jar
org.jvnet.hudson.maven3.agent.Maven3Main /home/jenkins/tools/maven/apache-maven-3.0.4 /jenkins/slave.jar
/jenkins/maven3-interceptor.jar /jenkins/maven3-interceptor-commons.jar 34545
<===[JENKINS REMOTING CAPACITY]===>   channel started
Executing Maven:  -B -f <https://builds.apache.org/job/DeltaSpike%20Weld%202.1.0/ws/deltaspike/pom.xml>
-Dmaven.repo.local=/jenkins/maven-repositories/0 clean install -PWeld -Dweld.version=2.1.0.Final
[INFO] Scanning for projects...
Downloading: http://repo.maven.apache.org/maven2/org/apache/felix/maven-bundle-plugin/2.3.7/maven-bundle-plugin-2.3.7.pom
Downloading: https://repository.apache.org/content/repositories/releases/org/jboss/weld/weld-core-bom/2.1.0.Final/weld-core-bom-2.1.0.Final.pom
Downloading: https://repository.apache.org/content/repositories/snapshots/org/jboss/weld/weld-core-bom/2.1.0.Final/weld-core-bom-2.1.0.Final.pom
Downloading: http://repo.maven.apache.org/maven2/org/jboss/weld/weld-core-bom/2.1.0.Final/weld-core-bom-2.1.0.Final.pom
Downloaded: http://repo.maven.apache.org/maven2/org/jboss/weld/weld-core-bom/2.1.0.Final/weld-core-bom-2.1.0.Final.pom
(4 KB at 28.6 KB/sec)
Downloading: https://repository.apache.org/content/repositories/releases/org/jboss/weld/weld-core-parent/2.1.0.Final/weld-core-parent-2.1.0.Final.pom
Downloading: https://repository.apache.org/content/repositories/snapshots/org/jboss/weld/weld-core-parent/2.1.0.Final/weld-core-parent-2.1.0.Final.pom
Downloading: http://repo.maven.apache.org/maven2/org/jboss/weld/weld-core-parent/2.1.0.Final/weld-core-parent-2.1.0.Final.pom
Downloaded: http://repo.maven.apache.org/maven2/org/jboss/weld/weld-core-parent/2.1.0.Final/weld-core-parent-2.1.0.Final.pom
(23 KB at 534.3 KB/sec)
Downloading: https://repository.apache.org/content/repositories/releases/org/jboss/weld/weld-parent/26/weld-parent-26.pom
Downloading: https://repository.apache.org/content/repositories/snapshots/org/jboss/weld/weld-parent/26/weld-parent-26.pom
Downloading: http://repo.maven.apache.org/maven2/org/jboss/weld/weld-parent/26/weld-parent-26.pom
Downloaded: http://repo.maven.apache.org/maven2/org/jboss/weld/weld-parent/26/weld-parent-26.pom
(32 KB at 1127.5 KB/sec)
Downloading: https://repository.apache.org/content/repositories/releases/org/jboss/weld/weld-api-bom/2.1.Final/weld-api-bom-2.1.Final.pom
Downloading: https://repository.apache.org/content/repositories/snapshots/org/jboss/weld/weld-api-bom/2.1.Final/weld-api-bom-2.1.Final.pom
Downloading: http://repo.maven.apache.org/maven2/org/jboss/weld/weld-api-bom/2.1.Final/weld-api-bom-2.1.Final.pom
Downloaded: http://repo.maven.apache.org/maven2/org/jboss/weld/weld-api-bom/2.1.Final/weld-api-bom-2.1.Final.pom
(6 KB at 221.1 KB/sec)
Downloading: https://repository.apache.org/content/repositories/releases/org/jboss/weld/weld-parent/22/weld-parent-22.pom
Downloading: https://repository.apache.org/content/repositories/snapshots/org/jboss/weld/weld-parent/22/weld-parent-22.pom
Downloading: http://repo.maven.apache.org/maven2/org/jboss/weld/weld-parent/22/weld-parent-22.pom
Downloaded: http://repo.maven.apache.org/maven2/org/jboss/weld/weld-parent/22/weld-parent-22.pom
(33 KB at 1134.8 KB/sec)
[ERROR] The build could not read 6 projects -> [Help 1]
[ERROR]   
[ERROR]   The project org.apache.deltaspike:parent:1.5.2-SNAPSHOT (<https://builds.apache.org/job/DeltaSpike%20Weld%202.1.0/ws/deltaspike/parent/pom.xml)>
has 1 error
[ERROR]     Unresolveable build extension: Plugin org.apache.felix:maven-bundle-plugin:2.3.7
or one of its dependencies could not be resolved: Failed to collect dependencies for org.apache.felix:maven-bundle-plugin:jar:2.3.7
(): Failed to read artifact descriptor for org.apache.felix:maven-bundle-plugin:jar:2.3.7:
Could not transfer artifact org.apache.felix:maven-bundle-plugin:pom:2.3.7 from/to central
(http://repo.maven.apache.org/maven2): Connection to http://repo.maven.apache.org refused:
Connection timed out -> [Help 2]
[ERROR]   
[ERROR]   The project org.apache.deltaspike.test:test-utils:1.5.2-SNAPSHOT (<https://builds.apache.org/job/DeltaSpike%20Weld%202.1.0/ws/deltaspike/test-utils/pom.xml)>
has 1 error
[ERROR]     Unresolveable build extension: Plugin org.apache.felix:maven-bundle-plugin:2.3.7
or one of its dependencies could not be resolved: Failed to collect dependencies for org.apache.felix:maven-bundle-plugin:jar:2.3.7
(): Failed to read artifact descriptor for org.apache.felix:maven-bundle-plugin:jar:2.3.7:
Could not transfer artifact org.apache.felix:maven-bundle-plugin:pom:2.3.7 from/to central
(http://repo.maven.apache.org/maven2): Connection to http://repo.maven.apache.org refused:
Connection timed out -> [Help 2]
[ERROR]   
[ERROR]   The project org.apache.deltaspike.core:core-project:1.5.2-SNAPSHOT (<https://builds.apache.org/job/DeltaSpike%20Weld%202.1.0/ws/deltaspike/core/pom.xml)>
has 1 error
[ERROR]     Unresolveable build extension: Plugin org.apache.felix:maven-bundle-plugin:2.3.7
or one of its dependencies could not be resolved: Failed to collect dependencies for org.apache.felix:maven-bundle-plugin:jar:2.3.7
(): Failed to read artifact descriptor for org.apache.felix:maven-bundle-plugin:jar:2.3.7:
Could not transfer artifact org.apache.felix:maven-bundle-plugin:pom:2.3.7 from/to central
(http://repo.maven.apache.org/maven2): Connection to http://repo.maven.apache.org refused:
Connection timed out -> [Help 2]
[ERROR]   
[ERROR]   The project org.apache.deltaspike.cdictrl:cdictrl-project:1.5.2-SNAPSHOT (<https://builds.apache.org/job/DeltaSpike%20Weld%202.1.0/ws/deltaspike/cdictrl/pom.xml)>
has 1 error
[ERROR]     Unresolveable build extension: Plugin org.apache.felix:maven-bundle-plugin:2.3.7
or one of its dependencies could not be resolved: Failed to collect dependencies for org.apache.felix:maven-bundle-plugin:jar:2.3.7
(): Failed to read artifact descriptor for org.apache.felix:maven-bundle-plugin:jar:2.3.7:
Could not transfer artifact org.apache.felix:maven-bundle-plugin:pom:2.3.7 from/to central
(http://repo.maven.apache.org/maven2): Connection to http://repo.maven.apache.org refused:
Connection timed out -> [Help 2]
[ERROR]   
[ERROR]   The project org.apache.deltaspike.modules:modules-project:1.5.2-SNAPSHOT (<https://builds.apache.org/job/DeltaSpike%20Weld%202.1.0/ws/deltaspike/modules/pom.xml)>
has 1 error
[ERROR]     Unresolveable build extension: Plugin org.apache.felix:maven-bundle-plugin:2.3.7
or one of its dependencies could not be resolved: Failed to collect dependencies for org.apache.felix:maven-bundle-plugin:jar:2.3.7
(): Failed to read artifact descriptor for org.apache.felix:maven-bundle-plugin:jar:2.3.7:
Could not transfer artifact org.apache.felix:maven-bundle-plugin:pom:2.3.7 from/to central
(http://repo.maven.apache.org/maven2): Connection to http://repo.maven.apache.org refused:
Connection timed out -> [Help 2]
[ERROR]   
[ERROR]   The project org.apache.deltaspike.examples:examples-project:1.5.2-SNAPSHOT (<https://builds.apache.org/job/DeltaSpike%20Weld%202.1.0/ws/deltaspike/examples/pom.xml)>
has 1 error
[ERROR]     Unresolveable build extension: Plugin org.apache.felix:maven-bundle-plugin:2.3.7
or one of its dependencies could not be resolved: Failed to collect dependencies for org.apache.felix:maven-bundle-plugin:jar:2.3.7
(): Failed to read artifact descriptor for org.apache.felix:maven-bundle-plugin:jar:2.3.7:
Could not transfer artifact org.apache.felix:maven-bundle-plugin:pom:2.3.7 from/to central
(http://repo.maven.apache.org/maven2): Connection to http://repo.maven.apache.org refused:
Connection timed out -> [Help 2]
[ERROR] 
[ERROR] To see the full stack trace of the errors, re-run Maven with the -e switch.
[ERROR] Re-run Maven using the -X switch to enable full debug logging.
[ERROR] 
[ERROR] For more information about the errors and possible solutions, please read the following
articles:
[ERROR] [Help 1] http://cwiki.apache.org/confluence/display/MAVEN/ProjectBuildingException
[ERROR] [Help 2] http://cwiki.apache.org/confluence/display/MAVEN/PluginResolutionException
channel stopped

Mime
View raw message