deltaspike-commits mailing list archives

Site index · List index
Message view « Date » · « Thread »
Top « Date » · « Thread »
From Apache Jenkins Server <jenk...@builds.apache.org>
Subject Build failed in Jenkins: DeltaSpike OWB 1.6.1 #3
Date Fri, 16 Oct 2015 19:37:46 GMT
See <https://builds.apache.org/job/DeltaSpike%20OWB%201.6.1/3/changes>

Changes:

[gpetracek] DELTASPIKE-1003 support for @Produces in partial-beans

------------------------------------------
[...truncated 285 lines...]
Audit done.

[INFO] 
[INFO] --- maven-install-plugin:2.5.1:install (default-install) @ test-utils ---
[INFO] Installing <https://builds.apache.org/job/DeltaSpike%20OWB%201.6.1/ws/deltaspike/test-utils/target/test-utils-1.5.1-SNAPSHOT.jar>
to /home/jenkins/jenkins-slave/maven-repositories/1/org/apache/deltaspike/test/test-utils/1.5.1-SNAPSHOT/test-utils-1.5.1-SNAPSHOT.jar
[INFO] Installing <https://builds.apache.org/job/DeltaSpike%20OWB%201.6.1/ws/deltaspike/test-utils/pom.xml>
to /home/jenkins/jenkins-slave/maven-repositories/1/org/apache/deltaspike/test/test-utils/1.5.1-SNAPSHOT/test-utils-1.5.1-SNAPSHOT.pom
[INFO] Installing <https://builds.apache.org/job/DeltaSpike%20OWB%201.6.1/ws/deltaspike/test-utils/target/test-utils-1.5.1-SNAPSHOT-sources.jar>
to /home/jenkins/jenkins-slave/maven-repositories/1/org/apache/deltaspike/test/test-utils/1.5.1-SNAPSHOT/test-utils-1.5.1-SNAPSHOT-sources.jar
[INFO]                                                                         
[INFO] ------------------------------------------------------------------------
[INFO] Building Apache DeltaSpike Code Parent 1.5.1-SNAPSHOT
[INFO] ------------------------------------------------------------------------
Downloading: https://repository.apache.org/content/repositories/releases/org/apache/geronimo/specs/geronimo-annotation_1.2_spec/1.0.MR2-SNAPSHOT/maven-metadata.xml
Downloading: http://repository.apache.org/snapshots/org/apache/geronimo/specs/geronimo-annotation_1.2_spec/1.0.MR2-SNAPSHOT/maven-metadata.xml
Downloading: https://repository.apache.org/content/repositories/snapshots/org/apache/geronimo/specs/geronimo-annotation_1.2_spec/1.0.MR2-SNAPSHOT/maven-metadata.xml
Downloaded: http://repository.apache.org/snapshots/org/apache/geronimo/specs/geronimo-annotation_1.2_spec/1.0.MR2-SNAPSHOT/maven-metadata.xml
(2 KB at 3.9 KB/sec)
Downloaded: https://repository.apache.org/content/repositories/snapshots/org/apache/geronimo/specs/geronimo-annotation_1.2_spec/1.0.MR2-SNAPSHOT/maven-metadata.xml
(2 KB at 2.1 KB/sec)
Downloading: https://repository.apache.org/content/repositories/snapshots/org/apache/openwebbeans/openwebbeans-impl/1.6.1-SNAPSHOT/maven-metadata.xml
Downloading: http://repository.apache.org/snapshots/org/apache/openwebbeans/openwebbeans-impl/1.6.1-SNAPSHOT/maven-metadata.xml
Downloading: https://repository.apache.org/content/repositories/releases/org/apache/openwebbeans/openwebbeans-impl/1.6.1-SNAPSHOT/maven-metadata.xml
Downloading: https://repository.apache.org/content/repositories/releases/org/apache/openwebbeans/openwebbeans-impl/1.6.1-SNAPSHOT/openwebbeans-impl-1.6.1-SNAPSHOT.pom
Downloading: https://repository.apache.org/content/repositories/snapshots/org/apache/openwebbeans/openwebbeans-impl/1.6.1-SNAPSHOT/openwebbeans-impl-1.6.1-SNAPSHOT.pom
Downloading: http://repository.apache.org/snapshots/org/apache/openwebbeans/openwebbeans-impl/1.6.1-SNAPSHOT/openwebbeans-impl-1.6.1-SNAPSHOT.pom
[WARNING] The POM for org.apache.openwebbeans:openwebbeans-impl:jar:1.6.1-SNAPSHOT is missing,
no dependency information available
Downloading: https://repository.apache.org/content/repositories/releases/org/apache/openwebbeans/openwebbeans-spi/1.6.1-SNAPSHOT/maven-metadata.xml
Downloading: https://repository.apache.org/content/repositories/snapshots/org/apache/openwebbeans/openwebbeans-spi/1.6.1-SNAPSHOT/maven-metadata.xml
Downloading: http://repository.apache.org/snapshots/org/apache/openwebbeans/openwebbeans-spi/1.6.1-SNAPSHOT/maven-metadata.xml
Downloading: https://repository.apache.org/content/repositories/releases/org/apache/openwebbeans/openwebbeans-spi/1.6.1-SNAPSHOT/openwebbeans-spi-1.6.1-SNAPSHOT.pom
Downloading: https://repository.apache.org/content/repositories/snapshots/org/apache/openwebbeans/openwebbeans-spi/1.6.1-SNAPSHOT/openwebbeans-spi-1.6.1-SNAPSHOT.pom
Downloading: http://repository.apache.org/snapshots/org/apache/openwebbeans/openwebbeans-spi/1.6.1-SNAPSHOT/openwebbeans-spi-1.6.1-SNAPSHOT.pom
[WARNING] The POM for org.apache.openwebbeans:openwebbeans-spi:jar:1.6.1-SNAPSHOT is missing,
no dependency information available
Downloading: https://repository.apache.org/content/repositories/releases/org/apache/openwebbeans/openwebbeans-resource/1.6.1-SNAPSHOT/maven-metadata.xml
Downloading: https://repository.apache.org/content/repositories/snapshots/org/apache/openwebbeans/openwebbeans-resource/1.6.1-SNAPSHOT/maven-metadata.xml
Downloading: http://repository.apache.org/snapshots/org/apache/openwebbeans/openwebbeans-resource/1.6.1-SNAPSHOT/maven-metadata.xml
Downloading: https://repository.apache.org/content/repositories/releases/org/apache/openwebbeans/openwebbeans-resource/1.6.1-SNAPSHOT/openwebbeans-resource-1.6.1-SNAPSHOT.pom
Downloading: https://repository.apache.org/content/repositories/snapshots/org/apache/openwebbeans/openwebbeans-resource/1.6.1-SNAPSHOT/openwebbeans-resource-1.6.1-SNAPSHOT.pom
Downloading: http://repository.apache.org/snapshots/org/apache/openwebbeans/openwebbeans-resource/1.6.1-SNAPSHOT/openwebbeans-resource-1.6.1-SNAPSHOT.pom
[WARNING] The POM for org.apache.openwebbeans:openwebbeans-resource:jar:1.6.1-SNAPSHOT is
missing, no dependency information available
Downloading: https://repository.apache.org/content/repositories/releases/org/apache/openwebbeans/arquillian/owb-arquillian-standalone/1.6.1-SNAPSHOT/maven-metadata.xml
Downloading: https://repository.apache.org/content/repositories/snapshots/org/apache/openwebbeans/arquillian/owb-arquillian-standalone/1.6.1-SNAPSHOT/maven-metadata.xml
Downloading: http://repository.apache.org/snapshots/org/apache/openwebbeans/arquillian/owb-arquillian-standalone/1.6.1-SNAPSHOT/maven-metadata.xml
Downloading: https://repository.apache.org/content/repositories/releases/org/apache/openwebbeans/arquillian/owb-arquillian-standalone/1.6.1-SNAPSHOT/owb-arquillian-standalone-1.6.1-SNAPSHOT.pom
Downloading: https://repository.apache.org/content/repositories/snapshots/org/apache/openwebbeans/arquillian/owb-arquillian-standalone/1.6.1-SNAPSHOT/owb-arquillian-standalone-1.6.1-SNAPSHOT.pom
Downloading: http://repository.apache.org/snapshots/org/apache/openwebbeans/arquillian/owb-arquillian-standalone/1.6.1-SNAPSHOT/owb-arquillian-standalone-1.6.1-SNAPSHOT.pom
[WARNING] The POM for org.apache.openwebbeans.arquillian:owb-arquillian-standalone:jar:1.6.1-SNAPSHOT
is missing, no dependency information available
Downloading: https://repository.apache.org/content/repositories/releases/org/apache/openwebbeans/openwebbeans-impl/1.6.1-SNAPSHOT/openwebbeans-impl-1.6.1-SNAPSHOT.jar
Downloading: https://repository.apache.org/content/repositories/releases/org/apache/openwebbeans/openwebbeans-spi/1.6.1-SNAPSHOT/openwebbeans-spi-1.6.1-SNAPSHOT.jar
Downloading: https://repository.apache.org/content/repositories/releases/org/apache/openwebbeans/openwebbeans-resource/1.6.1-SNAPSHOT/openwebbeans-resource-1.6.1-SNAPSHOT.jar
Downloading: https://repository.apache.org/content/repositories/releases/org/apache/openwebbeans/arquillian/owb-arquillian-standalone/1.6.1-SNAPSHOT/owb-arquillian-standalone-1.6.1-SNAPSHOT.jar
Downloading: https://repository.apache.org/content/repositories/snapshots/org/apache/openwebbeans/openwebbeans-impl/1.6.1-SNAPSHOT/openwebbeans-impl-1.6.1-SNAPSHOT.jar
Downloading: https://repository.apache.org/content/repositories/snapshots/org/apache/openwebbeans/openwebbeans-spi/1.6.1-SNAPSHOT/openwebbeans-spi-1.6.1-SNAPSHOT.jar
Downloading: https://repository.apache.org/content/repositories/snapshots/org/apache/openwebbeans/openwebbeans-resource/1.6.1-SNAPSHOT/openwebbeans-resource-1.6.1-SNAPSHOT.jar
Downloading: https://repository.apache.org/content/repositories/snapshots/org/apache/openwebbeans/arquillian/owb-arquillian-standalone/1.6.1-SNAPSHOT/owb-arquillian-standalone-1.6.1-SNAPSHOT.jar
Downloading: http://repository.apache.org/snapshots/org/apache/openwebbeans/openwebbeans-impl/1.6.1-SNAPSHOT/openwebbeans-impl-1.6.1-SNAPSHOT.jar
Downloading: http://repository.apache.org/snapshots/org/apache/openwebbeans/openwebbeans-spi/1.6.1-SNAPSHOT/openwebbeans-spi-1.6.1-SNAPSHOT.jar
Downloading: http://repository.apache.org/snapshots/org/apache/openwebbeans/arquillian/owb-arquillian-standalone/1.6.1-SNAPSHOT/owb-arquillian-standalone-1.6.1-SNAPSHOT.jar
Downloading: http://repository.apache.org/snapshots/org/apache/openwebbeans/openwebbeans-resource/1.6.1-SNAPSHOT/openwebbeans-resource-1.6.1-SNAPSHOT.jar
[INFO] ------------------------------------------------------------------------
[INFO] Reactor Summary:
[INFO] 
[INFO] Apache DeltaSpike ................................. SUCCESS [5.443s]
[INFO] Apache DeltaSpike Sources ......................... SUCCESS [0.975s]
[INFO] Apache DeltaSpike CheckStyle-rules ................ SUCCESS [2.011s]
[INFO] Apache DeltaSpike Parent .......................... SUCCESS [9.522s]
[INFO] Apache DeltaSpike Test-Utils ...................... SUCCESS [9.241s]
[INFO] Apache DeltaSpike Code Parent ..................... FAILURE [3.119s]
[INFO] Apache DeltaSpike Core ............................ SKIPPED
[INFO] Apache DeltaSpike Core-API ........................ SKIPPED
[INFO] Apache DeltaSpike Core-Implementation ............. SKIPPED
[INFO] Apache DeltaSpike ContainerControl parent ......... SKIPPED
[INFO] Apache DeltaSpike CDI ContainerControl API ........ SKIPPED
[INFO] Apache DeltaSpike CDI ContainerControl TCK ........ SKIPPED
[INFO] Apache DeltaSpike CDI OWB-ContainerControl ........ SKIPPED
[INFO] Apache DeltaSpike CDI Weld-ContainerControl ....... SKIPPED
[INFO] Apache DeltaSpike CDI OpenEJB-ContainerControl .... SKIPPED
[INFO] Apache DeltaSpike CDI Servlet-ContainerControl .... SKIPPED
[INFO] Apache DeltaSpike Modules ......................... SKIPPED
[INFO] Apache DeltaSpike Proxy-Module .................... SKIPPED
[INFO] Apache DeltaSpike Proxy-Module API ................ SKIPPED
[INFO] Apache DeltaSpike Proxy-Module Impl ASM5 .......... SKIPPED
[INFO] Apache DeltaSpike Security-Module ................. SKIPPED
[INFO] Apache DeltaSpike Security-Module API ............. SKIPPED
[INFO] Apache DeltaSpike Security-Module Impl ............ SKIPPED
[INFO] Apache DeltaSpike JPA-Module ...................... SKIPPED
[INFO] Apache DeltaSpike JPA-Module API .................. SKIPPED
[INFO] Apache DeltaSpike JPA-Module Impl ................. SKIPPED
[INFO] Apache DeltaSpike Servlet-Module .................. SKIPPED
[INFO] Apache DeltaSpike Servlet-Module API .............. SKIPPED
[INFO] Apache DeltaSpike Servlet-Module Impl ............. SKIPPED
[INFO] Apache DeltaSpike JSF-Module ...................... SKIPPED
[INFO] Apache DeltaSpike JSF-Module API .................. SKIPPED
[INFO] Apache DeltaSpike JSF-Module Impl ................. SKIPPED
[INFO] Apache DeltaSpike JSF-Module Impl (EE6 only) ...... SKIPPED
[INFO] Apache DeltaSpike Partial-Bean-Module ............. SKIPPED
[INFO] Apache DeltaSpike Partial-Bean-Module API ......... SKIPPED
[INFO] Apache DeltaSpike Partial-Bean-Module Impl ........ SKIPPED
[INFO] Apache DeltaSpike BeanValidation-Module ........... SKIPPED
[INFO] Apache DeltaSpike BeanValidation-Module API ....... SKIPPED
[INFO] Apache DeltaSpike BeanValidation-Module Impl ...... SKIPPED
[INFO] Apache DeltaSpike Data-Module ..................... SKIPPED
[INFO] Apache DeltaSpike Data-Module API ................. SKIPPED
[INFO] Apache DeltaSpike Data-Module Impl ................ SKIPPED
[INFO] Apache DeltaSpike Scheduler-Module ................ SKIPPED
[INFO] Apache DeltaSpike Scheduler-Module API ............ SKIPPED
[INFO] Apache DeltaSpike Scheduler-Module Impl ........... SKIPPED
[INFO] Apache DeltaSpike Test-Control-Module ............. SKIPPED
[INFO] Apache DeltaSpike Test-Control-Module API ......... SKIPPED
[INFO] Apache DeltaSpike Test-Control-Module Impl ........ SKIPPED
[INFO] Apache DeltaSpike Examples ........................ SKIPPED
[INFO] Apache DeltaSpike Java-SE Examples ................ SKIPPED
[INFO] Apache DeltaSpike JSF Examples .................... SKIPPED
[INFO] Apache DeltaSpike JSF Playground .................. SKIPPED
[INFO] Apache DeltaSpike Security Example CDI ............ SKIPPED
[INFO] Apache DeltaSpike Security Example PicketLink ..... SKIPPED
[INFO] Apache DeltaSpike Java-SE Scheduler Examples ...... SKIPPED
[INFO] Apache DeltaSpike Documentation ................... SKIPPED
[INFO] Apache DeltaSpike Site ............................ SKIPPED
[INFO] ------------------------------------------------------------------------
[INFO] BUILD FAILURE
[INFO] ------------------------------------------------------------------------
[INFO] Total time: 42.532s
[INFO] Finished at: Fri Oct 16 19:37:18 UTC 2015
[INFO] Final Memory: 45M/422M
[INFO] ------------------------------------------------------------------------
Waiting for Jenkins to finish collecting data
[ERROR] Failed to execute goal on project parent-code: Could not resolve dependencies for
project org.apache.deltaspike:parent-code:pom:1.5.1-SNAPSHOT: The following artifacts could
not be resolved: org.apache.openwebbeans:openwebbeans-impl:jar:1.6.1-SNAPSHOT, org.apache.openwebbeans:openwebbeans-spi:jar:1.6.1-SNAPSHOT,
org.apache.openwebbeans:openwebbeans-resource:jar:1.6.1-SNAPSHOT, org.apache.openwebbeans.arquillian:owb-arquillian-standalone:jar:1.6.1-SNAPSHOT:
Could not find artifact org.apache.openwebbeans:openwebbeans-impl:jar:1.6.1-SNAPSHOT in Apache
Repository (https://repository.apache.org/content/repositories/releases) -> [Help 1]
[ERROR] 
[ERROR] To see the full stack trace of the errors, re-run Maven with the -e switch.
[ERROR] Re-run Maven using the -X switch to enable full debug logging.
[ERROR] 
[ERROR] For more information about the errors and possible solutions, please read the following
articles:
[ERROR] [Help 1] http://cwiki.apache.org/confluence/display/MAVEN/DependencyResolutionException
[ERROR] 
[ERROR] After correcting the problems, you can resume the build with the command
[ERROR]   mvn <goals> -rf :parent-code
[JENKINS] Archiving <https://builds.apache.org/job/DeltaSpike%20OWB%201.6.1/ws/deltaspike/examples/jse-examples/pom.xml>
to org.apache.deltaspike.examples/deltaspike-jse-example/1.5.1-SNAPSHOT/deltaspike-jse-example-1.5.1-SNAPSHOT.pom
No prior successful build to compare, so performing full copy of artifacts
[JENKINS] Archiving <https://builds.apache.org/job/DeltaSpike%20OWB%201.6.1/ws/deltaspike/examples/security-requested-page-after-login-cdi/pom.xml>
to org.apache.deltaspike.examples/deltaspike-security-requested-page-after-login-cdi/1.5.1-SNAPSHOT/deltaspike-security-requested-page-after-login-cdi-1.5.1-SNAPSHOT.pom
No prior successful build to compare, so performing full copy of artifacts
[JENKINS] Archiving <https://builds.apache.org/job/DeltaSpike%20OWB%201.6.1/ws/deltaspike/test-utils/pom.xml>
to org.apache.deltaspike.test/test-utils/1.5.1-SNAPSHOT/test-utils-1.5.1-SNAPSHOT.pom
[JENKINS] Archiving <https://builds.apache.org/job/DeltaSpike%20OWB%201.6.1/ws/deltaspike/test-utils/target/test-utils-1.5.1-SNAPSHOT.jar>
to org.apache.deltaspike.test/test-utils/1.5.1-SNAPSHOT/test-utils-1.5.1-SNAPSHOT.jar
[JENKINS] Archiving <https://builds.apache.org/job/DeltaSpike%20OWB%201.6.1/ws/deltaspike/test-utils/target/test-utils-1.5.1-SNAPSHOT-sources.jar>
to org.apache.deltaspike.test/test-utils/1.5.1-SNAPSHOT/test-utils-1.5.1-SNAPSHOT-sources.jar
[JENKINS] Archiving <https://builds.apache.org/job/DeltaSpike%20OWB%201.6.1/ws/documentation/pom.xml>
to org.apache.deltaspike/deltaspike-documentation/1.5.1-SNAPSHOT/deltaspike-documentation-1.5.1-SNAPSHOT.pom
No prior successful build to compare, so performing full copy of artifacts
[JENKINS] Archiving <https://builds.apache.org/job/DeltaSpike%20OWB%201.6.1/ws/deltaspike/modules/data/impl/pom.xml>
to org.apache.deltaspike.modules/deltaspike-data-module-impl/1.5.1-SNAPSHOT/deltaspike-data-module-impl-1.5.1-SNAPSHOT.pom
No prior successful build to compare, so performing full copy of artifacts
[JENKINS] Archiving <https://builds.apache.org/job/DeltaSpike%20OWB%201.6.1/ws/deltaspike/modules/data/api/pom.xml>
to org.apache.deltaspike.modules/deltaspike-data-module-api/1.5.1-SNAPSHOT/deltaspike-data-module-api-1.5.1-SNAPSHOT.pom
No prior successful build to compare, so performing full copy of artifacts
[JENKINS] Archiving <https://builds.apache.org/job/DeltaSpike%20OWB%201.6.1/ws/deltaspike/core/impl/pom.xml>
to org.apache.deltaspike.core/deltaspike-core-impl/1.5.1-SNAPSHOT/deltaspike-core-impl-1.5.1-SNAPSHOT.pom
No prior successful build to compare, so performing full copy of artifacts
[JENKINS] Archiving <https://builds.apache.org/job/DeltaSpike%20OWB%201.6.1/ws/deltaspike/modules/pom.xml>
to org.apache.deltaspike.modules/modules-project/1.5.1-SNAPSHOT/modules-project-1.5.1-SNAPSHOT.pom
No prior successful build to compare, so performing full copy of artifacts
[JENKINS] Archiving <https://builds.apache.org/job/DeltaSpike%20OWB%201.6.1/ws/deltaspike/modules/test-control/pom.xml>
to org.apache.deltaspike.modules/test-control-module-project/1.5.1-SNAPSHOT/test-control-module-project-1.5.1-SNAPSHOT.pom
No prior successful build to compare, so performing full copy of artifacts
[JENKINS] Archiving <https://builds.apache.org/job/DeltaSpike%20OWB%201.6.1/ws/deltaspike/examples/jsf-examples/pom.xml>
to org.apache.deltaspike.examples/deltaspike-jsf-example/1.5.1-SNAPSHOT/deltaspike-jsf-example-1.5.1-SNAPSHOT.pom
No prior successful build to compare, so performing full copy of artifacts
[JENKINS] Archiving <https://builds.apache.org/job/DeltaSpike%20OWB%201.6.1/ws/deltaspike/cdictrl/servlet/pom.xml>
to org.apache.deltaspike.cdictrl/deltaspike-cdictrl-servlet/1.5.1-SNAPSHOT/deltaspike-cdictrl-servlet-1.5.1-SNAPSHOT.pom
No prior successful build to compare, so performing full copy of artifacts
[JENKINS] Archiving <https://builds.apache.org/job/DeltaSpike%20OWB%201.6.1/ws/deltaspike/cdictrl/api/pom.xml>
to org.apache.deltaspike.cdictrl/deltaspike-cdictrl-api/1.5.1-SNAPSHOT/deltaspike-cdictrl-api-1.5.1-SNAPSHOT.pom
No prior successful build to compare, so performing full copy of artifacts
[JENKINS] Archiving <https://builds.apache.org/job/DeltaSpike%20OWB%201.6.1/ws/deltaspike/examples/scheduler-playground/pom.xml>
to org.apache.deltaspike.examples/deltaspike-scheduler-example/1.5.1-SNAPSHOT/deltaspike-scheduler-example-1.5.1-SNAPSHOT.pom
No prior successful build to compare, so performing full copy of artifacts
[JENKINS] Archiving <https://builds.apache.org/job/DeltaSpike%20OWB%201.6.1/ws/deltaspike/checkstyle-rules/pom.xml>
to org.apache.deltaspike/checkstyle-rules/1.5.1-SNAPSHOT/checkstyle-rules-1.5.1-SNAPSHOT.pom
[JENKINS] Archiving <https://builds.apache.org/job/DeltaSpike%20OWB%201.6.1/ws/deltaspike/checkstyle-rules/target/checkstyle-rules-1.5.1-SNAPSHOT.jar>
to org.apache.deltaspike/checkstyle-rules/1.5.1-SNAPSHOT/checkstyle-rules-1.5.1-SNAPSHOT.jar
[JENKINS] Archiving <https://builds.apache.org/job/DeltaSpike%20OWB%201.6.1/ws/deltaspike/parent/code/pom.xml>
to org.apache.deltaspike/parent-code/1.5.1-SNAPSHOT/parent-code-1.5.1-SNAPSHOT.pom
No prior successful build to compare, so performing full copy of artifacts
[JENKINS] Archiving <https://builds.apache.org/job/DeltaSpike%20OWB%201.6.1/ws/deltaspike/modules/jsf/impl/pom.xml>
to org.apache.deltaspike.modules/deltaspike-jsf-module-impl/1.5.1-SNAPSHOT/deltaspike-jsf-module-impl-1.5.1-SNAPSHOT.pom
No prior successful build to compare, so performing full copy of artifacts
[JENKINS] Archiving <https://builds.apache.org/job/DeltaSpike%20OWB%201.6.1/ws/deltaspike/modules/partial-bean/pom.xml>
to org.apache.deltaspike.modules/partial-bean-module-project/1.5.1-SNAPSHOT/partial-bean-module-project-1.5.1-SNAPSHOT.pom
No prior successful build to compare, so performing full copy of artifacts
[JENKINS] Archiving <https://builds.apache.org/job/DeltaSpike%20OWB%201.6.1/ws/deltaspike/examples/pom.xml>
to org.apache.deltaspike.examples/examples-project/1.5.1-SNAPSHOT/examples-project-1.5.1-SNAPSHOT.pom
No prior successful build to compare, so performing full copy of artifacts
[JENKINS] Archiving <https://builds.apache.org/job/DeltaSpike%20OWB%201.6.1/ws/deltaspike/cdictrl/impl-openejb/pom.xml>
to org.apache.deltaspike.cdictrl/deltaspike-cdictrl-openejb/1.5.1-SNAPSHOT/deltaspike-cdictrl-openejb-1.5.1-SNAPSHOT.pom
No prior successful build to compare, so performing full copy of artifacts
[JENKINS] Archiving <https://builds.apache.org/job/DeltaSpike%20OWB%201.6.1/ws/deltaspike/modules/jsf/pom.xml>
to org.apache.deltaspike.modules/jsf-module-project/1.5.1-SNAPSHOT/jsf-module-project-1.5.1-SNAPSHOT.pom
No prior successful build to compare, so performing full copy of artifacts
[JENKINS] Archiving <https://builds.apache.org/job/DeltaSpike%20OWB%201.6.1/ws/deltaspike/cdictrl/tck/pom.xml>
to org.apache.deltaspike.test/deltaspike-cdictrl-tck/1.5.1-SNAPSHOT/deltaspike-cdictrl-tck-1.5.1-SNAPSHOT.pom
No prior successful build to compare, so performing full copy of artifacts
[JENKINS] Archiving <https://builds.apache.org/job/DeltaSpike%20OWB%201.6.1/ws/deltaspike/modules/jsf/api/pom.xml>
to org.apache.deltaspike.modules/deltaspike-jsf-module-api/1.5.1-SNAPSHOT/deltaspike-jsf-module-api-1.5.1-SNAPSHOT.pom
No prior successful build to compare, so performing full copy of artifacts
[JENKINS] Archiving <https://builds.apache.org/job/DeltaSpike%20OWB%201.6.1/ws/deltaspike/modules/security/pom.xml>
to org.apache.deltaspike.modules/security-module-project/1.5.1-SNAPSHOT/security-module-project-1.5.1-SNAPSHOT.pom
No prior successful build to compare, so performing full copy of artifacts
[JENKINS] Archiving <https://builds.apache.org/job/DeltaSpike%20OWB%201.6.1/ws/deltaspike/modules/bean-validation/pom.xml>
to org.apache.deltaspike.modules/bean-validation-module-project/1.5.1-SNAPSHOT/bean-validation-module-project-1.5.1-SNAPSHOT.pom
No prior successful build to compare, so performing full copy of artifacts
[JENKINS] Archiving <https://builds.apache.org/job/DeltaSpike%20OWB%201.6.1/ws/deltaspike/modules/partial-bean/impl/pom.xml>
to org.apache.deltaspike.modules/deltaspike-partial-bean-module-impl/1.5.1-SNAPSHOT/deltaspike-partial-bean-module-impl-1.5.1-SNAPSHOT.pom
No prior successful build to compare, so performing full copy of artifacts
[JENKINS] Archiving <https://builds.apache.org/job/DeltaSpike%20OWB%201.6.1/ws/deltaspike/modules/proxy/api/pom.xml>
to org.apache.deltaspike.modules/deltaspike-proxy-module-api/1.5.1-SNAPSHOT/deltaspike-proxy-module-api-1.5.1-SNAPSHOT.pom
No prior successful build to compare, so performing full copy of artifacts
[JENKINS] Archiving <https://builds.apache.org/job/DeltaSpike%20OWB%201.6.1/ws/deltaspike/cdictrl/impl-weld/pom.xml>
to org.apache.deltaspike.cdictrl/deltaspike-cdictrl-weld/1.5.1-SNAPSHOT/deltaspike-cdictrl-weld-1.5.1-SNAPSHOT.pom
No prior successful build to compare, so performing full copy of artifacts
[JENKINS] Archiving <https://builds.apache.org/job/DeltaSpike%20OWB%201.6.1/ws/deltaspike/modules/jpa/api/pom.xml>
to org.apache.deltaspike.modules/deltaspike-jpa-module-api/1.5.1-SNAPSHOT/deltaspike-jpa-module-api-1.5.1-SNAPSHOT.pom
No prior successful build to compare, so performing full copy of artifacts
[JENKINS] Archiving <https://builds.apache.org/job/DeltaSpike%20OWB%201.6.1/ws/deltaspike/modules/servlet/api/pom.xml>
to org.apache.deltaspike.modules/deltaspike-servlet-module-api/1.5.1-SNAPSHOT/deltaspike-servlet-module-api-1.5.1-SNAPSHOT.pom
No prior successful build to compare, so performing full copy of artifacts
[JENKINS] Archiving <https://builds.apache.org/job/DeltaSpike%20OWB%201.6.1/ws/deltaspike/modules/jpa/pom.xml>
to org.apache.deltaspike.modules/jpa-module-project/1.5.1-SNAPSHOT/jpa-module-project-1.5.1-SNAPSHOT.pom
No prior successful build to compare, so performing full copy of artifacts
[JENKINS] Archiving <https://builds.apache.org/job/DeltaSpike%20OWB%201.6.1/ws/deltaspike/cdictrl/pom.xml>
to org.apache.deltaspike.cdictrl/cdictrl-project/1.5.1-SNAPSHOT/cdictrl-project-1.5.1-SNAPSHOT.pom
No prior successful build to compare, so performing full copy of artifacts
[JENKINS] Archiving <https://builds.apache.org/job/DeltaSpike%20OWB%201.6.1/ws/deltaspike/modules/scheduler/api/pom.xml>
to org.apache.deltaspike.modules/deltaspike-scheduler-module-api/1.5.1-SNAPSHOT/deltaspike-scheduler-module-api-1.5.1-SNAPSHOT.pom
No prior successful build to compare, so performing full copy of artifacts
[JENKINS] Archiving <https://builds.apache.org/job/DeltaSpike%20OWB%201.6.1/ws/deltaspike/modules/test-control/impl/pom.xml>
to org.apache.deltaspike.modules/deltaspike-test-control-module-impl/1.5.1-SNAPSHOT/deltaspike-test-control-module-impl-1.5.1-SNAPSHOT.pom
No prior successful build to compare, so performing full copy of artifacts
[JENKINS] Archiving <https://builds.apache.org/job/DeltaSpike%20OWB%201.6.1/ws/deltaspike/modules/servlet/pom.xml>
to org.apache.deltaspike.modules/servlet-module-project/1.5.1-SNAPSHOT/servlet-module-project-1.5.1-SNAPSHOT.pom
No prior successful build to compare, so performing full copy of artifacts
[JENKINS] Archiving <https://builds.apache.org/job/DeltaSpike%20OWB%201.6.1/ws/deltaspike/modules/test-control/api/pom.xml>
to org.apache.deltaspike.modules/deltaspike-test-control-module-api/1.5.1-SNAPSHOT/deltaspike-test-control-module-api-1.5.1-SNAPSHOT.pom
No prior successful build to compare, so performing full copy of artifacts
[JENKINS] Archiving <https://builds.apache.org/job/DeltaSpike%20OWB%201.6.1/ws/deltaspike/modules/jsf/impl-ee6/pom.xml>
to org.apache.deltaspike.modules/deltaspike-jsf-module-impl-ee6/1.5.1-SNAPSHOT/deltaspike-jsf-module-impl-ee6-1.5.1-SNAPSHOT.pom
No prior successful build to compare, so performing full copy of artifacts
[JENKINS] Archiving <https://builds.apache.org/job/DeltaSpike%20OWB%201.6.1/ws/deltaspike/modules/proxy/pom.xml>
to org.apache.deltaspike.modules/proxy-module-project/1.5.1-SNAPSHOT/proxy-module-project-1.5.1-SNAPSHOT.pom
No prior successful build to compare, so performing full copy of artifacts
[JENKINS] Archiving <https://builds.apache.org/job/DeltaSpike%20OWB%201.6.1/ws/deltaspike/modules/partial-bean/api/pom.xml>
to org.apache.deltaspike.modules/deltaspike-partial-bean-module-api/1.5.1-SNAPSHOT/deltaspike-partial-bean-module-api-1.5.1-SNAPSHOT.pom
No prior successful build to compare, so performing full copy of artifacts
[JENKINS] Archiving <https://builds.apache.org/job/DeltaSpike%20OWB%201.6.1/ws/deltaspike/modules/scheduler/impl/pom.xml>
to org.apache.deltaspike.modules/deltaspike-scheduler-module-impl/1.5.1-SNAPSHOT/deltaspike-scheduler-module-impl-1.5.1-SNAPSHOT.pom
No prior successful build to compare, so performing full copy of artifacts
[JENKINS] Archiving <https://builds.apache.org/job/DeltaSpike%20OWB%201.6.1/ws/deltaspike/parent/pom.xml>
to org.apache.deltaspike/parent/1.5.1-SNAPSHOT/parent-1.5.1-SNAPSHOT.pom
Compressed 39.62 KB of artifacts by 80.8% relative to #2
[JENKINS] Archiving <https://builds.apache.org/job/DeltaSpike%20OWB%201.6.1/ws/deltaspike/core/pom.xml>
to org.apache.deltaspike.core/core-project/1.5.1-SNAPSHOT/core-project-1.5.1-SNAPSHOT.pom
No prior successful build to compare, so performing full copy of artifacts
[JENKINS] Archiving <https://builds.apache.org/job/DeltaSpike%20OWB%201.6.1/ws/deltaspike/modules/bean-validation/api/pom.xml>
to org.apache.deltaspike.modules/deltaspike-bean-validation-module-api/1.5.1-SNAPSHOT/deltaspike-bean-validation-module-api-1.5.1-SNAPSHOT.pom
No prior successful build to compare, so performing full copy of artifacts
[JENKINS] Archiving <https://builds.apache.org/job/DeltaSpike%20OWB%201.6.1/ws/deltaspike/core/api/pom.xml>
to org.apache.deltaspike.core/deltaspike-core-api/1.5.1-SNAPSHOT/deltaspike-core-api-1.5.1-SNAPSHOT.pom
No prior successful build to compare, so performing full copy of artifacts
[JENKINS] Archiving <https://builds.apache.org/job/DeltaSpike%20OWB%201.6.1/ws/deltaspike/modules/security/impl/pom.xml>
to org.apache.deltaspike.modules/deltaspike-security-module-impl/1.5.1-SNAPSHOT/deltaspike-security-module-impl-1.5.1-SNAPSHOT.pom
No prior successful build to compare, so performing full copy of artifacts
[JENKINS] Archiving <https://builds.apache.org/job/DeltaSpike%20OWB%201.6.1/ws/deltaspike/modules/scheduler/pom.xml>
to org.apache.deltaspike.modules/scheduler-module-project/1.5.1-SNAPSHOT/scheduler-module-project-1.5.1-SNAPSHOT.pom
No prior successful build to compare, so performing full copy of artifacts
[JENKINS] Archiving <https://builds.apache.org/job/DeltaSpike%20OWB%201.6.1/ws/site/pom.xml>
to org.apache.deltaspike/deltaspike-site/1.5.1-SNAPSHOT/deltaspike-site-1.5.1-SNAPSHOT.pom
No prior successful build to compare, so performing full copy of artifacts
[JENKINS] Archiving <https://builds.apache.org/job/DeltaSpike%20OWB%201.6.1/ws/deltaspike/modules/proxy/impl-asm5/pom.xml>
to org.apache.deltaspike.modules/deltaspike-proxy-module-impl-asm5/1.5.1-SNAPSHOT/deltaspike-proxy-module-impl-asm5-1.5.1-SNAPSHOT.pom
No prior successful build to compare, so performing full copy of artifacts
[JENKINS] Archiving <https://builds.apache.org/job/DeltaSpike%20OWB%201.6.1/ws/deltaspike/examples/jsf-playground/pom.xml>
to org.apache.deltaspike.examples/deltaspike-jsf-playground/1.5.1-SNAPSHOT/deltaspike-jsf-playground-1.5.1-SNAPSHOT.pom
No prior successful build to compare, so performing full copy of artifacts
[JENKINS] Archiving <https://builds.apache.org/job/DeltaSpike%20OWB%201.6.1/ws/deltaspike/modules/servlet/impl/pom.xml>
to org.apache.deltaspike.modules/deltaspike-servlet-module-impl/1.5.1-SNAPSHOT/deltaspike-servlet-module-impl-1.5.1-SNAPSHOT.pom
No prior successful build to compare, so performing full copy of artifacts
[JENKINS] Archiving <https://builds.apache.org/job/DeltaSpike%20OWB%201.6.1/ws/deltaspike/modules/bean-validation/impl/pom.xml>
to org.apache.deltaspike.modules/deltaspike-bean-validation-module-impl/1.5.1-SNAPSHOT/deltaspike-bean-validation-module-impl-1.5.1-SNAPSHOT.pom
No prior successful build to compare, so performing full copy of artifacts
[JENKINS] Archiving <https://builds.apache.org/job/DeltaSpike%20OWB%201.6.1/ws/deltaspike/cdictrl/impl-owb/pom.xml>
to org.apache.deltaspike.cdictrl/deltaspike-cdictrl-owb/1.5.1-SNAPSHOT/deltaspike-cdictrl-owb-1.5.1-SNAPSHOT.pom
No prior successful build to compare, so performing full copy of artifacts
[JENKINS] Archiving <https://builds.apache.org/job/DeltaSpike%20OWB%201.6.1/ws/pom.xml>
to org.apache.deltaspike/deltaspike/1.5.1-SNAPSHOT/deltaspike-1.5.1-SNAPSHOT.pom
[JENKINS] Archiving <https://builds.apache.org/job/DeltaSpike%20OWB%201.6.1/ws/deltaspike/modules/jpa/impl/pom.xml>
to org.apache.deltaspike.modules/deltaspike-jpa-module-impl/1.5.1-SNAPSHOT/deltaspike-jpa-module-impl-1.5.1-SNAPSHOT.pom
No prior successful build to compare, so performing full copy of artifacts
[JENKINS] Archiving <https://builds.apache.org/job/DeltaSpike%20OWB%201.6.1/ws/deltaspike/modules/data/pom.xml>
to org.apache.deltaspike.modules/data-module-project/1.5.1-SNAPSHOT/data-module-project-1.5.1-SNAPSHOT.pom
No prior successful build to compare, so performing full copy of artifacts
[JENKINS] Archiving <https://builds.apache.org/job/DeltaSpike%20OWB%201.6.1/ws/deltaspike/examples/security-requested-page-after-login-picketlink/pom.xml>
to org.apache.deltaspike.examples/deltaspike-security-requested-page-after-login-picketlink/1.5.1-SNAPSHOT/deltaspike-security-requested-page-after-login-picketlink-1.5.1-SNAPSHOT.pom
No prior successful build to compare, so performing full copy of artifacts
[JENKINS] Archiving <https://builds.apache.org/job/DeltaSpike%20OWB%201.6.1/ws/deltaspike/pom.xml>
to org.apache.deltaspike/deltaspike-project/1.5.1-SNAPSHOT/deltaspike-project-1.5.1-SNAPSHOT.pom
[JENKINS] Archiving <https://builds.apache.org/job/DeltaSpike%20OWB%201.6.1/ws/deltaspike/modules/security/api/pom.xml>
to org.apache.deltaspike.modules/deltaspike-security-module-api/1.5.1-SNAPSHOT/deltaspike-security-module-api-1.5.1-SNAPSHOT.pom
No prior successful build to compare, so performing full copy of artifacts
Sending e-mails to: commits@deltaspike.apache.org
channel stopped

Mime
View raw message