deltaspike-commits mailing list archives

Site index · List index
Message view « Date » · « Thread »
Top « Date » · « Thread »
From Apache Jenkins Server <jenk...@builds.apache.org>
Subject Build failed in Jenkins: DeltaSpike_Wildfly_8.2.1 #33
Date Sat, 31 Oct 2015 11:36:54 GMT
See <https://builds.apache.org/job/DeltaSpike_Wildfly_8.2.1/33/changes>

Changes:

[tandraschko] DELTASPIKE-1016 JSF documentation broken

------------------------------------------
[...truncated 482 lines...]
[INFO] Building jar: <https://builds.apache.org/job/DeltaSpike_Wildfly_8.2.1/ws/deltaspike/core/api/target/deltaspike-core-api-1.5.2-SNAPSHOT-sources.jar>
[INFO] 
[INFO] --- maven-checkstyle-plugin:2.9.1:check (verify-style) @ deltaspike-core-api ---
[INFO] Starting audit...
Audit done.

[INFO] 
[INFO] --- maven-install-plugin:2.5.1:install (default-install) @ deltaspike-core-api ---
[INFO] Installing <https://builds.apache.org/job/DeltaSpike_Wildfly_8.2.1/ws/deltaspike/core/api/target/deltaspike-core-api-1.5.2-SNAPSHOT.jar>
to /home/jenkins/jenkins-slave/maven-repositories/0/org/apache/deltaspike/core/deltaspike-core-api/1.5.2-SNAPSHOT/deltaspike-core-api-1.5.2-SNAPSHOT.jar
[INFO] Installing <https://builds.apache.org/job/DeltaSpike_Wildfly_8.2.1/ws/deltaspike/core/api/pom.xml>
to /home/jenkins/jenkins-slave/maven-repositories/0/org/apache/deltaspike/core/deltaspike-core-api/1.5.2-SNAPSHOT/deltaspike-core-api-1.5.2-SNAPSHOT.pom
[INFO] Installing <https://builds.apache.org/job/DeltaSpike_Wildfly_8.2.1/ws/deltaspike/core/api/target/deltaspike-core-api-1.5.2-SNAPSHOT-tests.jar>
to /home/jenkins/jenkins-slave/maven-repositories/0/org/apache/deltaspike/core/deltaspike-core-api/1.5.2-SNAPSHOT/deltaspike-core-api-1.5.2-SNAPSHOT-tests.jar
[INFO] Installing <https://builds.apache.org/job/DeltaSpike_Wildfly_8.2.1/ws/deltaspike/core/api/target/deltaspike-core-api-1.5.2-SNAPSHOT-sources.jar>
to /home/jenkins/jenkins-slave/maven-repositories/0/org/apache/deltaspike/core/deltaspike-core-api/1.5.2-SNAPSHOT/deltaspike-core-api-1.5.2-SNAPSHOT-sources.jar
[INFO] 
[INFO] --- maven-bundle-plugin:2.3.7:install (default-install) @ deltaspike-core-api ---
[INFO] Installing org/apache/deltaspike/core/deltaspike-core-api/1.5.2-SNAPSHOT/deltaspike-core-api-1.5.2-SNAPSHOT.jar
[INFO] Writing OBR metadata
[INFO]                                                                         
[INFO] ------------------------------------------------------------------------
[INFO] Building Apache DeltaSpike Core-Implementation 1.5.2-SNAPSHOT
[INFO] ------------------------------------------------------------------------
[INFO] 
[INFO] --- maven-clean-plugin:2.5:clean (default-clean) @ deltaspike-core-impl ---
[INFO] Deleting <https://builds.apache.org/job/DeltaSpike_Wildfly_8.2.1/ws/deltaspike/core/impl/target>
[INFO] 
[INFO] --- maven-bundle-plugin:2.3.7:cleanVersions (versions) @ deltaspike-core-impl ---
[INFO] 
[INFO] --- maven-antrun-plugin:1.7:run (javadoc.resources) @ deltaspike-core-impl ---
[WARNING] Parameter tasks is deprecated, use target instead
[INFO] Executing tasks

main:
[INFO] Executed tasks
[INFO] 
[INFO] --- maven-remote-resources-plugin:1.5:process (default) @ deltaspike-core-impl ---
[INFO] 
[INFO] --- maven-resources-plugin:2.6:resources (default-resources) @ deltaspike-core-impl
---
[INFO] Using 'UTF-8' encoding to copy filtered resources.
[INFO] Copying 3 resources
[INFO] Copying 3 resources
[INFO] 
[INFO] --- maven-compiler-plugin:2.5:compile (default-compile) @ deltaspike-core-impl ---
[INFO] Compiling 67 source files to <https://builds.apache.org/job/DeltaSpike_Wildfly_8.2.1/ws/deltaspike/core/impl/target/classes>
[INFO] 
[INFO] --- maven-resources-plugin:2.6:testResources (default-testResources) @ deltaspike-core-impl
---
[INFO] Using 'UTF-8' encoding to copy filtered resources.
[INFO] Copying 15 resources
[INFO] Copying 3 resources
[INFO] 
[INFO] --- maven-compiler-plugin:2.5:testCompile (default-testCompile) @ deltaspike-core-impl
---
[INFO] Compiling 201 source files to <https://builds.apache.org/job/DeltaSpike_Wildfly_8.2.1/ws/deltaspike/core/impl/target/test-classes>
[INFO] 
[INFO] --- maven-dependency-plugin:2.4:unpack (unpack-wf) @ deltaspike-core-impl ---
[INFO] Configured Artifact: org.wildfly:wildfly-dist:8.2.1.Final:zip
[INFO] Unpacking /home/jenkins/jenkins-slave/maven-repositories/0/org/wildfly/wildfly-dist/8.2.1.Final/wildfly-dist-8.2.1.Final.zip
to /tmp/deltaspike-arquillian-containers with includes "" and excludes ""
[INFO] 
[INFO] --- maven-surefire-plugin:2.11:test (default-test) @ deltaspike-core-impl ---
[INFO] Surefire report directory: <https://builds.apache.org/job/DeltaSpike_Wildfly_8.2.1/ws/deltaspike/core/impl/target/surefire-reports>
[INFO] Using configured provider org.apache.maven.surefire.junitcore.JUnitCoreProvider

-------------------------------------------------------
 T E S T S
-------------------------------------------------------
Concurrency config is parallel='none', perCoreThreadCount=true, threadCount=2, useUnlimitedThreads=false
Running org.apache.deltaspike.test.core.api.projectstage.ProjectStageTest
Tests run: 1, Failures: 0, Errors: 0, Skipped: 0, Time elapsed: 0.011 sec
Oct 31, 2015 11:33:23 AM org.jboss.as.arquillian.container.managed.ManagedDeployableContainer
startInternal
WARNING: Bundles path is deprecated and no longer used.
Oct 31, 2015 11:33:23 AM org.jboss.as.arquillian.container.managed.ManagedDeployableContainer
startInternal
INFO: Starting container with: [/home/jenkins/tools/java/latest1.7/bin/java, -D[Standalone],
-Xms64m, -Xms64m, -Xmx512m, -Djava.net.preferIPv4Stack=true, -Djava.awt.headless=true, -Djboss.modules.system.pkgs=org.jboss.byteman,
-XX:MaxPermSize=256m, -XX:MaxPermSize=512m, -client, -noverify, -Xmx1024m, -Djboss.socket.binding.port-offset=50000,
-Dcdicontainer.version=wildfly-8.2.1.Final, -ea, -Djboss.home.dir=/tmp/deltaspike-arquillian-containers/wildfly-8.2.1.Final,
-Dorg.jboss.boot.log.file=/tmp/deltaspike-arquillian-containers/wildfly-8.2.1.Final/standalone/log/server.log,
-Dlogging.configuration=file:/tmp/deltaspike-arquillian-containers/wildfly-8.2.1.Final/standalone/configuration/logging.properties,
-jar, /tmp/deltaspike-arquillian-containers/wildfly-8.2.1.Final/jboss-modules.jar, -mp, /tmp/deltaspike-arquillian-containers/wildfly-8.2.1.Final/modules,
org.jboss.as.standalone, -Djboss.home.dir=/tmp/deltaspike-arquillian-containers/wildfly-8.2.1.Final,
-Djboss.server.base.dir=/tmp/deltaspike-arquillian-containers/wildfly-8.2.1.Final/standalone,
-Djboss.server.log.dir=/tmp/deltaspike-arquillian-containers/wildfly-8.2.1.Final/standalone/log,
-Djboss.server.config.dir=/tmp/deltaspike-arquillian-containers/wildfly-8.2.1.Final/standalone/configuration]
Oct 31, 2015 11:33:23 AM org.xnio.Xnio <clinit>
INFO: XNIO version 3.3.1.Final
Oct 31, 2015 11:33:23 AM org.xnio.nio.NioXnio <clinit>
INFO: XNIO NIO Implementation Version 3.3.1.Final
Oct 31, 2015 11:33:23 AM org.jboss.remoting3.EndpointImpl <clinit>
INFO: JBoss Remoting version 4.0.9.Final
#
# A fatal error has been detected by the Java Runtime Environment:
#
#  SIGSEGV (0xb) at pc=0xae815654, pid=16586, tid=4136942400
#
# JRE version: 7.0_25-b15
# Java VM: Java HotSpot(TM) Server VM (23.25-b01 mixed mode linux-x86 )
# Problematic frame:
# C  [libnet.so+0x14654]  _fini+0x1d0c
#
# Failed to write core dump. Core dumps have been disabled. To enable core dumping, try "ulimit
-c unlimited" before starting Java again
#
# An error report file with more information is saved as:
# <https://builds.apache.org/job/DeltaSpike_Wildfly_8.2.1/ws/deltaspike/core/impl/hs_err_pid16586.log>
#
# If you would like to submit a bug report, please visit:
#   http://bugreport.sun.com/bugreport/crash.jsp
# The crash happened outside the Java Virtual Machine in native code.
# See problematic frame for where to report the bug.
#
Aborted

Results :

Tests run: 1, Failures: 0, Errors: 0, Skipped: 0

[JENKINS] Recording test results
[INFO] ------------------------------------------------------------------------
[INFO] Reactor Summary:
[INFO] 
[INFO] Apache DeltaSpike ................................. SUCCESS [2.711s]
[INFO] Apache DeltaSpike Sources ......................... SUCCESS [0.511s]
[INFO] Apache DeltaSpike CheckStyle-rules ................ SUCCESS [1.854s]
[INFO] Apache DeltaSpike Parent .......................... SUCCESS [3.600s]
[INFO] Apache DeltaSpike Test-Utils ...................... SUCCESS [4.111s]
[INFO] Apache DeltaSpike Code Parent ..................... SUCCESS [17.808s]
[INFO] Apache DeltaSpike Core ............................ SUCCESS [4.479s]
[INFO] Apache DeltaSpike Core-API ........................ SUCCESS [19.645s]
[INFO] Apache DeltaSpike Core-Implementation ............. FAILURE [6.450s]
[INFO] Apache DeltaSpike ContainerControl parent ......... SKIPPED
[INFO] Apache DeltaSpike CDI ContainerControl API ........ SKIPPED
[INFO] Apache DeltaSpike CDI ContainerControl TCK ........ SKIPPED
[INFO] Apache DeltaSpike CDI OWB-ContainerControl ........ SKIPPED
[INFO] Apache DeltaSpike CDI Weld-ContainerControl ....... SKIPPED
[INFO] Apache DeltaSpike CDI OpenEJB-ContainerControl .... SKIPPED
[INFO] Apache DeltaSpike CDI Servlet-ContainerControl .... SKIPPED
[INFO] Apache DeltaSpike Modules ......................... SKIPPED
[INFO] Apache DeltaSpike Proxy-Module .................... SKIPPED
[INFO] Apache DeltaSpike Proxy-Module API ................ SKIPPED
[INFO] Apache DeltaSpike Proxy-Module Impl ASM5 .......... SKIPPED
[INFO] Apache DeltaSpike Security-Module ................. SKIPPED
[INFO] Apache DeltaSpike Security-Module API ............. SKIPPED
[INFO] Apache DeltaSpike Security-Module Impl ............ SKIPPED
[INFO] Apache DeltaSpike JPA-Module ...................... SKIPPED
[INFO] Apache DeltaSpike JPA-Module API .................. SKIPPED
[INFO] Apache DeltaSpike JPA-Module Impl ................. SKIPPED
[INFO] Apache DeltaSpike Servlet-Module .................. SKIPPED
[INFO] Apache DeltaSpike Servlet-Module API .............. SKIPPED
[INFO] Apache DeltaSpike Servlet-Module Impl ............. SKIPPED
[INFO] Apache DeltaSpike JSF-Module ...................... SKIPPED
[INFO] Apache DeltaSpike JSF-Module API .................. SKIPPED
[INFO] Apache DeltaSpike JSF-Module Impl ................. SKIPPED
[INFO] Apache DeltaSpike JSF-Module Impl (EE6 only) ...... SKIPPED
[INFO] Apache DeltaSpike Partial-Bean-Module ............. SKIPPED
[INFO] Apache DeltaSpike Partial-Bean-Module API ......... SKIPPED
[INFO] Apache DeltaSpike Partial-Bean-Module Impl ........ SKIPPED
[INFO] Apache DeltaSpike BeanValidation-Module ........... SKIPPED
[INFO] Apache DeltaSpike BeanValidation-Module API ....... SKIPPED
[INFO] Apache DeltaSpike BeanValidation-Module Impl ...... SKIPPED
[INFO] Apache DeltaSpike Data-Module ..................... SKIPPED
[INFO] Apache DeltaSpike Data-Module API ................. SKIPPED
[INFO] Apache DeltaSpike Data-Module Impl ................ SKIPPED
[INFO] Apache DeltaSpike Scheduler-Module ................ SKIPPED
[INFO] Apache DeltaSpike Scheduler-Module API ............ SKIPPED
[INFO] Apache DeltaSpike Scheduler-Module Impl ........... SKIPPED
[INFO] Apache DeltaSpike Test-Control-Module ............. SKIPPED
[INFO] Apache DeltaSpike Test-Control-Module API ......... SKIPPED
[INFO] Apache DeltaSpike Test-Control-Module Impl ........ SKIPPED
[INFO] Apache DeltaSpike Examples ........................ SKIPPED
[INFO] Apache DeltaSpike Java-SE Examples ................ SKIPPED
[INFO] Apache DeltaSpike JSF Examples .................... SKIPPED
[INFO] Apache DeltaSpike JSF Playground .................. SKIPPED
[INFO] Apache DeltaSpike Security Example CDI ............ SKIPPED
[INFO] Apache DeltaSpike Security Example PicketLink ..... SKIPPED
[INFO] Apache DeltaSpike Java-SE Scheduler Examples ...... SKIPPED
[INFO] Apache DeltaSpike Documentation ................... SKIPPED
[INFO] Apache DeltaSpike Site ............................ SKIPPED
[INFO] ------------------------------------------------------------------------
[INFO] BUILD FAILURE
[INFO] ------------------------------------------------------------------------
[INFO] Total time: 1:12.440s
[INFO] Finished at: Sat Oct 31 11:33:24 UTC 2015
[INFO] Final Memory: 61M/771M
[INFO] ------------------------------------------------------------------------
Waiting for Jenkins to finish collecting data
[ERROR] Failed to execute goal org.apache.maven.plugins:maven-surefire-plugin:2.11:test (default-test)
on project deltaspike-core-impl: Error occured in starting fork, check output in log ->
[Help 1]
[ERROR] 
[ERROR] To see the full stack trace of the errors, re-run Maven with the -e switch.
[ERROR] Re-run Maven using the -X switch to enable full debug logging.
[ERROR] 
[ERROR] For more information about the errors and possible solutions, please read the following
articles:
[ERROR] [Help 1] http://cwiki.apache.org/confluence/display/MAVEN/MojoExecutionException
[ERROR] 
[ERROR] After correcting the problems, you can resume the build with the command
[ERROR]   mvn <goals> -rf :deltaspike-core-impl
[JENKINS] Archiving <https://builds.apache.org/job/DeltaSpike_Wildfly_8.2.1/ws/deltaspike/examples/jse-examples/pom.xml>
to org.apache.deltaspike.examples/deltaspike-jse-example/1.5.2-SNAPSHOT/deltaspike-jse-example-1.5.2-SNAPSHOT.pom
[JENKINS] Archiving <https://builds.apache.org/job/DeltaSpike_Wildfly_8.2.1/ws/deltaspike/examples/security-requested-page-after-login-cdi/pom.xml>
to org.apache.deltaspike.examples/deltaspike-security-requested-page-after-login-cdi/1.5.2-SNAPSHOT/deltaspike-security-requested-page-after-login-cdi-1.5.2-SNAPSHOT.pom
[JENKINS] Archiving <https://builds.apache.org/job/DeltaSpike_Wildfly_8.2.1/ws/deltaspike/test-utils/pom.xml>
to org.apache.deltaspike.test/test-utils/1.5.2-SNAPSHOT/test-utils-1.5.2-SNAPSHOT.pom
[JENKINS] Archiving <https://builds.apache.org/job/DeltaSpike_Wildfly_8.2.1/ws/deltaspike/test-utils/target/test-utils-1.5.2-SNAPSHOT.jar>
to org.apache.deltaspike.test/test-utils/1.5.2-SNAPSHOT/test-utils-1.5.2-SNAPSHOT.jar
[JENKINS] Archiving <https://builds.apache.org/job/DeltaSpike_Wildfly_8.2.1/ws/deltaspike/test-utils/target/test-utils-1.5.2-SNAPSHOT-sources.jar>
to org.apache.deltaspike.test/test-utils/1.5.2-SNAPSHOT/test-utils-1.5.2-SNAPSHOT-sources.jar
[JENKINS] Archiving <https://builds.apache.org/job/DeltaSpike_Wildfly_8.2.1/ws/documentation/pom.xml>
to org.apache.deltaspike/deltaspike-documentation/1.5.2-SNAPSHOT/deltaspike-documentation-1.5.2-SNAPSHOT.pom
[JENKINS] Archiving <https://builds.apache.org/job/DeltaSpike_Wildfly_8.2.1/ws/deltaspike/modules/data/impl/pom.xml>
to org.apache.deltaspike.modules/deltaspike-data-module-impl/1.5.2-SNAPSHOT/deltaspike-data-module-impl-1.5.2-SNAPSHOT.pom
[JENKINS] Archiving <https://builds.apache.org/job/DeltaSpike_Wildfly_8.2.1/ws/deltaspike/modules/data/api/pom.xml>
to org.apache.deltaspike.modules/deltaspike-data-module-api/1.5.2-SNAPSHOT/deltaspike-data-module-api-1.5.2-SNAPSHOT.pom
[JENKINS] Archiving <https://builds.apache.org/job/DeltaSpike_Wildfly_8.2.1/ws/deltaspike/core/impl/pom.xml>
to org.apache.deltaspike.core/deltaspike-core-impl/1.5.2-SNAPSHOT/deltaspike-core-impl-1.5.2-SNAPSHOT.pom
[JENKINS] Archiving <https://builds.apache.org/job/DeltaSpike_Wildfly_8.2.1/ws/deltaspike/modules/pom.xml>
to org.apache.deltaspike.modules/modules-project/1.5.2-SNAPSHOT/modules-project-1.5.2-SNAPSHOT.pom
[JENKINS] Archiving <https://builds.apache.org/job/DeltaSpike_Wildfly_8.2.1/ws/deltaspike/modules/test-control/pom.xml>
to org.apache.deltaspike.modules/test-control-module-project/1.5.2-SNAPSHOT/test-control-module-project-1.5.2-SNAPSHOT.pom
[JENKINS] Archiving <https://builds.apache.org/job/DeltaSpike_Wildfly_8.2.1/ws/deltaspike/examples/jsf-examples/pom.xml>
to org.apache.deltaspike.examples/deltaspike-jsf-example/1.5.2-SNAPSHOT/deltaspike-jsf-example-1.5.2-SNAPSHOT.pom
[JENKINS] Archiving <https://builds.apache.org/job/DeltaSpike_Wildfly_8.2.1/ws/deltaspike/cdictrl/servlet/pom.xml>
to org.apache.deltaspike.cdictrl/deltaspike-cdictrl-servlet/1.5.2-SNAPSHOT/deltaspike-cdictrl-servlet-1.5.2-SNAPSHOT.pom
[JENKINS] Archiving <https://builds.apache.org/job/DeltaSpike_Wildfly_8.2.1/ws/deltaspike/cdictrl/api/pom.xml>
to org.apache.deltaspike.cdictrl/deltaspike-cdictrl-api/1.5.2-SNAPSHOT/deltaspike-cdictrl-api-1.5.2-SNAPSHOT.pom
[JENKINS] Archiving <https://builds.apache.org/job/DeltaSpike_Wildfly_8.2.1/ws/deltaspike/examples/scheduler-playground/pom.xml>
to org.apache.deltaspike.examples/deltaspike-scheduler-example/1.5.2-SNAPSHOT/deltaspike-scheduler-example-1.5.2-SNAPSHOT.pom
[JENKINS] Archiving <https://builds.apache.org/job/DeltaSpike_Wildfly_8.2.1/ws/deltaspike/checkstyle-rules/pom.xml>
to org.apache.deltaspike/checkstyle-rules/1.5.2-SNAPSHOT/checkstyle-rules-1.5.2-SNAPSHOT.pom
[JENKINS] Archiving <https://builds.apache.org/job/DeltaSpike_Wildfly_8.2.1/ws/deltaspike/checkstyle-rules/target/checkstyle-rules-1.5.2-SNAPSHOT.jar>
to org.apache.deltaspike/checkstyle-rules/1.5.2-SNAPSHOT/checkstyle-rules-1.5.2-SNAPSHOT.jar
[JENKINS] Archiving <https://builds.apache.org/job/DeltaSpike_Wildfly_8.2.1/ws/deltaspike/parent/code/pom.xml>
to org.apache.deltaspike/parent-code/1.5.2-SNAPSHOT/parent-code-1.5.2-SNAPSHOT.pom
[JENKINS] Archiving <https://builds.apache.org/job/DeltaSpike_Wildfly_8.2.1/ws/deltaspike/parent/code/target/parent-code-1.5.2-SNAPSHOT-tests.jar>
to org.apache.deltaspike/parent-code/1.5.2-SNAPSHOT/parent-code-1.5.2-SNAPSHOT-tests.jar
Compressed 75.53 KB of artifacts by 42.4% relative to #32
[JENKINS] Archiving <https://builds.apache.org/job/DeltaSpike_Wildfly_8.2.1/ws/deltaspike/modules/jsf/impl/pom.xml>
to org.apache.deltaspike.modules/deltaspike-jsf-module-impl/1.5.2-SNAPSHOT/deltaspike-jsf-module-impl-1.5.2-SNAPSHOT.pom
[JENKINS] Archiving <https://builds.apache.org/job/DeltaSpike_Wildfly_8.2.1/ws/deltaspike/modules/partial-bean/pom.xml>
to org.apache.deltaspike.modules/partial-bean-module-project/1.5.2-SNAPSHOT/partial-bean-module-project-1.5.2-SNAPSHOT.pom
[JENKINS] Archiving <https://builds.apache.org/job/DeltaSpike_Wildfly_8.2.1/ws/deltaspike/examples/pom.xml>
to org.apache.deltaspike.examples/examples-project/1.5.2-SNAPSHOT/examples-project-1.5.2-SNAPSHOT.pom
[JENKINS] Archiving <https://builds.apache.org/job/DeltaSpike_Wildfly_8.2.1/ws/deltaspike/cdictrl/impl-openejb/pom.xml>
to org.apache.deltaspike.cdictrl/deltaspike-cdictrl-openejb/1.5.2-SNAPSHOT/deltaspike-cdictrl-openejb-1.5.2-SNAPSHOT.pom
[JENKINS] Archiving <https://builds.apache.org/job/DeltaSpike_Wildfly_8.2.1/ws/deltaspike/modules/jsf/pom.xml>
to org.apache.deltaspike.modules/jsf-module-project/1.5.2-SNAPSHOT/jsf-module-project-1.5.2-SNAPSHOT.pom
[JENKINS] Archiving <https://builds.apache.org/job/DeltaSpike_Wildfly_8.2.1/ws/deltaspike/cdictrl/tck/pom.xml>
to org.apache.deltaspike.test/deltaspike-cdictrl-tck/1.5.2-SNAPSHOT/deltaspike-cdictrl-tck-1.5.2-SNAPSHOT.pom
[JENKINS] Archiving <https://builds.apache.org/job/DeltaSpike_Wildfly_8.2.1/ws/deltaspike/modules/jsf/api/pom.xml>
to org.apache.deltaspike.modules/deltaspike-jsf-module-api/1.5.2-SNAPSHOT/deltaspike-jsf-module-api-1.5.2-SNAPSHOT.pom
[JENKINS] Archiving <https://builds.apache.org/job/DeltaSpike_Wildfly_8.2.1/ws/deltaspike/modules/security/pom.xml>
to org.apache.deltaspike.modules/security-module-project/1.5.2-SNAPSHOT/security-module-project-1.5.2-SNAPSHOT.pom
[JENKINS] Archiving <https://builds.apache.org/job/DeltaSpike_Wildfly_8.2.1/ws/deltaspike/modules/bean-validation/pom.xml>
to org.apache.deltaspike.modules/bean-validation-module-project/1.5.2-SNAPSHOT/bean-validation-module-project-1.5.2-SNAPSHOT.pom
[JENKINS] Archiving <https://builds.apache.org/job/DeltaSpike_Wildfly_8.2.1/ws/deltaspike/modules/partial-bean/impl/pom.xml>
to org.apache.deltaspike.modules/deltaspike-partial-bean-module-impl/1.5.2-SNAPSHOT/deltaspike-partial-bean-module-impl-1.5.2-SNAPSHOT.pom
[JENKINS] Archiving <https://builds.apache.org/job/DeltaSpike_Wildfly_8.2.1/ws/deltaspike/modules/proxy/api/pom.xml>
to org.apache.deltaspike.modules/deltaspike-proxy-module-api/1.5.2-SNAPSHOT/deltaspike-proxy-module-api-1.5.2-SNAPSHOT.pom
[JENKINS] Archiving <https://builds.apache.org/job/DeltaSpike_Wildfly_8.2.1/ws/deltaspike/cdictrl/impl-weld/pom.xml>
to org.apache.deltaspike.cdictrl/deltaspike-cdictrl-weld/1.5.2-SNAPSHOT/deltaspike-cdictrl-weld-1.5.2-SNAPSHOT.pom
[JENKINS] Archiving <https://builds.apache.org/job/DeltaSpike_Wildfly_8.2.1/ws/deltaspike/modules/jpa/api/pom.xml>
to org.apache.deltaspike.modules/deltaspike-jpa-module-api/1.5.2-SNAPSHOT/deltaspike-jpa-module-api-1.5.2-SNAPSHOT.pom
[JENKINS] Archiving <https://builds.apache.org/job/DeltaSpike_Wildfly_8.2.1/ws/deltaspike/modules/servlet/api/pom.xml>
to org.apache.deltaspike.modules/deltaspike-servlet-module-api/1.5.2-SNAPSHOT/deltaspike-servlet-module-api-1.5.2-SNAPSHOT.pom
[JENKINS] Archiving <https://builds.apache.org/job/DeltaSpike_Wildfly_8.2.1/ws/deltaspike/modules/jpa/pom.xml>
to org.apache.deltaspike.modules/jpa-module-project/1.5.2-SNAPSHOT/jpa-module-project-1.5.2-SNAPSHOT.pom
[JENKINS] Archiving <https://builds.apache.org/job/DeltaSpike_Wildfly_8.2.1/ws/deltaspike/cdictrl/pom.xml>
to org.apache.deltaspike.cdictrl/cdictrl-project/1.5.2-SNAPSHOT/cdictrl-project-1.5.2-SNAPSHOT.pom
[JENKINS] Archiving <https://builds.apache.org/job/DeltaSpike_Wildfly_8.2.1/ws/deltaspike/modules/scheduler/api/pom.xml>
to org.apache.deltaspike.modules/deltaspike-scheduler-module-api/1.5.2-SNAPSHOT/deltaspike-scheduler-module-api-1.5.2-SNAPSHOT.pom
[JENKINS] Archiving <https://builds.apache.org/job/DeltaSpike_Wildfly_8.2.1/ws/deltaspike/modules/test-control/impl/pom.xml>
to org.apache.deltaspike.modules/deltaspike-test-control-module-impl/1.5.2-SNAPSHOT/deltaspike-test-control-module-impl-1.5.2-SNAPSHOT.pom
[JENKINS] Archiving <https://builds.apache.org/job/DeltaSpike_Wildfly_8.2.1/ws/deltaspike/modules/servlet/pom.xml>
to org.apache.deltaspike.modules/servlet-module-project/1.5.2-SNAPSHOT/servlet-module-project-1.5.2-SNAPSHOT.pom
[JENKINS] Archiving <https://builds.apache.org/job/DeltaSpike_Wildfly_8.2.1/ws/deltaspike/modules/test-control/api/pom.xml>
to org.apache.deltaspike.modules/deltaspike-test-control-module-api/1.5.2-SNAPSHOT/deltaspike-test-control-module-api-1.5.2-SNAPSHOT.pom
[JENKINS] Archiving <https://builds.apache.org/job/DeltaSpike_Wildfly_8.2.1/ws/deltaspike/modules/jsf/impl-ee6/pom.xml>
to org.apache.deltaspike.modules/deltaspike-jsf-module-impl-ee6/1.5.2-SNAPSHOT/deltaspike-jsf-module-impl-ee6-1.5.2-SNAPSHOT.pom
[JENKINS] Archiving <https://builds.apache.org/job/DeltaSpike_Wildfly_8.2.1/ws/deltaspike/modules/proxy/pom.xml>
to org.apache.deltaspike.modules/proxy-module-project/1.5.2-SNAPSHOT/proxy-module-project-1.5.2-SNAPSHOT.pom
[JENKINS] Archiving <https://builds.apache.org/job/DeltaSpike_Wildfly_8.2.1/ws/deltaspike/modules/partial-bean/api/pom.xml>
to org.apache.deltaspike.modules/deltaspike-partial-bean-module-api/1.5.2-SNAPSHOT/deltaspike-partial-bean-module-api-1.5.2-SNAPSHOT.pom
[JENKINS] Archiving <https://builds.apache.org/job/DeltaSpike_Wildfly_8.2.1/ws/deltaspike/modules/scheduler/impl/pom.xml>
to org.apache.deltaspike.modules/deltaspike-scheduler-module-impl/1.5.2-SNAPSHOT/deltaspike-scheduler-module-impl-1.5.2-SNAPSHOT.pom
[JENKINS] Archiving <https://builds.apache.org/job/DeltaSpike_Wildfly_8.2.1/ws/deltaspike/parent/pom.xml>
to org.apache.deltaspike/parent/1.5.2-SNAPSHOT/parent-1.5.2-SNAPSHOT.pom
Compressed 39.62 KB of artifacts by 80.8% relative to #32
[JENKINS] Archiving <https://builds.apache.org/job/DeltaSpike_Wildfly_8.2.1/ws/deltaspike/core/pom.xml>
to org.apache.deltaspike.core/core-project/1.5.2-SNAPSHOT/core-project-1.5.2-SNAPSHOT.pom
[JENKINS] Archiving <https://builds.apache.org/job/DeltaSpike_Wildfly_8.2.1/ws/deltaspike/core/target/core-project-1.5.2-SNAPSHOT-tests.jar>
to org.apache.deltaspike.core/core-project/1.5.2-SNAPSHOT/core-project-1.5.2-SNAPSHOT-tests.jar
[JENKINS] Archiving <https://builds.apache.org/job/DeltaSpike_Wildfly_8.2.1/ws/deltaspike/modules/bean-validation/api/pom.xml>
to org.apache.deltaspike.modules/deltaspike-bean-validation-module-api/1.5.2-SNAPSHOT/deltaspike-bean-validation-module-api-1.5.2-SNAPSHOT.pom
[JENKINS] Archiving <https://builds.apache.org/job/DeltaSpike_Wildfly_8.2.1/ws/deltaspike/core/api/pom.xml>
to org.apache.deltaspike.core/deltaspike-core-api/1.5.2-SNAPSHOT/deltaspike-core-api-1.5.2-SNAPSHOT.pom
[JENKINS] Archiving <https://builds.apache.org/job/DeltaSpike_Wildfly_8.2.1/ws/deltaspike/core/api/target/deltaspike-core-api-1.5.2-SNAPSHOT.jar>
to org.apache.deltaspike.core/deltaspike-core-api/1.5.2-SNAPSHOT/deltaspike-core-api-1.5.2-SNAPSHOT.jar
[JENKINS] Archiving <https://builds.apache.org/job/DeltaSpike_Wildfly_8.2.1/ws/deltaspike/core/api/target/deltaspike-core-api-1.5.2-SNAPSHOT-tests.jar>
to org.apache.deltaspike.core/deltaspike-core-api/1.5.2-SNAPSHOT/deltaspike-core-api-1.5.2-SNAPSHOT-tests.jar
[JENKINS] Archiving <https://builds.apache.org/job/DeltaSpike_Wildfly_8.2.1/ws/deltaspike/core/api/target/deltaspike-core-api-1.5.2-SNAPSHOT-sources.jar>
to org.apache.deltaspike.core/deltaspike-core-api/1.5.2-SNAPSHOT/deltaspike-core-api-1.5.2-SNAPSHOT-sources.jar
[JENKINS] Archiving <https://builds.apache.org/job/DeltaSpike_Wildfly_8.2.1/ws/deltaspike/modules/security/impl/pom.xml>
to org.apache.deltaspike.modules/deltaspike-security-module-impl/1.5.2-SNAPSHOT/deltaspike-security-module-impl-1.5.2-SNAPSHOT.pom
[JENKINS] Archiving <https://builds.apache.org/job/DeltaSpike_Wildfly_8.2.1/ws/deltaspike/modules/scheduler/pom.xml>
to org.apache.deltaspike.modules/scheduler-module-project/1.5.2-SNAPSHOT/scheduler-module-project-1.5.2-SNAPSHOT.pom
[JENKINS] Archiving <https://builds.apache.org/job/DeltaSpike_Wildfly_8.2.1/ws/site/pom.xml>
to org.apache.deltaspike/deltaspike-site/1.5.2-SNAPSHOT/deltaspike-site-1.5.2-SNAPSHOT.pom
[JENKINS] Archiving <https://builds.apache.org/job/DeltaSpike_Wildfly_8.2.1/ws/deltaspike/modules/proxy/impl-asm5/pom.xml>
to org.apache.deltaspike.modules/deltaspike-proxy-module-impl-asm5/1.5.2-SNAPSHOT/deltaspike-proxy-module-impl-asm5-1.5.2-SNAPSHOT.pom
[JENKINS] Archiving <https://builds.apache.org/job/DeltaSpike_Wildfly_8.2.1/ws/deltaspike/examples/jsf-playground/pom.xml>
to org.apache.deltaspike.examples/deltaspike-jsf-playground/1.5.2-SNAPSHOT/deltaspike-jsf-playground-1.5.2-SNAPSHOT.pom
[JENKINS] Archiving <https://builds.apache.org/job/DeltaSpike_Wildfly_8.2.1/ws/deltaspike/modules/servlet/impl/pom.xml>
to org.apache.deltaspike.modules/deltaspike-servlet-module-impl/1.5.2-SNAPSHOT/deltaspike-servlet-module-impl-1.5.2-SNAPSHOT.pom
[JENKINS] Archiving <https://builds.apache.org/job/DeltaSpike_Wildfly_8.2.1/ws/deltaspike/modules/bean-validation/impl/pom.xml>
to org.apache.deltaspike.modules/deltaspike-bean-validation-module-impl/1.5.2-SNAPSHOT/deltaspike-bean-validation-module-impl-1.5.2-SNAPSHOT.pom
[JENKINS] Archiving <https://builds.apache.org/job/DeltaSpike_Wildfly_8.2.1/ws/deltaspike/cdictrl/impl-owb/pom.xml>
to org.apache.deltaspike.cdictrl/deltaspike-cdictrl-owb/1.5.2-SNAPSHOT/deltaspike-cdictrl-owb-1.5.2-SNAPSHOT.pom
[JENKINS] Archiving <https://builds.apache.org/job/DeltaSpike_Wildfly_8.2.1/ws/pom.xml>
to org.apache.deltaspike/deltaspike/1.5.2-SNAPSHOT/deltaspike-1.5.2-SNAPSHOT.pom
[JENKINS] Archiving <https://builds.apache.org/job/DeltaSpike_Wildfly_8.2.1/ws/deltaspike/modules/jpa/impl/pom.xml>
to org.apache.deltaspike.modules/deltaspike-jpa-module-impl/1.5.2-SNAPSHOT/deltaspike-jpa-module-impl-1.5.2-SNAPSHOT.pom
[JENKINS] Archiving <https://builds.apache.org/job/DeltaSpike_Wildfly_8.2.1/ws/deltaspike/modules/data/pom.xml>
to org.apache.deltaspike.modules/data-module-project/1.5.2-SNAPSHOT/data-module-project-1.5.2-SNAPSHOT.pom
[JENKINS] Archiving <https://builds.apache.org/job/DeltaSpike_Wildfly_8.2.1/ws/deltaspike/examples/security-requested-page-after-login-picketlink/pom.xml>
to org.apache.deltaspike.examples/deltaspike-security-requested-page-after-login-picketlink/1.5.2-SNAPSHOT/deltaspike-security-requested-page-after-login-picketlink-1.5.2-SNAPSHOT.pom
[JENKINS] Archiving <https://builds.apache.org/job/DeltaSpike_Wildfly_8.2.1/ws/deltaspike/pom.xml>
to org.apache.deltaspike/deltaspike-project/1.5.2-SNAPSHOT/deltaspike-project-1.5.2-SNAPSHOT.pom
[JENKINS] Archiving <https://builds.apache.org/job/DeltaSpike_Wildfly_8.2.1/ws/deltaspike/modules/security/api/pom.xml>
to org.apache.deltaspike.modules/deltaspike-security-module-api/1.5.2-SNAPSHOT/deltaspike-security-module-api-1.5.2-SNAPSHOT.pom
Sending e-mails to: commits@deltaspike.apache.org
channel stopped

Mime
View raw message