deltaspike-commits mailing list archives

Site index · List index
Message view « Date » · « Thread »
Top « Date » · « Thread »
From Apache Jenkins Server <jenk...@builds.apache.org>
Subject Build failed in Jenkins: DeltaSpike RAT-Check #2359
Date Mon, 03 Aug 2015 18:32:39 GMT
See <https://builds.apache.org/job/DeltaSpike%20RAT-Check/2359/changes>

Changes:

[tandraschko] DELTASPIKE-972 Center windowhandler.html messages

------------------------------------------
[...truncated 5230 lines...]
[INFO] Starting audit...
Audit done.

[INFO] 
[INFO] --- maven-install-plugin:2.5.1:install (default-install) @ bean-validation-module-project
---
[INFO] Installing <https://builds.apache.org/job/DeltaSpike%20RAT-Check/ws/deltaspike/modules/bean-validation/pom.xml>
to /home/jenkins/jenkins-slave/maven-repositories/0/org/apache/deltaspike/modules/bean-validation-module-project/1.4.3-SNAPSHOT/bean-validation-module-project-1.4.3-SNAPSHOT.pom
[INFO] Installing <https://builds.apache.org/job/DeltaSpike%20RAT-Check/ws/deltaspike/modules/bean-validation/target/bean-validation-module-project-1.4.3-SNAPSHOT-tests.jar>
to /home/jenkins/jenkins-slave/maven-repositories/0/org/apache/deltaspike/modules/bean-validation-module-project/1.4.3-SNAPSHOT/bean-validation-module-project-1.4.3-SNAPSHOT-tests.jar
Build timed out (after 30 minutes). Marking the build as failed.
[INFO] ------------------------------------------------------------------------
[INFO] Reactor Summary:
[INFO] 
[INFO] Apache DeltaSpike Sources ......................... SUCCESS [4.226s]
[INFO] Apache DeltaSpike CheckStyle-rules ................ SUCCESS [1.519s]
[INFO] Apache DeltaSpike Parent .......................... SUCCESS [3.404s]
[INFO] Apache DeltaSpike Test-Utils ...................... SUCCESS [4.039s]
[INFO] Apache DeltaSpike Code Parent ..................... SUCCESS [2.831s]
[INFO] Apache DeltaSpike Core ............................ SUCCESS [1.576s]
[INFO] Apache DeltaSpike Core-API ........................ SUCCESS [19.206s]
[INFO] Apache DeltaSpike Core-Implementation ............. SUCCESS [19.832s]
[INFO] Apache DeltaSpike ContainerControl parent ......... SUCCESS [1.419s]
[INFO] Apache DeltaSpike CDI ContainerControl API ........ SUCCESS [2.183s]
[INFO] Apache DeltaSpike CDI ContainerControl TCK ........ SUCCESS [2.328s]
[INFO] Apache DeltaSpike CDI OWB-ContainerControl ........ SUCCESS [3.374s]
[INFO] Apache DeltaSpike CDI Weld-ContainerControl ....... SUCCESS [4.313s]
[INFO] Apache DeltaSpike CDI OpenEJB-ContainerControl .... SUCCESS [8.733s]
[INFO] Apache DeltaSpike CDI Servlet-ContainerControl .... SUCCESS [4.212s]
[INFO] Apache DeltaSpike Modules ......................... SUCCESS [1.751s]
[INFO] Apache DeltaSpike Proxy-Module .................... SUCCESS [1.375s]
[INFO] Apache DeltaSpike Proxy-Module API ................ SUCCESS [4.962s]
[INFO] Apache DeltaSpike Proxy-Module Impl ASM5 .......... SUCCESS [5.370s]
[INFO] Apache DeltaSpike Security-Module ................. SUCCESS [1.292s]
[INFO] Apache DeltaSpike Security-Module API ............. SUCCESS [4.686s]
[INFO] Apache DeltaSpike Security-Module Impl ............ SUCCESS [9.202s]
[INFO] Apache DeltaSpike JPA-Module ...................... SUCCESS [3.290s]
[INFO] Apache DeltaSpike JPA-Module API .................. SUCCESS [5.809s]
[INFO] Apache DeltaSpike JPA-Module Impl ................. SUCCESS [15.226s]
[INFO] Apache DeltaSpike Servlet-Module .................. SUCCESS [1.481s]
[INFO] Apache DeltaSpike Servlet-Module API .............. SUCCESS [4.527s]
[INFO] Apache DeltaSpike Servlet-Module Impl ............. SUCCESS [2.553s]
[INFO] Apache DeltaSpike JSF-Module ...................... SUCCESS [1.813s]
[INFO] Apache DeltaSpike JSF-Module API .................. SUCCESS [2.969s]
[INFO] Apache DeltaSpike JSF-Module Impl ................. SUCCESS [16.291s]
[INFO] Apache DeltaSpike JSF-Module Impl (EE6 only) ...... SUCCESS [3.439s]
[INFO] Apache DeltaSpike Partial-Bean-Module ............. SUCCESS [1.443s]
[INFO] Apache DeltaSpike Partial-Bean-Module API ......... SUCCESS [4.667s]
[INFO] Apache DeltaSpike Partial-Bean-Module Impl ........ SUCCESS [7.991s]
[INFO] Apache DeltaSpike BeanValidation-Module ........... FAILURE [25.729s]
[INFO] Apache DeltaSpike BeanValidation-Module API ....... SKIPPED
[INFO] Apache DeltaSpike BeanValidation-Module Impl ...... SKIPPED
[INFO] Apache DeltaSpike Data-Module ..................... SKIPPED
[INFO] Apache DeltaSpike Data-Module API ................. SKIPPED
[INFO] Apache DeltaSpike Data-Module Impl ................ SKIPPED
[INFO] Apache DeltaSpike Scheduler-Module ................ SKIPPED
[INFO] Apache DeltaSpike Scheduler-Module API ............ SKIPPED
[INFO] Apache DeltaSpike Scheduler-Module Impl ........... SKIPPED
[INFO] Apache DeltaSpike Test-Control-Module ............. SKIPPED
[INFO] Apache DeltaSpike Test-Control-Module API ......... SKIPPED
[INFO] Apache DeltaSpike Test-Control-Module Impl ........ SKIPPED
[INFO] Apache DeltaSpike Examples ........................ SKIPPED
[INFO] Apache DeltaSpike Java-SE Examples ................ SKIPPED
[INFO] Apache DeltaSpike JSF Examples .................... SKIPPED
[INFO] Apache DeltaSpike JSF Playground .................. SKIPPED
[INFO] Apache DeltaSpike Security Example CDI ............ SKIPPED
[INFO] Apache DeltaSpike Security Example PicketLink ..... SKIPPED
[INFO] Apache DeltaSpike Java-SE Scheduler Examples ...... SKIPPED
[INFO] ------------------------------------------------------------------------
[INFO] BUILD FAILURE
[INFO] ------------------------------------------------------------------------
[INFO] Total time: 26:55.835s
[INFO] Finished at: Mon Aug 03 18:20:39 UTC 2015
[INFO] Final Memory: 73M/860M
[INFO] ------------------------------------------------------------------------
[ERROR] Internal error: java.lang.IllegalStateException: Invalid object ID 58 iota=64: Object
was recently deallocated
[ERROR] #58 (ref.0) : [hudson.maven.MavenBuildProxy2]
[ERROR] Created at Mon Aug 03 17:53:00 UTC 2015
[ERROR] at hudson.remoting.ExportTable$Entry.<init>(ExportTable.java:93)
[ERROR] at hudson.remoting.ExportTable.export(ExportTable.java:297)
[ERROR] at hudson.remoting.Channel.internalExport(Channel.java:591)
[ERROR] at hudson.remoting.Channel.export(Channel.java:582)
[ERROR] at hudson.remoting.Channel.export(Channel.java:552)
[ERROR] at hudson.maven.MavenBuild$ProxyImpl2.writeReplace(MavenBuild.java:743)
[ERROR] at sun.reflect.GeneratedMethodAccessor618.invoke(Unknown Source)
[ERROR] at sun.reflect.DelegatingMethodAccessorImpl.invoke(DelegatingMethodAccessorImpl.java:43)
[ERROR] at java.lang.reflect.Method.invoke(Method.java:606)
[ERROR] at java.io.ObjectStreamClass.invokeWriteReplace(ObjectStreamClass.java:1075)
[ERROR] at java.io.ObjectOutputStream.writeObject0(ObjectOutputStream.java:1134)
[ERROR] at java.io.ObjectOutputStream.defaultWriteFields(ObjectOutputStream.java:1547)
[ERROR] at java.io.ObjectOutputStream.writeSerialData(ObjectOutputStream.java:1508)
[ERROR] at java.io.ObjectOutputStream.writeOrdinaryObject(ObjectOutputStream.java:1431)
[ERROR] at java.io.ObjectOutputStream.writeObject0(ObjectOutputStream.java:1177)
[ERROR] at java.io.ObjectOutputStream.writeObject(ObjectOutputStream.java:347)
[ERROR] at java.util.HashMap.writeObject(HashMap.java:1133)
[ERROR] at sun.reflect.GeneratedMethodAccessor216.invoke(Unknown Source)
[ERROR] at sun.reflect.DelegatingMethodAccessorImpl.invoke(DelegatingMethodAccessorImpl.java:43)
[ERROR] at java.lang.reflect.Method.invoke(Method.java:606)
[ERROR] at java.io.ObjectStreamClass.invokeWriteObject(ObjectStreamClass.java:988)
[ERROR] at java.io.ObjectOutputStream.writeSerialData(ObjectOutputStream.java:1495)
[ERROR] at java.io.ObjectOutputStream.writeOrdinaryObject(ObjectOutputStream.java:1431)
[ERROR] at java.io.ObjectOutputStream.writeObject0(ObjectOutputStream.java:1177)
[ERROR] at java.io.ObjectOutputStream.defaultWriteFields(ObjectOutputStream.java:1547)
[ERROR] at java.io.ObjectOutputStream.writeSerialData(ObjectOutputStream.java:1508)
[ERROR] at java.io.ObjectOutputStream.writeOrdinaryObject(ObjectOutputStream.java:1431)
[ERROR] at java.io.ObjectOutputStream.writeObject0(ObjectOutputStream.java:1177)
[ERROR] at java.io.ObjectOutputStream.writeObject(ObjectOutputStream.java:347)
[ERROR] at hudson.remoting.UserRequest._serialize(UserRequest.java:155)
[ERROR] at hudson.remoting.UserRequest.serialize(UserRequest.java:164)
[ERROR] at hudson.remoting.UserRequest.<init>(UserRequest.java:62)
[ERROR] at hudson.remoting.Channel.call(Channel.java:741)
[ERROR] at hudson.maven.ProcessCache$MavenProcess.call(ProcessCache.java:161)
[ERROR] at hudson.maven.MavenModuleSetBuild$MavenModuleSetBuildExecution.doRun(MavenModuleSetBuild.java:840)
[ERROR] at hudson.model.AbstractBuild$AbstractBuildExecution.run(AbstractBuild.java:529)
[ERROR] at hudson.model.Run.execute(Run.java:1706)
[ERROR] at hudson.maven.MavenModuleSetBuild.run(MavenModuleSetBuild.java:529)
[ERROR] at hudson.model.ResourceController.execute(ResourceController.java:88)
[ERROR] at hudson.model.Executor.run(Executor.java:232)
[ERROR] Released at Mon Aug 03 18:20:00 UTC 2015
[ERROR] at hudson.remoting.ExportTable$Entry.release(ExportTable.java:125)
[ERROR] at hudson.remoting.ExportTable$ExportList.release(ExportTable.java:241)
[ERROR] at hudson.remoting.UserRequest.releaseExports(UserRequest.java:190)
[ERROR] at hudson.remoting.UserRequest.releaseExports(UserRequest.java:186)
[ERROR] at hudson.remoting.Channel.call(Channel.java:760)
[ERROR] at hudson.maven.ProcessCache$MavenProcess.call(ProcessCache.java:161)
[ERROR] at hudson.maven.MavenModuleSetBuild$MavenModuleSetBuildExecution.doRun(MavenModuleSetBuild.java:840)
[ERROR] at hudson.model.AbstractBuild$AbstractBuildExecution.run(AbstractBuild.java:529)
[ERROR] at hudson.model.Run.execute(Run.java:1706)
[ERROR] at hudson.maven.MavenModuleSetBuild.run(MavenModuleSetBuild.java:529)
[ERROR] at hudson.model.ResourceController.execute(ResourceController.java:88)
[ERROR] at hudson.model.Executor.run(Executor.java:232): ReleasedAt
[ERROR] -> [Help 1]
org.apache.maven.InternalErrorException: Internal error: java.lang.IllegalStateException:
Invalid object ID 58 iota=64
	at org.apache.maven.DefaultMaven.execute(DefaultMaven.java:168)
	at org.jvnet.hudson.maven3.launcher.Maven3Launcher.main(Maven3Launcher.java:117)
	at sun.reflect.NativeMethodAccessorImpl.invoke0(Native Method)
	at sun.reflect.NativeMethodAccessorImpl.invoke(NativeMethodAccessorImpl.java:39)
	at sun.reflect.DelegatingMethodAccessorImpl.invoke(DelegatingMethodAccessorImpl.java:25)
	at java.lang.reflect.Method.invoke(Method.java:597)
	at org.codehaus.plexus.classworlds.launcher.Launcher.launchStandard(Launcher.java:329)
	at org.codehaus.plexus.classworlds.launcher.Launcher.launch(Launcher.java:239)
	at org.jvnet.hudson.maven3.agent.Maven3Main.launch(Maven3Main.java:178)
	at sun.reflect.NativeMethodAccessorImpl.invoke0(Native Method)
	at sun.reflect.NativeMethodAccessorImpl.invoke(NativeMethodAccessorImpl.java:39)
	at sun.reflect.DelegatingMethodAccessorImpl.invoke(DelegatingMethodAccessorImpl.java:25)
	at java.lang.reflect.Method.invoke(Method.java:597)
	at hudson.maven.Maven3Builder.call(Maven3Builder.java:136)
	at hudson.maven.Maven3Builder.call(Maven3Builder.java:71)
	at hudson.remoting.UserRequest.perform(UserRequest.java:118)
	at hudson.remoting.UserRequest.perform(UserRequest.java:48)
	at hudson.remoting.Request$2.run(Request.java:328)
	at hudson.remoting.InterceptingExecutorService$1.call(InterceptingExecutorService.java:72)
	at java.util.concurrent.FutureTask$Sync.innerRun(FutureTask.java:303)
	at java.util.concurrent.FutureTask.run(FutureTask.java:138)
	at java.util.concurrent.ThreadPoolExecutor$Worker.runTask(ThreadPoolExecutor.java:895)
	at java.util.concurrent.ThreadPoolExecutor$Worker.run(ThreadPoolExecutor.java:918)
	at java.lang.Thread.run(Thread.java:662)
Caused by: java.lang.IllegalStateException: Invalid object ID 58 iota=64
	at hudson.remoting.ExportTable.diagnoseInvalidId(ExportTable.java:346)
	at hudson.remoting.ExportTable.get(ExportTable.java:322)
	at hudson.remoting.Channel.getExportedObject(Channel.java:595)
	at hudson.remoting.RemoteInvocationHandler$RPCRequest.perform(RemoteInvocationHandler.java:301)
	at hudson.remoting.RemoteInvocationHandler$RPCRequest.call(RemoteInvocationHandler.java:290)
	at hudson.remoting.RemoteInvocationHandler$RPCRequest.call(RemoteInvocationHandler.java:249)
	at hudson.remoting.UserRequest.perform(UserRequest.java:118)
	at hudson.remoting.UserRequest.perform(UserRequest.java:48)
	at hudson.remoting.Request$2.run(Request.java:328)
	at hudson.remoting.InterceptingExecutorService$1.call(InterceptingExecutorService.java:72)
	at jenkins.util.ContextResettingExecutorService$2.call(ContextResettingExecutorService.java:46)
	at java.util.concurrent.FutureTask.run(FutureTask.java:262)
	at java.util.concurrent.ThreadPoolExecutor.runWorker(ThreadPoolExecutor.java:1145)
	at java.util.concurrent.ThreadPoolExecutor$Worker.run(ThreadPoolExecutor.java:615)
	at java.lang.Thread.run(Thread.java:745)
Caused by: java.lang.Exception: Object was recently deallocated
    #58 (ref.0) : [hudson.maven.MavenBuildProxy2]
      Created at Mon Aug 03 17:53:00 UTC 2015
    	at hudson.remoting.ExportTable$Entry.<init>(ExportTable.java:93)
    	at hudson.remoting.ExportTable.export(ExportTable.java:297)
    	at hudson.remoting.Channel.internalExport(Channel.java:591)
    	at hudson.remoting.Channel.export(Channel.java:582)
    	at hudson.remoting.Channel.export(Channel.java:552)
    	at hudson.maven.MavenBuild$ProxyImpl2.writeReplace(MavenBuild.java:743)
    	at sun.reflect.GeneratedMethodAccessor618.invoke(Unknown Source)
    	at sun.reflect.DelegatingMethodAccessorImpl.invoke(DelegatingMethodAccessorImpl.java:43)
    	at java.lang.reflect.Method.invoke(Method.java:606)
    	at java.io.ObjectStreamClass.invokeWriteReplace(ObjectStreamClass.java:1075)
    	at java.io.ObjectOutputStream.writeObject0(ObjectOutputStream.java:1134)
    	at java.io.ObjectOutputStream.defaultWriteFields(ObjectOutputStream.java:1547)
    	at java.io.ObjectOutputStream.writeSerialData(ObjectOutputStream.java:1508)
    	at java.io.ObjectOutputStream.writeOrdinaryObject(ObjectOutputStream.java:1431)
    	at java.io.ObjectOutputStream.writeObject0(ObjectOutputStream.java:1177)
    	at java.io.ObjectOutputStream.writeObject(ObjectOutputStream.java:347)
    	at java.util.HashMap.writeObject(HashMap.java:1133)
    	at sun.reflect.GeneratedMethodAccessor216.invoke(Unknown Source)
    	at sun.reflect.DelegatingMethodAccessorImpl.invoke(DelegatingMethodAccessorImpl.java:43)
    	at java.lang.reflect.Method.invoke(Method.java:606)
    	at java.io.ObjectStreamClass.invokeWriteObject(ObjectStreamClass.java:988)
    	at java.io.ObjectOutputStream.writeSerialData(ObjectOutputStream.java:1495)
    	at java.io.ObjectOutputStream.writeOrdinaryObject(ObjectOutputStream.java:1431)
    	at java.io.ObjectOutputStream.writeObject0(ObjectOutputStream.java:1177)
    	at java.io.ObjectOutputStream.defaultWriteFields(ObjectOutputStream.java:1547)
    	at java.io.ObjectOutputStream.writeSerialData(ObjectOutputStream.java:1508)
    	at java.io.ObjectOutputStream.writeOrdinaryObject(ObjectOutputStream.java:1431)
    	at java.io.ObjectOutputStream.writeObject0(ObjectOutputStream.java:1177)
    	at java.io.ObjectOutputStream.writeObject(ObjectOutputStream.java:347)
    	at hudson.remoting.UserRequest._serialize(UserRequest.java:155)
    	at hudson.remoting.UserRequest.serialize(UserRequest.java:164)
    	at hudson.remoting.UserRequest.<init>(UserRequest.java:62)
    	at hudson.remoting.Channel.call(Channel.java:741)
    	at hudson.maven.ProcessCache$MavenProcess.call(ProcessCache.java:161)
    	at hudson.maven.MavenModuleSetBuild$MavenModuleSetBuildExecution.doRun(MavenModuleSetBuild.java:840)
    	at hudson.model.AbstractBuild$AbstractBuildExecution.run(AbstractBuild.java:529)
    	at hudson.model.Run.execute(Run.java:1706)
    	at hudson.maven.MavenModuleSetBuild.run(MavenModuleSetBuild.java:529)
    	at hudson.model.ResourceController.execute(ResourceController.java:88)
    	at hudson.model.Executor.run(Executor.java:232)
      Released at Mon Aug 03 18:20:00 UTC 2015
    	at hudson.remoting.ExportTable$Entry.release(ExportTable.java:125)
    	at hudson.remoting.ExportTable$ExportList.release(ExportTable.java:241)
    	at hudson.remoting.UserRequest.releaseExports(UserRequest.java:190)
    	at hudson.remoting.UserRequest.releaseExports(UserRequest.java:186)
    	at hudson.remoting.Channel.call(Channel.java:760)
    	at hudson.maven.ProcessCache$MavenProcess.call(ProcessCache.java:161)
    	at hudson.maven.MavenModuleSetBuild$MavenModuleSetBuildExecution.doRun(MavenModuleSetBuild.java:840)
    	at hudson.model.AbstractBuild$AbstractBuildExecution.run(AbstractBuild.java:529)
    	at hudson.model.Run.execute(Run.java:1706)
    	at hudson.maven.MavenModuleSetBuild.run(MavenModuleSetBuild.java:529)
    	at hudson.model.ResourceController.execute(ResourceController.java:88)
    	at hudson.model.Executor.run(Executor.java:232)
	at hudson.remoting.ExportTable.diagnoseInvalidId(ExportTable.java:339)
	... 14 more
Caused by:   Released at Mon Aug 03 18:20:00 UTC 2015
	at hudson.remoting.ExportTable$Entry.release(ExportTable.java:125)
	at hudson.remoting.ExportTable$ExportList.release(ExportTable.java:241)
	at hudson.remoting.UserRequest.releaseExports(UserRequest.java:190)
	at hudson.remoting.UserRequest.releaseExports(UserRequest.java:186)
	at hudson.remoting.Channel.call(Channel.java:760)
	at hudson.maven.ProcessCache$MavenProcess.call(ProcessCache.java:161)
	at hudson.maven.MavenModuleSetBuild$MavenModuleSetBuildExecution.doRun(MavenModuleSetBuild.java:840)
	at hudson.model.AbstractBuild$AbstractBuildExecution.run(AbstractBuild.java:529)
	at hudson.model.Run.execute(Run.java:1706)
	at hudson.maven.MavenModuleSetBuild.run(MavenModuleSetBuild.java:529)
	at hudson.model.ResourceController.execute(ResourceController.java:88)
	at hudson.model.Executor.run(Executor.java:232)
[ERROR] 
[ERROR] To see the full stack trace of the errors, re-run Maven with the -e switch.
[ERROR] Re-run Maven using the -X switch to enable full debug logging.
[ERROR] 
[ERROR] For more information about the errors and possible solutions, please read the following
articles:
[ERROR] [Help 1] http://cwiki.apache.org/confluence/display/MAVEN/InternalErrorException
channel stopped
Build was aborted

Mime
View raw message