deltaspike-commits mailing list archives

Site index · List index
Message view « Date » · « Thread »
Top « Date » · « Thread »
From Apache Jenkins Server <jenk...@builds.apache.org>
Subject Build failed in Jenkins: DeltaSpike RAT-Check #2363
Date Tue, 04 Aug 2015 18:45:40 GMT
See <https://builds.apache.org/job/DeltaSpike%20RAT-Check/2363/>

------------------------------------------
[...truncated 11192 lines...]
[INFO] --- maven-install-plugin:2.5.1:install (default-install) @ deltaspike-jsf-playground
---
[INFO] Installing <https://builds.apache.org/job/DeltaSpike%20RAT-Check/ws/deltaspike/examples/jsf-playground/target/ds.war>
to /home/jenkins/jenkins-slave/maven-repositories/0/org/apache/deltaspike/examples/deltaspike-jsf-playground/1.4.3-SNAPSHOT/deltaspike-jsf-playground-1.4.3-SNAPSHOT.war
[INFO] Installing <https://builds.apache.org/job/DeltaSpike%20RAT-Check/ws/deltaspike/examples/jsf-playground/pom.xml>
to /home/jenkins/jenkins-slave/maven-repositories/0/org/apache/deltaspike/examples/deltaspike-jsf-playground/1.4.3-SNAPSHOT/deltaspike-jsf-playground-1.4.3-SNAPSHOT.pom
[INFO] Installing <https://builds.apache.org/job/DeltaSpike%20RAT-Check/ws/deltaspike/examples/jsf-playground/target/ds-sources.jar>
to /home/jenkins/jenkins-slave/maven-repositories/0/org/apache/deltaspike/examples/deltaspike-jsf-playground/1.4.3-SNAPSHOT/deltaspike-jsf-playground-1.4.3-SNAPSHOT-sources.jar
Build timed out (after 30 minutes). Marking the build as failed.
[INFO] ------------------------------------------------------------------------
[INFO] Reactor Summary:
[INFO] 
[INFO] Apache DeltaSpike ................................. SUCCESS [2.981s]
[INFO] Apache DeltaSpike Sources ......................... SUCCESS [1.207s]
[INFO] Apache DeltaSpike CheckStyle-rules ................ SUCCESS [1.572s]
[INFO] Apache DeltaSpike Parent .......................... SUCCESS [3.411s]
[INFO] Apache DeltaSpike Test-Utils ...................... SUCCESS [4.679s]
[INFO] Apache DeltaSpike Code Parent ..................... SUCCESS [1.647s]
[INFO] Apache DeltaSpike Core ............................ SUCCESS [1.652s]
[INFO] Apache DeltaSpike Core-API ........................ SUCCESS [19.032s]
[INFO] Apache DeltaSpike Core-Implementation ............. SUCCESS [20.057s]
[INFO] Apache DeltaSpike ContainerControl parent ......... SUCCESS [1.278s]
[INFO] Apache DeltaSpike CDI ContainerControl API ........ SUCCESS [2.208s]
[INFO] Apache DeltaSpike CDI ContainerControl TCK ........ SUCCESS [2.250s]
[INFO] Apache DeltaSpike CDI OWB-ContainerControl ........ SUCCESS [3.235s]
[INFO] Apache DeltaSpike CDI Weld-ContainerControl ....... SUCCESS [4.101s]
[INFO] Apache DeltaSpike CDI OpenEJB-ContainerControl .... SUCCESS [9.798s]
[INFO] Apache DeltaSpike CDI Servlet-ContainerControl .... SUCCESS [4.920s]
[INFO] Apache DeltaSpike Modules ......................... SUCCESS [1.682s]
[INFO] Apache DeltaSpike Proxy-Module .................... SUCCESS [1.475s]
[INFO] Apache DeltaSpike Proxy-Module API ................ SUCCESS [5.733s]
[INFO] Apache DeltaSpike Proxy-Module Impl ASM5 .......... SUCCESS [6.270s]
[INFO] Apache DeltaSpike Security-Module ................. SUCCESS [1.311s]
[INFO] Apache DeltaSpike Security-Module API ............. SUCCESS [5.524s]
[INFO] Apache DeltaSpike Security-Module Impl ............ SUCCESS [10.581s]
[INFO] Apache DeltaSpike JPA-Module ...................... SUCCESS [1.811s]
[INFO] Apache DeltaSpike JPA-Module API .................. SUCCESS [5.451s]
[INFO] Apache DeltaSpike JPA-Module Impl ................. SUCCESS [17.203s]
[INFO] Apache DeltaSpike Servlet-Module .................. SUCCESS [1.340s]
[INFO] Apache DeltaSpike Servlet-Module API .............. SUCCESS [2.283s]
[INFO] Apache DeltaSpike Servlet-Module Impl ............. SUCCESS [2.574s]
[INFO] Apache DeltaSpike JSF-Module ...................... SUCCESS [1.518s]
[INFO] Apache DeltaSpike JSF-Module API .................. SUCCESS [2.904s]
[INFO] Apache DeltaSpike JSF-Module Impl ................. SUCCESS [16.752s]
[INFO] Apache DeltaSpike JSF-Module Impl (EE6 only) ...... SUCCESS [3.682s]
[INFO] Apache DeltaSpike Partial-Bean-Module ............. SUCCESS [1.415s]
[INFO] Apache DeltaSpike Partial-Bean-Module API ......... SUCCESS [5.343s]
[INFO] Apache DeltaSpike Partial-Bean-Module Impl ........ SUCCESS [8.942s]
[INFO] Apache DeltaSpike BeanValidation-Module ........... SUCCESS [1.285s]
[INFO] Apache DeltaSpike BeanValidation-Module API ....... SUCCESS [2.082s]
[INFO] Apache DeltaSpike BeanValidation-Module Impl ...... SUCCESS [9.186s]
[INFO] Apache DeltaSpike Data-Module ..................... SUCCESS [1.408s]
[INFO] Apache DeltaSpike Data-Module API ................. SUCCESS [5.890s]
[INFO] Apache DeltaSpike Data-Module Impl ................ SUCCESS [10.320s]
[INFO] Apache DeltaSpike Scheduler-Module ................ SUCCESS [1.611s]
[INFO] Apache DeltaSpike Scheduler-Module API ............ SUCCESS [5.510s]
[INFO] Apache DeltaSpike Scheduler-Module Impl ........... SUCCESS [7.878s]
[INFO] Apache DeltaSpike Test-Control-Module ............. SUCCESS [1.358s]
[INFO] Apache DeltaSpike Test-Control-Module API ......... SUCCESS [5.675s]
[INFO] Apache DeltaSpike Test-Control-Module Impl ........ SUCCESS [16.905s]
[INFO] Apache DeltaSpike Examples ........................ SUCCESS [1.365s]
[INFO] Apache DeltaSpike Java-SE Examples ................ SUCCESS [2.156s]
[INFO] Apache DeltaSpike JSF Examples .................... SUCCESS [2.722s]
[INFO] Apache DeltaSpike JSF Playground .................. FAILURE [29.032s]
[INFO] Apache DeltaSpike Security Example CDI ............ SKIPPED
[INFO] Apache DeltaSpike Security Example PicketLink ..... SKIPPED
[INFO] Apache DeltaSpike Java-SE Scheduler Examples ...... SKIPPED
[INFO] Apache DeltaSpike Documentation ................... SKIPPED
[INFO] Apache DeltaSpike Site ............................ SKIPPED
[INFO] ------------------------------------------------------------------------
[INFO] BUILD FAILURE
[INFO] ------------------------------------------------------------------------
[INFO] Total time: 27:49.921s
[INFO] Finished at: Tue Aug 04 18:37:16 UTC 2015
[INFO] Final Memory: 111M/926M
[INFO] ------------------------------------------------------------------------
[ERROR] Internal error: java.lang.IllegalStateException: Invalid object ID 61 iota=67: Object
was recently deallocated
[ERROR] #61 (ref.0) : [hudson.maven.MavenBuildProxy2]
[ERROR] Created at Tue Aug 04 18:14:15 UTC 2015
[ERROR] at hudson.remoting.ExportTable$Entry.<init>(ExportTable.java:93)
[ERROR] at hudson.remoting.ExportTable.export(ExportTable.java:297)
[ERROR] at hudson.remoting.Channel.internalExport(Channel.java:591)
[ERROR] at hudson.remoting.Channel.export(Channel.java:582)
[ERROR] at hudson.remoting.Channel.export(Channel.java:552)
[ERROR] at hudson.maven.MavenBuild$ProxyImpl2.writeReplace(MavenBuild.java:743)
[ERROR] at sun.reflect.GeneratedMethodAccessor618.invoke(Unknown Source)
[ERROR] at sun.reflect.DelegatingMethodAccessorImpl.invoke(DelegatingMethodAccessorImpl.java:43)
[ERROR] at java.lang.reflect.Method.invoke(Method.java:606)
[ERROR] at java.io.ObjectStreamClass.invokeWriteReplace(ObjectStreamClass.java:1075)
[ERROR] at java.io.ObjectOutputStream.writeObject0(ObjectOutputStream.java:1134)
[ERROR] at java.io.ObjectOutputStream.defaultWriteFields(ObjectOutputStream.java:1547)
[ERROR] at java.io.ObjectOutputStream.writeSerialData(ObjectOutputStream.java:1508)
[ERROR] at java.io.ObjectOutputStream.writeOrdinaryObject(ObjectOutputStream.java:1431)
[ERROR] at java.io.ObjectOutputStream.writeObject0(ObjectOutputStream.java:1177)
[ERROR] at java.io.ObjectOutputStream.writeObject(ObjectOutputStream.java:347)
[ERROR] at java.util.HashMap.writeObject(HashMap.java:1133)
[ERROR] at sun.reflect.GeneratedMethodAccessor216.invoke(Unknown Source)
[ERROR] at sun.reflect.DelegatingMethodAccessorImpl.invoke(DelegatingMethodAccessorImpl.java:43)
[ERROR] at java.lang.reflect.Method.invoke(Method.java:606)
[ERROR] at java.io.ObjectStreamClass.invokeWriteObject(ObjectStreamClass.java:988)
[ERROR] at java.io.ObjectOutputStream.writeSerialData(ObjectOutputStream.java:1495)
[ERROR] at java.io.ObjectOutputStream.writeOrdinaryObject(ObjectOutputStream.java:1431)
[ERROR] at java.io.ObjectOutputStream.writeObject0(ObjectOutputStream.java:1177)
[ERROR] at java.io.ObjectOutputStream.defaultWriteFields(ObjectOutputStream.java:1547)
[ERROR] at java.io.ObjectOutputStream.writeSerialData(ObjectOutputStream.java:1508)
[ERROR] at java.io.ObjectOutputStream.writeOrdinaryObject(ObjectOutputStream.java:1431)
[ERROR] at java.io.ObjectOutputStream.writeObject0(ObjectOutputStream.java:1177)
[ERROR] at java.io.ObjectOutputStream.writeObject(ObjectOutputStream.java:347)
[ERROR] at hudson.remoting.UserRequest._serialize(UserRequest.java:155)
[ERROR] at hudson.remoting.UserRequest.serialize(UserRequest.java:164)
[ERROR] at hudson.remoting.UserRequest.<init>(UserRequest.java:62)
[ERROR] at hudson.remoting.Channel.call(Channel.java:741)
[ERROR] at hudson.maven.ProcessCache$MavenProcess.call(ProcessCache.java:161)
[ERROR] at hudson.maven.MavenModuleSetBuild$MavenModuleSetBuildExecution.doRun(MavenModuleSetBuild.java:840)
[ERROR] at hudson.model.AbstractBuild$AbstractBuildExecution.run(AbstractBuild.java:529)
[ERROR] at hudson.model.Run.execute(Run.java:1706)
[ERROR] at hudson.maven.MavenModuleSetBuild.run(MavenModuleSetBuild.java:529)
[ERROR] at hudson.model.ResourceController.execute(ResourceController.java:88)
[ERROR] at hudson.model.Executor.run(Executor.java:232)
[ERROR] Released at Tue Aug 04 18:42:08 UTC 2015
[ERROR] at hudson.remoting.ExportTable$Entry.release(ExportTable.java:125)
[ERROR] at hudson.remoting.ExportTable$ExportList.release(ExportTable.java:241)
[ERROR] at hudson.remoting.UserRequest.releaseExports(UserRequest.java:190)
[ERROR] at hudson.remoting.UserRequest.releaseExports(UserRequest.java:186)
[ERROR] at hudson.remoting.Channel.call(Channel.java:760)
[ERROR] at hudson.maven.ProcessCache$MavenProcess.call(ProcessCache.java:161)
[ERROR] at hudson.maven.MavenModuleSetBuild$MavenModuleSetBuildExecution.doRun(MavenModuleSetBuild.java:840)
[ERROR] at hudson.model.AbstractBuild$AbstractBuildExecution.run(AbstractBuild.java:529)
[ERROR] at hudson.model.Run.execute(Run.java:1706)
[ERROR] at hudson.maven.MavenModuleSetBuild.run(MavenModuleSetBuild.java:529)
[ERROR] at hudson.model.ResourceController.execute(ResourceController.java:88)
[ERROR] at hudson.model.Executor.run(Executor.java:232): ReleasedAt
[ERROR] -> [Help 1]
org.apache.maven.InternalErrorException: Internal error: java.lang.IllegalStateException:
Invalid object ID 61 iota=67
	at org.apache.maven.DefaultMaven.execute(DefaultMaven.java:168)
	at org.jvnet.hudson.maven3.launcher.Maven3Launcher.main(Maven3Launcher.java:117)
	at sun.reflect.NativeMethodAccessorImpl.invoke0(Native Method)
	at sun.reflect.NativeMethodAccessorImpl.invoke(NativeMethodAccessorImpl.java:57)
	at sun.reflect.DelegatingMethodAccessorImpl.invoke(DelegatingMethodAccessorImpl.java:43)
	at java.lang.reflect.Method.invoke(Method.java:606)
	at org.codehaus.plexus.classworlds.launcher.Launcher.launchStandard(Launcher.java:329)
	at org.codehaus.plexus.classworlds.launcher.Launcher.launch(Launcher.java:239)
	at org.jvnet.hudson.maven3.agent.Maven3Main.launch(Maven3Main.java:178)
	at sun.reflect.NativeMethodAccessorImpl.invoke0(Native Method)
	at sun.reflect.NativeMethodAccessorImpl.invoke(NativeMethodAccessorImpl.java:57)
	at sun.reflect.DelegatingMethodAccessorImpl.invoke(DelegatingMethodAccessorImpl.java:43)
	at java.lang.reflect.Method.invoke(Method.java:606)
	at hudson.maven.Maven3Builder.call(Maven3Builder.java:136)
	at hudson.maven.Maven3Builder.call(Maven3Builder.java:71)
	at hudson.remoting.UserRequest.perform(UserRequest.java:118)
	at hudson.remoting.UserRequest.perform(UserRequest.java:48)
	at hudson.remoting.Request$2.run(Request.java:328)
	at hudson.remoting.InterceptingExecutorService$1.call(InterceptingExecutorService.java:72)
	at java.util.concurrent.FutureTask$Sync.innerRun(FutureTask.java:334)
	at java.util.concurrent.FutureTask.run(FutureTask.java:166)
	at java.util.concurrent.ThreadPoolExecutor.runWorker(ThreadPoolExecutor.java:1145)
	at java.util.concurrent.ThreadPoolExecutor$Worker.run(ThreadPoolExecutor.java:615)
	at java.lang.Thread.run(Thread.java:724)
Caused by: java.lang.IllegalStateException: Invalid object ID 61 iota=67
	at hudson.remoting.ExportTable.diagnoseInvalidId(ExportTable.java:346)
	at hudson.remoting.ExportTable.get(ExportTable.java:322)
	at hudson.remoting.Channel.getExportedObject(Channel.java:595)
	at hudson.remoting.RemoteInvocationHandler$RPCRequest.perform(RemoteInvocationHandler.java:301)
	at hudson.remoting.RemoteInvocationHandler$RPCRequest.call(RemoteInvocationHandler.java:290)
	at hudson.remoting.RemoteInvocationHandler$RPCRequest.call(RemoteInvocationHandler.java:249)
	at hudson.remoting.UserRequest.perform(UserRequest.java:118)
	at hudson.remoting.UserRequest.perform(UserRequest.java:48)
	at hudson.remoting.Request$2.run(Request.java:328)
	at hudson.remoting.InterceptingExecutorService$1.call(InterceptingExecutorService.java:72)
	at jenkins.util.ContextResettingExecutorService$2.call(ContextResettingExecutorService.java:46)
	at java.util.concurrent.FutureTask.run(FutureTask.java:262)
	at java.util.concurrent.ThreadPoolExecutor.runWorker(ThreadPoolExecutor.java:1145)
	at java.util.concurrent.ThreadPoolExecutor$Worker.run(ThreadPoolExecutor.java:615)
	at java.lang.Thread.run(Thread.java:745)
Caused by: java.lang.Exception: Object was recently deallocated
    #61 (ref.0) : [hudson.maven.MavenBuildProxy2]
      Created at Tue Aug 04 18:14:15 UTC 2015
    	at hudson.remoting.ExportTable$Entry.<init>(ExportTable.java:93)
    	at hudson.remoting.ExportTable.export(ExportTable.java:297)
    	at hudson.remoting.Channel.internalExport(Channel.java:591)
    	at hudson.remoting.Channel.export(Channel.java:582)
    	at hudson.remoting.Channel.export(Channel.java:552)
    	at hudson.maven.MavenBuild$ProxyImpl2.writeReplace(MavenBuild.java:743)
    	at sun.reflect.GeneratedMethodAccessor618.invoke(Unknown Source)
    	at sun.reflect.DelegatingMethodAccessorImpl.invoke(DelegatingMethodAccessorImpl.java:43)
    	at java.lang.reflect.Method.invoke(Method.java:606)
    	at java.io.ObjectStreamClass.invokeWriteReplace(ObjectStreamClass.java:1075)
    	at java.io.ObjectOutputStream.writeObject0(ObjectOutputStream.java:1134)
    	at java.io.ObjectOutputStream.defaultWriteFields(ObjectOutputStream.java:1547)
    	at java.io.ObjectOutputStream.writeSerialData(ObjectOutputStream.java:1508)
    	at java.io.ObjectOutputStream.writeOrdinaryObject(ObjectOutputStream.java:1431)
    	at java.io.ObjectOutputStream.writeObject0(ObjectOutputStream.java:1177)
    	at java.io.ObjectOutputStream.writeObject(ObjectOutputStream.java:347)
    	at java.util.HashMap.writeObject(HashMap.java:1133)
    	at sun.reflect.GeneratedMethodAccessor216.invoke(Unknown Source)
    	at sun.reflect.DelegatingMethodAccessorImpl.invoke(DelegatingMethodAccessorImpl.java:43)
    	at java.lang.reflect.Method.invoke(Method.java:606)
    	at java.io.ObjectStreamClass.invokeWriteObject(ObjectStreamClass.java:988)
    	at java.io.ObjectOutputStream.writeSerialData(ObjectOutputStream.java:1495)
    	at java.io.ObjectOutputStream.writeOrdinaryObject(ObjectOutputStream.java:1431)
    	at java.io.ObjectOutputStream.writeObject0(ObjectOutputStream.java:1177)
    	at java.io.ObjectOutputStream.defaultWriteFields(ObjectOutputStream.java:1547)
    	at java.io.ObjectOutputStream.writeSerialData(ObjectOutputStream.java:1508)
    	at java.io.ObjectOutputStream.writeOrdinaryObject(ObjectOutputStream.java:1431)
    	at java.io.ObjectOutputStream.writeObject0(ObjectOutputStream.java:1177)
    	at java.io.ObjectOutputStream.writeObject(ObjectOutputStream.java:347)
    	at hudson.remoting.UserRequest._serialize(UserRequest.java:155)
    	at hudson.remoting.UserRequest.serialize(UserRequest.java:164)
    	at hudson.remoting.UserRequest.<init>(UserRequest.java:62)
    	at hudson.remoting.Channel.call(Channel.java:741)
    	at hudson.maven.ProcessCache$MavenProcess.call(ProcessCache.java:161)
    	at hudson.maven.MavenModuleSetBuild$MavenModuleSetBuildExecution.doRun(MavenModuleSetBuild.java:840)
    	at hudson.model.AbstractBuild$AbstractBuildExecution.run(AbstractBuild.java:529)
    	at hudson.model.Run.execute(Run.java:1706)
    	at hudson.maven.MavenModuleSetBuild.run(MavenModuleSetBuild.java:529)
    	at hudson.model.ResourceController.execute(ResourceController.java:88)
    	at hudson.model.Executor.run(Executor.java:232)
      Released at Tue Aug 04 18:42:08 UTC 2015
    	at hudson.remoting.ExportTable$Entry.release(ExportTable.java:125)
    	at hudson.remoting.ExportTable$ExportList.release(ExportTable.java:241)
    	at hudson.remoting.UserRequest.releaseExports(UserRequest.java:190)
    	at hudson.remoting.UserRequest.releaseExports(UserRequest.java:186)
    	at hudson.remoting.Channel.call(Channel.java:760)
    	at hudson.maven.ProcessCache$MavenProcess.call(ProcessCache.java:161)
    	at hudson.maven.MavenModuleSetBuild$MavenModuleSetBuildExecution.doRun(MavenModuleSetBuild.java:840)
    	at hudson.model.AbstractBuild$AbstractBuildExecution.run(AbstractBuild.java:529)
    	at hudson.model.Run.execute(Run.java:1706)
    	at hudson.maven.MavenModuleSetBuild.run(MavenModuleSetBuild.java:529)
    	at hudson.model.ResourceController.execute(ResourceController.java:88)
    	at hudson.model.Executor.run(Executor.java:232)
	at hudson.remoting.ExportTable.diagnoseInvalidId(ExportTable.java:339)
	... 14 more
Caused by:   Released at Tue Aug 04 18:42:08 UTC 2015
	at hudson.remoting.ExportTable$Entry.release(ExportTable.java:125)
	at hudson.remoting.ExportTable$ExportList.release(ExportTable.java:241)
	at hudson.remoting.UserRequest.releaseExports(UserRequest.java:190)
	at hudson.remoting.UserRequest.releaseExports(UserRequest.java:186)
	at hudson.remoting.Channel.call(Channel.java:760)
	at hudson.maven.ProcessCache$MavenProcess.call(ProcessCache.java:161)
	at hudson.maven.MavenModuleSetBuild$MavenModuleSetBuildExecution.doRun(MavenModuleSetBuild.java:840)
	at hudson.model.AbstractBuild$AbstractBuildExecution.run(AbstractBuild.java:529)
	at hudson.model.Run.execute(Run.java:1706)
	at hudson.maven.MavenModuleSetBuild.run(MavenModuleSetBuild.java:529)
	at hudson.model.ResourceController.execute(ResourceController.java:88)
	at hudson.model.Executor.run(Executor.java:232)
[ERROR] 
[ERROR] To see the full stack trace of the errors, re-run Maven with the -e switch.
[ERROR] Re-run Maven using the -X switch to enable full debug logging.
[ERROR] 
[ERROR] For more information about the errors and possible solutions, please read the following
articles:
[ERROR] [Help 1] http://cwiki.apache.org/confluence/display/MAVEN/InternalErrorException
channel stopped
Build was aborted

Mime
View raw message