deltaspike-commits mailing list archives

Site index · List index
Message view « Date » · « Thread »
Top « Date » · « Thread »
From Apache Jenkins Server <jenk...@builds.apache.org>
Subject Build failed in Jenkins: DeltaSpike Weld 3.0.0 Alpha 10 #117
Date Tue, 16 Jun 2015 11:05:38 GMT
See <https://builds.apache.org/job/DeltaSpike%20Weld%203.0.0%20Alpha%2010/117/changes>

Changes:

[hwellmann] DELTASPIKE-922 OSGi support for Security Module

[hwellmann] DELTASPIKE-931 Integration tests fail when dependencies are class

[hwellmann] DELTASPIKE-933 Upgrade to Arquillian 1.1.8.Final

[hwellmann] DELTASPIKE-929 missing dependency in Weld test profile

------------------------------------------
Started by user gpetracek
Building remotely on ubuntu-1 (docker Ubuntu ubuntu ubuntu1) in workspace <https://builds.apache.org/job/DeltaSpike%20Weld%203.0.0%20Alpha%2010/ws/>
 > git rev-parse --is-inside-work-tree # timeout=10
Fetching changes from the remote Git repository
 > git config remote.origin.url https://git-wip-us.apache.org/repos/asf/deltaspike.git
# timeout=10
Fetching upstream changes from https://git-wip-us.apache.org/repos/asf/deltaspike.git
 > git --version # timeout=10
 > git fetch --tags --progress https://git-wip-us.apache.org/repos/asf/deltaspike.git +refs/heads/*:refs/remotes/origin/*
 > git rev-parse origin/master^{commit} # timeout=10
Checking out Revision 34cbc6788123ed9605ead8fb4b31bc994ba7c139 (origin/master)
 > git config core.sparsecheckout # timeout=10
 > git checkout -f 34cbc6788123ed9605ead8fb4b31bc994ba7c139
 > git rev-list 263cf43d8e3f781f08e8e9527f40f2d94d168f88 # timeout=10
Parsing POMs
Failed to transfer Could not find artifact org.jboss.arquillian:arquillian-bom:pom:1.1.8.Final
in Apache Repository (https://repository.apache.org/content/repositories/releases)
Failed to transfer Could not find artifact org.jboss.arquillian:arquillian-bom:pom:1.1.8.Final
in Apache Snapshot Repository (https://repository.apache.org/content/repositories/snapshots)
Downloaded artifact http://repo.maven.apache.org/maven2/org/jboss/arquillian/arquillian-bom/1.1.8.Final/arquillian-bom-1.1.8.Final.pom
Modules changed, recalculating dependency graph
maven3-agent.jar already up to date
maven3-interceptor.jar already up to date
maven3-interceptor-commons.jar already up to date
[DeltaSpike Weld 3.0.0 Alpha 10] $ /home/jenkins/tools/java/jdk1.8.0/bin/java -Xmx2g -Xms256m
-XX:MaxPermSize=512m -cp /home/jenkins/jenkins-slave/maven3-agent.jar:/home/jenkins/tools/maven/apache-maven-3.0.4/boot/plexus-classworlds-2.4.jar
org.jvnet.hudson.maven3.agent.Maven3Main /home/jenkins/tools/maven/apache-maven-3.0.4 /home/jenkins/jenkins-slave/slave.jar
/home/jenkins/jenkins-slave/maven3-interceptor.jar /home/jenkins/jenkins-slave/maven3-interceptor-commons.jar
46766
Java HotSpot(TM) 64-Bit Server VM warning: ignoring option MaxPermSize=512m; support was removed
in 8.0
<===[JENKINS REMOTING CAPACITY]===>   channel started
Executing Maven:  -B -f <https://builds.apache.org/job/DeltaSpike%20Weld%203.0.0%20Alpha%2010/ws/pom.xml>
-Dmaven.repo.local=/home/jenkins/jenkins-slave/maven-repositories/0 clean install -PWeld -Dweld.version=3.0.0.Alpha10
[INFO] Scanning for projects...
[ERROR] The build could not read 3 projects -> [Help 1]
[ERROR]   
[ERROR]   The project org.apache.deltaspike:parent-code:1.4.2-SNAPSHOT (<https://builds.apache.org/job/DeltaSpike%20Weld%203.0.0%20Alpha%2010/ws/deltaspike/parent/code/pom.xml)>
has 1 error
[ERROR]     'dependencies.dependency.version' for org.jboss.weld:weld-core:jar is missing.
@ line 358, column 29
[ERROR]   
[ERROR]   The project org.apache.deltaspike.core:core-project:1.4.2-SNAPSHOT (<https://builds.apache.org/job/DeltaSpike%20Weld%203.0.0%20Alpha%2010/ws/deltaspike/core/pom.xml)>
has 1 error
[ERROR]     'dependencies.dependency.version' for org.jboss.weld:weld-core:jar is missing.
@ org.apache.deltaspike:parent-code:1.4.2-SNAPSHOT, <https://builds.apache.org/job/DeltaSpike%20Weld%203.0.0%20Alpha%2010/ws/deltaspike/parent/code/pom.xml,>
line 358, column 29
[ERROR]   
[ERROR]   The project org.apache.deltaspike.modules:modules-project:1.4.2-SNAPSHOT (<https://builds.apache.org/job/DeltaSpike%20Weld%203.0.0%20Alpha%2010/ws/deltaspike/modules/pom.xml)>
has 1 error
[ERROR]     'dependencies.dependency.version' for org.jboss.weld:weld-core:jar is missing.
@ org.apache.deltaspike:parent-code:1.4.2-SNAPSHOT, <https://builds.apache.org/job/DeltaSpike%20Weld%203.0.0%20Alpha%2010/ws/deltaspike/parent/code/pom.xml,>
line 358, column 29
[ERROR] 
[ERROR] To see the full stack trace of the errors, re-run Maven with the -e switch.
[ERROR] Re-run Maven using the -X switch to enable full debug logging.
[ERROR] 
[ERROR] For more information about the errors and possible solutions, please read the following
articles:
[ERROR] [Help 1] http://cwiki.apache.org/confluence/display/MAVEN/ProjectBuildingException
channel stopped

Mime
View raw message