deltaspike-commits mailing list archives

Site index · List index
Message view « Date » · « Thread »
Top « Date » · « Thread »
From Apache Jenkins Server <jenk...@builds.apache.org>
Subject Build failed in Jenkins: DeltaSpike Deploy #1110
Date Tue, 05 May 2015 13:41:27 GMT
See <https://builds.apache.org/job/DeltaSpike%20Deploy/1110/changes>

Changes:

[rafabene] DELTASPIKE-882 - Create a new module for Proxy API

[rafabene] DELTASPIKE-882 - Fix Tests for Partial Bean and JSF Impl

[tandraschko] DELTASPIKE-851 added some javadoc

[tandraschko] DELTASPIKE-851 added some javadoc

[rafabene] DELTASPIKE-893 - Remove erroneous WarpTest annotation

[rsmeral] DELTASPIKE-892 type-safe static config

[rsmeral] DELTASPIKE-885 Static DeltaSpike configuration should be easy to find in code base

------------------------------------------
Started by timer
Building remotely on jenkins-ubuntu-1404-4gb-b93 (jenkins-cloud-4GB cloud-slave Ubuntu ubuntu)
in workspace <https://builds.apache.org/job/DeltaSpike%20Deploy/ws/>
Cloning the remote Git repository
Cloning repository https://git-wip-us.apache.org/repos/asf/deltaspike.git
 > git init <https://builds.apache.org/job/DeltaSpike%20Deploy/ws/> # timeout=10
Fetching upstream changes from https://git-wip-us.apache.org/repos/asf/deltaspike.git
 > git --version # timeout=10
 > git fetch --tags --progress https://git-wip-us.apache.org/repos/asf/deltaspike.git +refs/heads/*:refs/remotes/origin/*
 > git config remote.origin.url https://git-wip-us.apache.org/repos/asf/deltaspike.git
# timeout=10
 > git config remote.origin.fetch +refs/heads/*:refs/remotes/origin/* # timeout=10
 > git config remote.origin.url https://git-wip-us.apache.org/repos/asf/deltaspike.git
# timeout=10
Fetching upstream changes from https://git-wip-us.apache.org/repos/asf/deltaspike.git
 > git fetch --tags --progress https://git-wip-us.apache.org/repos/asf/deltaspike.git +refs/heads/*:refs/remotes/origin/*
Seen branch in repository origin/deltaspike-0.1-incubating
Seen branch in repository origin/deltaspike-0.2-incubating
Seen branch in repository origin/deltaspike-0.3-incubating
Seen branch in repository origin/deltaspike-0.4
Seen branch in repository origin/deltaspike-0.5
Seen branch in repository origin/deltaspike-0.6
Seen branch in repository origin/deltaspike-0.7
Seen branch in repository origin/deltaspike-1.0.0
Seen branch in repository origin/deltaspike-1.0.1
Seen branch in repository origin/deltaspike-1.0.2
Seen branch in repository origin/deltaspike-1.0.3
Seen branch in repository origin/deltaspike-1.1.0
Seen branch in repository origin/deltaspike-1.2.0
Seen branch in repository origin/deltaspike-1.2.1
Seen branch in repository origin/master
Seen 15 remote branches
Checking out Revision f1c4404476d4cbfbd76c962d41a39f5187f04211 (origin/master)
 > git config core.sparsecheckout # timeout=10
 > git checkout -f f1c4404476d4cbfbd76c962d41a39f5187f04211
 > git rev-list 625e784fc4b353a640e73abbc610bb5c88619792 # timeout=10
Parsing POMs
Failed to transfer Could not find artifact org.jboss.arquillian:arquillian-bom:pom:1.1.4.Final
in Apache Repository (https://repository.apache.org/content/repositories/releases)
Failed to transfer Could not find artifact org.jboss.arquillian:arquillian-bom:pom:1.1.4.Final
in Apache Snapshot Repository (https://repository.apache.org/content/repositories/snapshots)
Downloaded artifact http://repo.maven.apache.org/maven2/org/jboss/arquillian/arquillian-bom/1.1.4.Final/arquillian-bom-1.1.4.Final.pom
Failed to transfer Could not find artifact org.jboss.shrinkwrap.resolver:shrinkwrap-resolver-bom:pom:2.1.0
in Apache Repository (https://repository.apache.org/content/repositories/releases)
Failed to transfer Could not find artifact org.jboss.shrinkwrap.resolver:shrinkwrap-resolver-bom:pom:2.1.0
in Apache Snapshot Repository (https://repository.apache.org/content/repositories/snapshots)
Downloaded artifact http://repo.maven.apache.org/maven2/org/jboss/shrinkwrap/resolver/shrinkwrap-resolver-bom/2.1.0/shrinkwrap-resolver-bom-2.1.0.pom
Failed to transfer Could not find artifact org.jboss.shrinkwrap.descriptors:shrinkwrap-descriptors-bom:pom:2.0.0-alpha-5
in Apache Repository (https://repository.apache.org/content/repositories/releases)
Failed to transfer Could not find artifact org.jboss.shrinkwrap.descriptors:shrinkwrap-descriptors-bom:pom:2.0.0-alpha-5
in Apache Snapshot Repository (https://repository.apache.org/content/repositories/snapshots)
Downloaded artifact http://repo.maven.apache.org/maven2/org/jboss/shrinkwrap/descriptors/shrinkwrap-descriptors-bom/2.0.0-alpha-5/shrinkwrap-descriptors-bom-2.0.0-alpha-5.pom
Failed to transfer Could not find artifact org.jboss.shrinkwrap.resolver:shrinkwrap-resolver-bom:pom:2.0.0
in Apache Repository (https://repository.apache.org/content/repositories/releases)
Failed to transfer Could not find artifact org.jboss.shrinkwrap.resolver:shrinkwrap-resolver-bom:pom:2.0.0
in Apache Snapshot Repository (https://repository.apache.org/content/repositories/snapshots)
Downloaded artifact http://repo.maven.apache.org/maven2/org/jboss/shrinkwrap/resolver/shrinkwrap-resolver-bom/2.0.0/shrinkwrap-resolver-bom-2.0.0.pom
ERROR: Failed to parse POMs
java.io.IOException: remote file operation failed: <https://builds.apache.org/job/DeltaSpike%20Deploy/ws/>
at hudson.remoting.Channel@253c0fc6:jenkins-ubuntu-1404-4gb-b93
	at hudson.FilePath.act(FilePath.java:916)
	at hudson.FilePath.act(FilePath.java:893)
	at hudson.maven.MavenModuleSetBuild$MavenModuleSetBuildExecution.parsePoms(MavenModuleSetBuild.java:950)
	at hudson.maven.MavenModuleSetBuild$MavenModuleSetBuildExecution.doRun(MavenModuleSetBuild.java:677)
	at hudson.model.AbstractBuild$AbstractBuildExecution.run(AbstractBuild.java:529)
	at hudson.model.Run.execute(Run.java:1706)
	at hudson.maven.MavenModuleSetBuild.run(MavenModuleSetBuild.java:529)
	at hudson.model.ResourceController.execute(ResourceController.java:88)
	at hudson.model.Executor.run(Executor.java:232)
Caused by: hudson.remoting.ProxyException: hudson.maven.MavenModuleSetBuild$MavenExecutionException:
org.apache.maven.project.ProjectBuildingException: Some problems were encountered while processing
the POMs:
[ERROR] Malformed POM <https://builds.apache.org/job/DeltaSpike%20Deploy/ws/deltaspike/dist/pom.xml>:
Unrecognised tag: 'dependency' (position: START_TAG seen ...</dependencies>\n\n    
   <dependency>... @221:21)  @ <https://builds.apache.org/job/DeltaSpike%20Deploy/ws/deltaspike/dist/pom.xml,>
line 221, column 21

	at hudson.maven.MavenModuleSetBuild$PomParser.invoke(MavenModuleSetBuild.java:1354)
	at hudson.maven.MavenModuleSetBuild$PomParser.invoke(MavenModuleSetBuild.java:1088)
	at hudson.FilePath$FileCallableWrapper.call(FilePath.java:2474)
	at hudson.remoting.UserRequest.perform(UserRequest.java:118)
	at hudson.remoting.UserRequest.perform(UserRequest.java:48)
	at hudson.remoting.Request$2.run(Request.java:328)
	at hudson.remoting.InterceptingExecutorService$1.call(InterceptingExecutorService.java:72)
	at java.util.concurrent.FutureTask.run(FutureTask.java:262)
	at java.util.concurrent.ThreadPoolExecutor.runWorker(ThreadPoolExecutor.java:1145)
	at java.util.concurrent.ThreadPoolExecutor$Worker.run(ThreadPoolExecutor.java:615)
	at java.lang.Thread.run(Thread.java:745)
Caused by: hudson.remoting.ProxyException: org.apache.maven.project.ProjectBuildingException:
Some problems were encountered while processing the POMs:
[ERROR] Malformed POM <https://builds.apache.org/job/DeltaSpike%20Deploy/ws/deltaspike/dist/pom.xml>:
Unrecognised tag: 'dependency' (position: START_TAG seen ...</dependencies>\n\n    
   <dependency>... @221:21)  @ <https://builds.apache.org/job/DeltaSpike%20Deploy/ws/deltaspike/dist/pom.xml,>
line 221, column 21

	at org.apache.maven.project.DefaultProjectBuilder.build(DefaultProjectBuilder.java:364)
	at hudson.maven.MavenEmbedder.buildProjects(MavenEmbedder.java:361)
	at hudson.maven.MavenEmbedder.readProjects(MavenEmbedder.java:331)
	at hudson.maven.MavenModuleSetBuild$PomParser.invoke(MavenModuleSetBuild.java:1291)
	... 10 more

Mime
View raw message