deltaspike-commits mailing list archives

Site index · List index
Message view « Date » · « Thread »
Top « Date » · « Thread »
From Apache Jenkins Server <jenk...@builds.apache.org>
Subject Build failed in Jenkins: DeltaSpike Weld 2.2.0 #304
Date Wed, 04 Mar 2015 09:41:36 GMT
See <https://builds.apache.org/job/DeltaSpike%20Weld%202.2.0/304/>

------------------------------------------
[...truncated 10364 lines...]
[JENKINS] Archiving <https://builds.apache.org/job/DeltaSpike%20Weld%202.2.0/ws/deltaspike/modules/servlet/api/target/deltaspike-servlet-module-api-1.2.2-SNAPSHOT.jar>
to org.apache.deltaspike.modules/deltaspike-servlet-module-api/1.2.2-SNAPSHOT/deltaspike-servlet-module-api-1.2.2-SNAPSHOT.jar
[JENKINS] Archiving <https://builds.apache.org/job/DeltaSpike%20Weld%202.2.0/ws/deltaspike/modules/servlet/api/target/deltaspike-servlet-module-api-1.2.2-SNAPSHOT-tests.jar>
to org.apache.deltaspike.modules/deltaspike-servlet-module-api/1.2.2-SNAPSHOT/deltaspike-servlet-module-api-1.2.2-SNAPSHOT-tests.jar
[JENKINS] Archiving <https://builds.apache.org/job/DeltaSpike%20Weld%202.2.0/ws/deltaspike/modules/servlet/api/target/deltaspike-servlet-module-api-1.2.2-SNAPSHOT-sources.jar>
to org.apache.deltaspike.modules/deltaspike-servlet-module-api/1.2.2-SNAPSHOT/deltaspike-servlet-module-api-1.2.2-SNAPSHOT-sources.jar
Sending artifact delta relative to DeltaSpike Weld 2.2.0 » Apache DeltaSpike Servlet-Module
API #303
Archived 4 artifacts
Archive block size is 32768
Received 0 blocks and 27890 bytes
Compression is 0.0%
Took 75 ms
[JENKINS] Archiving <https://builds.apache.org/job/DeltaSpike%20Weld%202.2.0/ws/deltaspike/modules/jpa/pom.xml>
to org.apache.deltaspike.modules/jpa-module-project/1.2.2-SNAPSHOT/jpa-module-project-1.2.2-SNAPSHOT.pom
[JENKINS] Archiving <https://builds.apache.org/job/DeltaSpike%20Weld%202.2.0/ws/deltaspike/modules/jpa/target/jpa-module-project-1.2.2-SNAPSHOT-tests.jar>
to org.apache.deltaspike.modules/jpa-module-project/1.2.2-SNAPSHOT/jpa-module-project-1.2.2-SNAPSHOT-tests.jar
Sending artifact delta relative to DeltaSpike Weld 2.2.0 » Apache DeltaSpike JPA-Module #303
Archived 2 artifacts
Archive block size is 32768
Received 0 blocks and 4384 bytes
Compression is 0.0%
Took 72 ms
[JENKINS] Archiving <https://builds.apache.org/job/DeltaSpike%20Weld%202.2.0/ws/deltaspike/cdictrl/pom.xml>
to org.apache.deltaspike.cdictrl/cdictrl-project/1.2.2-SNAPSHOT/cdictrl-project-1.2.2-SNAPSHOT.pom
Sending artifact delta relative to DeltaSpike Weld 2.2.0 » Apache DeltaSpike ContainerControl
parent #303
Archived 1 artifacts
Archive block size is 32768
Received 0 blocks and 1849 bytes
Compression is 0.0%
Took 71 ms
[JENKINS] Archiving <https://builds.apache.org/job/DeltaSpike%20Weld%202.2.0/ws/deltaspike/modules/scheduler/api/pom.xml>
to org.apache.deltaspike.modules/deltaspike-scheduler-module-api/1.2.2-SNAPSHOT/deltaspike-scheduler-module-api-1.2.2-SNAPSHOT.pom
[JENKINS] Archiving <https://builds.apache.org/job/DeltaSpike%20Weld%202.2.0/ws/deltaspike/modules/scheduler/api/target/deltaspike-scheduler-module-api-1.2.2-SNAPSHOT.jar>
to org.apache.deltaspike.modules/deltaspike-scheduler-module-api/1.2.2-SNAPSHOT/deltaspike-scheduler-module-api-1.2.2-SNAPSHOT.jar
[JENKINS] Archiving <https://builds.apache.org/job/DeltaSpike%20Weld%202.2.0/ws/deltaspike/modules/scheduler/api/target/deltaspike-scheduler-module-api-1.2.2-SNAPSHOT-tests.jar>
to org.apache.deltaspike.modules/deltaspike-scheduler-module-api/1.2.2-SNAPSHOT/deltaspike-scheduler-module-api-1.2.2-SNAPSHOT-tests.jar
[JENKINS] Archiving <https://builds.apache.org/job/DeltaSpike%20Weld%202.2.0/ws/deltaspike/modules/scheduler/api/target/deltaspike-scheduler-module-api-1.2.2-SNAPSHOT-sources.jar>
to org.apache.deltaspike.modules/deltaspike-scheduler-module-api/1.2.2-SNAPSHOT/deltaspike-scheduler-module-api-1.2.2-SNAPSHOT-sources.jar
Sending artifact delta relative to DeltaSpike Weld 2.2.0 » Apache DeltaSpike Scheduler-Module
API #303
Archived 4 artifacts
Archive block size is 32768
Received 0 blocks and 30936 bytes
Compression is 0.0%
Took 75 ms
[JENKINS] Archiving <https://builds.apache.org/job/DeltaSpike%20Weld%202.2.0/ws/deltaspike/modules/test-control/impl/pom.xml>
to org.apache.deltaspike.modules/deltaspike-test-control-module-impl/1.2.2-SNAPSHOT/deltaspike-test-control-module-impl-1.2.2-SNAPSHOT.pom
[JENKINS] Archiving <https://builds.apache.org/job/DeltaSpike%20Weld%202.2.0/ws/deltaspike/modules/test-control/impl/target/deltaspike-test-control-module-impl-1.2.2-SNAPSHOT.jar>
to org.apache.deltaspike.modules/deltaspike-test-control-module-impl/1.2.2-SNAPSHOT/deltaspike-test-control-module-impl-1.2.2-SNAPSHOT.jar
[JENKINS] Archiving <https://builds.apache.org/job/DeltaSpike%20Weld%202.2.0/ws/deltaspike/modules/test-control/impl/target/deltaspike-test-control-module-impl-1.2.2-SNAPSHOT-tests.jar>
to org.apache.deltaspike.modules/deltaspike-test-control-module-impl/1.2.2-SNAPSHOT/deltaspike-test-control-module-impl-1.2.2-SNAPSHOT-tests.jar
[JENKINS] Archiving <https://builds.apache.org/job/DeltaSpike%20Weld%202.2.0/ws/deltaspike/modules/test-control/impl/target/deltaspike-test-control-module-impl-1.2.2-SNAPSHOT-sources.jar>
to org.apache.deltaspike.modules/deltaspike-test-control-module-impl/1.2.2-SNAPSHOT/deltaspike-test-control-module-impl-1.2.2-SNAPSHOT-sources.jar
Sending artifact delta relative to DeltaSpike Weld 2.2.0 » Apache DeltaSpike Test-Control-Module
Impl #303
Archived 4 artifacts
Archive block size is 32768
Received 0 blocks and 186924 bytes
Compression is 0.0%
Took 0.11 sec
[JENKINS] Archiving <https://builds.apache.org/job/DeltaSpike%20Weld%202.2.0/ws/deltaspike/modules/servlet/pom.xml>
to org.apache.deltaspike.modules/servlet-module-project/1.2.2-SNAPSHOT/servlet-module-project-1.2.2-SNAPSHOT.pom
[JENKINS] Archiving <https://builds.apache.org/job/DeltaSpike%20Weld%202.2.0/ws/deltaspike/modules/servlet/target/servlet-module-project-1.2.2-SNAPSHOT-tests.jar>
to org.apache.deltaspike.modules/servlet-module-project/1.2.2-SNAPSHOT/servlet-module-project-1.2.2-SNAPSHOT-tests.jar
Sending artifact delta relative to DeltaSpike Weld 2.2.0 » Apache DeltaSpike Servlet-Module
#303
Archived 2 artifacts
Archive block size is 32768
Received 0 blocks and 4604 bytes
Compression is 0.0%
Took 76 ms
[JENKINS] Archiving <https://builds.apache.org/job/DeltaSpike%20Weld%202.2.0/ws/deltaspike/modules/test-control/api/pom.xml>
to org.apache.deltaspike.modules/deltaspike-test-control-module-api/1.2.2-SNAPSHOT/deltaspike-test-control-module-api-1.2.2-SNAPSHOT.pom
[JENKINS] Archiving <https://builds.apache.org/job/DeltaSpike%20Weld%202.2.0/ws/deltaspike/modules/test-control/api/target/deltaspike-test-control-module-api-1.2.2-SNAPSHOT.jar>
to org.apache.deltaspike.modules/deltaspike-test-control-module-api/1.2.2-SNAPSHOT/deltaspike-test-control-module-api-1.2.2-SNAPSHOT.jar
[JENKINS] Archiving <https://builds.apache.org/job/DeltaSpike%20Weld%202.2.0/ws/deltaspike/modules/test-control/api/target/deltaspike-test-control-module-api-1.2.2-SNAPSHOT-tests.jar>
to org.apache.deltaspike.modules/deltaspike-test-control-module-api/1.2.2-SNAPSHOT/deltaspike-test-control-module-api-1.2.2-SNAPSHOT-tests.jar
[JENKINS] Archiving <https://builds.apache.org/job/DeltaSpike%20Weld%202.2.0/ws/deltaspike/modules/test-control/api/target/deltaspike-test-control-module-api-1.2.2-SNAPSHOT-sources.jar>
to org.apache.deltaspike.modules/deltaspike-test-control-module-api/1.2.2-SNAPSHOT/deltaspike-test-control-module-api-1.2.2-SNAPSHOT-sources.jar
Sending artifact delta relative to DeltaSpike Weld 2.2.0 » Apache DeltaSpike Test-Control-Module
API #303
Archived 4 artifacts
Archive block size is 32768
Received 0 blocks and 71614 bytes
Compression is 0.0%
Took 0.11 sec
[JENKINS] Archiving <https://builds.apache.org/job/DeltaSpike%20Weld%202.2.0/ws/deltaspike/modules/jsf/impl-ee6/pom.xml>
to org.apache.deltaspike.modules/deltaspike-jsf-module-impl-ee6/1.2.2-SNAPSHOT/deltaspike-jsf-module-impl-ee6-1.2.2-SNAPSHOT.pom
[JENKINS] Archiving <https://builds.apache.org/job/DeltaSpike%20Weld%202.2.0/ws/deltaspike/modules/jsf/impl-ee6/target/deltaspike-jsf-module-impl-ee6-1.2.2-SNAPSHOT.jar>
to org.apache.deltaspike.modules/deltaspike-jsf-module-impl-ee6/1.2.2-SNAPSHOT/deltaspike-jsf-module-impl-ee6-1.2.2-SNAPSHOT.jar
[JENKINS] Archiving <https://builds.apache.org/job/DeltaSpike%20Weld%202.2.0/ws/deltaspike/modules/jsf/impl-ee6/target/deltaspike-jsf-module-impl-ee6-1.2.2-SNAPSHOT-tests.jar>
to org.apache.deltaspike.modules/deltaspike-jsf-module-impl-ee6/1.2.2-SNAPSHOT/deltaspike-jsf-module-impl-ee6-1.2.2-SNAPSHOT-tests.jar
[JENKINS] Archiving <https://builds.apache.org/job/DeltaSpike%20Weld%202.2.0/ws/deltaspike/modules/jsf/impl-ee6/target/deltaspike-jsf-module-impl-ee6-1.2.2-SNAPSHOT-sources.jar>
to org.apache.deltaspike.modules/deltaspike-jsf-module-impl-ee6/1.2.2-SNAPSHOT/deltaspike-jsf-module-impl-ee6-1.2.2-SNAPSHOT-sources.jar
Sending artifact delta relative to DeltaSpike Weld 2.2.0 » Apache DeltaSpike JSF-Module Impl
(EE6 only) #303
Archived 4 artifacts
Archive block size is 32768
Received 0 blocks and 355299 bytes
Compression is 0.0%
Took 0.16 sec
[JENKINS] Archiving <https://builds.apache.org/job/DeltaSpike%20Weld%202.2.0/ws/deltaspike/modules/partial-bean/api/pom.xml>
to org.apache.deltaspike.modules/deltaspike-partial-bean-module-api/1.2.2-SNAPSHOT/deltaspike-partial-bean-module-api-1.2.2-SNAPSHOT.pom
[JENKINS] Archiving <https://builds.apache.org/job/DeltaSpike%20Weld%202.2.0/ws/deltaspike/modules/partial-bean/api/target/deltaspike-partial-bean-module-api-1.2.2-SNAPSHOT.jar>
to org.apache.deltaspike.modules/deltaspike-partial-bean-module-api/1.2.2-SNAPSHOT/deltaspike-partial-bean-module-api-1.2.2-SNAPSHOT.jar
[JENKINS] Archiving <https://builds.apache.org/job/DeltaSpike%20Weld%202.2.0/ws/deltaspike/modules/partial-bean/api/target/deltaspike-partial-bean-module-api-1.2.2-SNAPSHOT-tests.jar>
to org.apache.deltaspike.modules/deltaspike-partial-bean-module-api/1.2.2-SNAPSHOT/deltaspike-partial-bean-module-api-1.2.2-SNAPSHOT-tests.jar
[JENKINS] Archiving <https://builds.apache.org/job/DeltaSpike%20Weld%202.2.0/ws/deltaspike/modules/partial-bean/api/target/deltaspike-partial-bean-module-api-1.2.2-SNAPSHOT-sources.jar>
to org.apache.deltaspike.modules/deltaspike-partial-bean-module-api/1.2.2-SNAPSHOT/deltaspike-partial-bean-module-api-1.2.2-SNAPSHOT-sources.jar
Sending artifact delta relative to DeltaSpike Weld 2.2.0 » Apache DeltaSpike Partial-Bean-Module
API #303
Archived 4 artifacts
Archive block size is 32768
Received 0 blocks and 28741 bytes
Compression is 0.0%
Took 86 ms
[JENKINS] Archiving <https://builds.apache.org/job/DeltaSpike%20Weld%202.2.0/ws/deltaspike/modules/scheduler/impl/pom.xml>
to org.apache.deltaspike.modules/deltaspike-scheduler-module-impl/1.2.2-SNAPSHOT/deltaspike-scheduler-module-impl-1.2.2-SNAPSHOT.pom
[JENKINS] Archiving <https://builds.apache.org/job/DeltaSpike%20Weld%202.2.0/ws/deltaspike/modules/scheduler/impl/target/deltaspike-scheduler-module-impl-1.2.2-SNAPSHOT.jar>
to org.apache.deltaspike.modules/deltaspike-scheduler-module-impl/1.2.2-SNAPSHOT/deltaspike-scheduler-module-impl-1.2.2-SNAPSHOT.jar
[JENKINS] Archiving <https://builds.apache.org/job/DeltaSpike%20Weld%202.2.0/ws/deltaspike/modules/scheduler/impl/target/deltaspike-scheduler-module-impl-1.2.2-SNAPSHOT-tests.jar>
to org.apache.deltaspike.modules/deltaspike-scheduler-module-impl/1.2.2-SNAPSHOT/deltaspike-scheduler-module-impl-1.2.2-SNAPSHOT-tests.jar
[JENKINS] Archiving <https://builds.apache.org/job/DeltaSpike%20Weld%202.2.0/ws/deltaspike/modules/scheduler/impl/target/deltaspike-scheduler-module-impl-1.2.2-SNAPSHOT-sources.jar>
to org.apache.deltaspike.modules/deltaspike-scheduler-module-impl/1.2.2-SNAPSHOT/deltaspike-scheduler-module-impl-1.2.2-SNAPSHOT-sources.jar
Sending artifact delta relative to DeltaSpike Weld 2.2.0 » Apache DeltaSpike Scheduler-Module
Impl #303
Archived 4 artifacts
Archive block size is 32768
Received 0 blocks and 79168 bytes
Compression is 0.0%
Took 86 ms
[JENKINS] Archiving <https://builds.apache.org/job/DeltaSpike%20Weld%202.2.0/ws/deltaspike/parent/pom.xml>
to org.apache.deltaspike/parent/1.2.2-SNAPSHOT/parent-1.2.2-SNAPSHOT.pom
Sending artifact delta relative to DeltaSpike Weld 2.2.0 » Apache DeltaSpike Parent #303
Archived 1 artifacts
Archive block size is 32768
Received 1 blocks and 5854 bytes
Compression is 84.8%
Took 73 ms
[JENKINS] Archiving <https://builds.apache.org/job/DeltaSpike%20Weld%202.2.0/ws/deltaspike/core/pom.xml>
to org.apache.deltaspike.core/core-project/1.2.2-SNAPSHOT/core-project-1.2.2-SNAPSHOT.pom
[JENKINS] Archiving <https://builds.apache.org/job/DeltaSpike%20Weld%202.2.0/ws/deltaspike/core/target/core-project-1.2.2-SNAPSHOT-tests.jar>
to org.apache.deltaspike.core/core-project/1.2.2-SNAPSHOT/core-project-1.2.2-SNAPSHOT-tests.jar
Sending artifact delta relative to DeltaSpike Weld 2.2.0 » Apache DeltaSpike Core #303
Archived 2 artifacts
Archive block size is 32768
Received 0 blocks and 4012 bytes
Compression is 0.0%
Took 72 ms
[JENKINS] Archiving <https://builds.apache.org/job/DeltaSpike%20Weld%202.2.0/ws/deltaspike/modules/bean-validation/api/pom.xml>
to org.apache.deltaspike.modules/deltaspike-bean-validation-module-api/1.2.2-SNAPSHOT/deltaspike-bean-validation-module-api-1.2.2-SNAPSHOT.pom
[JENKINS] Archiving <https://builds.apache.org/job/DeltaSpike%20Weld%202.2.0/ws/deltaspike/modules/bean-validation/api/target/deltaspike-bean-validation-module-api-1.2.2-SNAPSHOT.jar>
to org.apache.deltaspike.modules/deltaspike-bean-validation-module-api/1.2.2-SNAPSHOT/deltaspike-bean-validation-module-api-1.2.2-SNAPSHOT.jar
[JENKINS] Archiving <https://builds.apache.org/job/DeltaSpike%20Weld%202.2.0/ws/deltaspike/modules/bean-validation/api/target/deltaspike-bean-validation-module-api-1.2.2-SNAPSHOT-tests.jar>
to org.apache.deltaspike.modules/deltaspike-bean-validation-module-api/1.2.2-SNAPSHOT/deltaspike-bean-validation-module-api-1.2.2-SNAPSHOT-tests.jar
[JENKINS] Archiving <https://builds.apache.org/job/DeltaSpike%20Weld%202.2.0/ws/deltaspike/modules/bean-validation/api/target/deltaspike-bean-validation-module-api-1.2.2-SNAPSHOT-sources.jar>
to org.apache.deltaspike.modules/deltaspike-bean-validation-module-api/1.2.2-SNAPSHOT/deltaspike-bean-validation-module-api-1.2.2-SNAPSHOT-sources.jar
Sending artifact delta relative to DeltaSpike Weld 2.2.0 » Apache DeltaSpike BeanValidation-Module
API #303
Archived 4 artifacts
Archive block size is 32768
Received 0 blocks and 22772 bytes
Compression is 0.0%
Took 75 ms
[JENKINS] Archiving <https://builds.apache.org/job/DeltaSpike%20Weld%202.2.0/ws/deltaspike/core/api/pom.xml>
to org.apache.deltaspike.core/deltaspike-core-api/1.2.2-SNAPSHOT/deltaspike-core-api-1.2.2-SNAPSHOT.pom
[JENKINS] Archiving <https://builds.apache.org/job/DeltaSpike%20Weld%202.2.0/ws/deltaspike/core/api/target/deltaspike-core-api-1.2.2-SNAPSHOT.jar>
to org.apache.deltaspike.core/deltaspike-core-api/1.2.2-SNAPSHOT/deltaspike-core-api-1.2.2-SNAPSHOT.jar
[JENKINS] Archiving <https://builds.apache.org/job/DeltaSpike%20Weld%202.2.0/ws/deltaspike/core/api/target/deltaspike-core-api-1.2.2-SNAPSHOT-tests.jar>
to org.apache.deltaspike.core/deltaspike-core-api/1.2.2-SNAPSHOT/deltaspike-core-api-1.2.2-SNAPSHOT-tests.jar
[JENKINS] Archiving <https://builds.apache.org/job/DeltaSpike%20Weld%202.2.0/ws/deltaspike/core/api/target/deltaspike-core-api-1.2.2-SNAPSHOT-sources.jar>
to org.apache.deltaspike.core/deltaspike-core-api/1.2.2-SNAPSHOT/deltaspike-core-api-1.2.2-SNAPSHOT-sources.jar
Sending artifact delta relative to DeltaSpike Weld 2.2.0 » Apache DeltaSpike Core-API #303
Archived 4 artifacts
Archive block size is 32768
Received 0 blocks and 503754 bytes
Compression is 0.0%
Took 0.31 sec
[JENKINS] Archiving <https://builds.apache.org/job/DeltaSpike%20Weld%202.2.0/ws/deltaspike/modules/security/impl/pom.xml>
to org.apache.deltaspike.modules/deltaspike-security-module-impl/1.2.2-SNAPSHOT/deltaspike-security-module-impl-1.2.2-SNAPSHOT.pom
[JENKINS] Archiving <https://builds.apache.org/job/DeltaSpike%20Weld%202.2.0/ws/deltaspike/modules/security/impl/target/deltaspike-security-module-impl-1.2.2-SNAPSHOT.jar>
to org.apache.deltaspike.modules/deltaspike-security-module-impl/1.2.2-SNAPSHOT/deltaspike-security-module-impl-1.2.2-SNAPSHOT.jar
[JENKINS] Archiving <https://builds.apache.org/job/DeltaSpike%20Weld%202.2.0/ws/deltaspike/modules/security/impl/target/deltaspike-security-module-impl-1.2.2-SNAPSHOT-tests.jar>
to org.apache.deltaspike.modules/deltaspike-security-module-impl/1.2.2-SNAPSHOT/deltaspike-security-module-impl-1.2.2-SNAPSHOT-tests.jar
[JENKINS] Archiving <https://builds.apache.org/job/DeltaSpike%20Weld%202.2.0/ws/deltaspike/modules/security/impl/target/deltaspike-security-module-impl-1.2.2-SNAPSHOT-sources.jar>
to org.apache.deltaspike.modules/deltaspike-security-module-impl/1.2.2-SNAPSHOT/deltaspike-security-module-impl-1.2.2-SNAPSHOT-sources.jar
Sending artifact delta relative to DeltaSpike Weld 2.2.0 » Apache DeltaSpike Security-Module
Impl #303
Archived 4 artifacts
Archive block size is 32768
Received 0 blocks and 123763 bytes
Compression is 0.0%
Took 0.18 sec
[JENKINS] Archiving <https://builds.apache.org/job/DeltaSpike%20Weld%202.2.0/ws/deltaspike/modules/scheduler/pom.xml>
to org.apache.deltaspike.modules/scheduler-module-project/1.2.2-SNAPSHOT/scheduler-module-project-1.2.2-SNAPSHOT.pom
[JENKINS] Archiving <https://builds.apache.org/job/DeltaSpike%20Weld%202.2.0/ws/deltaspike/modules/scheduler/target/scheduler-module-project-1.2.2-SNAPSHOT-tests.jar>
to org.apache.deltaspike.modules/scheduler-module-project/1.2.2-SNAPSHOT/scheduler-module-project-1.2.2-SNAPSHOT-tests.jar
Sending artifact delta relative to DeltaSpike Weld 2.2.0 » Apache DeltaSpike Scheduler-Module
#303
Archived 2 artifacts
Archive block size is 32768
Received 0 blocks and 4170 bytes
Compression is 0.0%
Took 88 ms
[JENKINS] Archiving <https://builds.apache.org/job/DeltaSpike%20Weld%202.2.0/ws/deltaspike/examples/jsf-playground/pom.xml>
to org.apache.deltaspike.examples/deltaspike-jsf-playground/1.2.2-SNAPSHOT/deltaspike-jsf-playground-1.2.2-SNAPSHOT.pom
[JENKINS] Archiving <https://builds.apache.org/job/DeltaSpike%20Weld%202.2.0/ws/deltaspike/examples/jsf-playground/target/ds.war>
to org.apache.deltaspike.examples/deltaspike-jsf-playground/1.2.2-SNAPSHOT/deltaspike-jsf-playground-1.2.2-SNAPSHOT.war
[JENKINS] Archiving <https://builds.apache.org/job/DeltaSpike%20Weld%202.2.0/ws/deltaspike/examples/jsf-playground/target/ds-sources.jar>
to org.apache.deltaspike.examples/deltaspike-jsf-playground/1.2.2-SNAPSHOT/deltaspike-jsf-playground-1.2.2-SNAPSHOT-sources.jar
Sending artifact delta relative to DeltaSpike Weld 2.2.0 » Apache DeltaSpike JSF Playground
#303
Archived 3 artifacts
Archive block size is 32768
Received 0 blocks and 649239 bytes
Compression is 0.0%
Took 0.3 sec
[JENKINS] Archiving <https://builds.apache.org/job/DeltaSpike%20Weld%202.2.0/ws/deltaspike/modules/servlet/impl/pom.xml>
to org.apache.deltaspike.modules/deltaspike-servlet-module-impl/1.2.2-SNAPSHOT/deltaspike-servlet-module-impl-1.2.2-SNAPSHOT.pom
[JENKINS] Archiving <https://builds.apache.org/job/DeltaSpike%20Weld%202.2.0/ws/deltaspike/modules/servlet/impl/target/deltaspike-servlet-module-impl-1.2.2-SNAPSHOT.jar>
to org.apache.deltaspike.modules/deltaspike-servlet-module-impl/1.2.2-SNAPSHOT/deltaspike-servlet-module-impl-1.2.2-SNAPSHOT.jar
[JENKINS] Archiving <https://builds.apache.org/job/DeltaSpike%20Weld%202.2.0/ws/deltaspike/modules/servlet/impl/target/deltaspike-servlet-module-impl-1.2.2-SNAPSHOT-tests.jar>
to org.apache.deltaspike.modules/deltaspike-servlet-module-impl/1.2.2-SNAPSHOT/deltaspike-servlet-module-impl-1.2.2-SNAPSHOT-tests.jar
[JENKINS] Archiving <https://builds.apache.org/job/DeltaSpike%20Weld%202.2.0/ws/deltaspike/modules/servlet/impl/target/deltaspike-servlet-module-impl-1.2.2-SNAPSHOT-sources.jar>
to org.apache.deltaspike.modules/deltaspike-servlet-module-impl/1.2.2-SNAPSHOT/deltaspike-servlet-module-impl-1.2.2-SNAPSHOT-sources.jar
Sending artifact delta relative to DeltaSpike Weld 2.2.0 » Apache DeltaSpike Servlet-Module
Impl #303
Archived 4 artifacts
Archive block size is 32768
Received 0 blocks and 75327 bytes
Compression is 0.0%
Took 90 ms
[JENKINS] Archiving <https://builds.apache.org/job/DeltaSpike%20Weld%202.2.0/ws/deltaspike/modules/bean-validation/impl/pom.xml>
to org.apache.deltaspike.modules/deltaspike-bean-validation-module-impl/1.2.2-SNAPSHOT/deltaspike-bean-validation-module-impl-1.2.2-SNAPSHOT.pom
[JENKINS] Archiving <https://builds.apache.org/job/DeltaSpike%20Weld%202.2.0/ws/deltaspike/modules/bean-validation/impl/target/deltaspike-bean-validation-module-impl-1.2.2-SNAPSHOT.jar>
to org.apache.deltaspike.modules/deltaspike-bean-validation-module-impl/1.2.2-SNAPSHOT/deltaspike-bean-validation-module-impl-1.2.2-SNAPSHOT.jar
[JENKINS] Archiving <https://builds.apache.org/job/DeltaSpike%20Weld%202.2.0/ws/deltaspike/modules/bean-validation/impl/target/deltaspike-bean-validation-module-impl-1.2.2-SNAPSHOT-tests.jar>
to org.apache.deltaspike.modules/deltaspike-bean-validation-module-impl/1.2.2-SNAPSHOT/deltaspike-bean-validation-module-impl-1.2.2-SNAPSHOT-tests.jar
[JENKINS] Archiving <https://builds.apache.org/job/DeltaSpike%20Weld%202.2.0/ws/deltaspike/modules/bean-validation/impl/target/deltaspike-bean-validation-module-impl-1.2.2-SNAPSHOT-sources.jar>
to org.apache.deltaspike.modules/deltaspike-bean-validation-module-impl/1.2.2-SNAPSHOT/deltaspike-bean-validation-module-impl-1.2.2-SNAPSHOT-sources.jar
Sending artifact delta relative to DeltaSpike Weld 2.2.0 » Apache DeltaSpike BeanValidation-Module
Impl #303
Archived 4 artifacts
Archive block size is 32768
Received 0 blocks and 35272 bytes
Compression is 0.0%
Took 77 ms
[JENKINS] Archiving <https://builds.apache.org/job/DeltaSpike%20Weld%202.2.0/ws/deltaspike/cdictrl/impl-owb/pom.xml>
to org.apache.deltaspike.cdictrl/deltaspike-cdictrl-owb/1.2.2-SNAPSHOT/deltaspike-cdictrl-owb-1.2.2-SNAPSHOT.pom
[JENKINS] Archiving <https://builds.apache.org/job/DeltaSpike%20Weld%202.2.0/ws/deltaspike/cdictrl/impl-owb/target/deltaspike-cdictrl-owb-1.2.2-SNAPSHOT.jar>
to org.apache.deltaspike.cdictrl/deltaspike-cdictrl-owb/1.2.2-SNAPSHOT/deltaspike-cdictrl-owb-1.2.2-SNAPSHOT.jar
[JENKINS] Archiving <https://builds.apache.org/job/DeltaSpike%20Weld%202.2.0/ws/deltaspike/cdictrl/impl-owb/target/deltaspike-cdictrl-owb-1.2.2-SNAPSHOT-sources.jar>
to org.apache.deltaspike.cdictrl/deltaspike-cdictrl-owb/1.2.2-SNAPSHOT/deltaspike-cdictrl-owb-1.2.2-SNAPSHOT-sources.jar
Sending artifact delta relative to DeltaSpike Weld 2.2.0 » Apache DeltaSpike CDI OWB-ContainerControl
#303
Archived 3 artifacts
Archive block size is 32768
Received 0 blocks and 40859 bytes
Compression is 0.0%
Took 77 ms
[JENKINS] Archiving <https://builds.apache.org/job/DeltaSpike%20Weld%202.2.0/ws/deltaspike/modules/jpa/impl/pom.xml>
to org.apache.deltaspike.modules/deltaspike-jpa-module-impl/1.2.2-SNAPSHOT/deltaspike-jpa-module-impl-1.2.2-SNAPSHOT.pom
[JENKINS] Archiving <https://builds.apache.org/job/DeltaSpike%20Weld%202.2.0/ws/deltaspike/modules/jpa/impl/target/deltaspike-jpa-module-impl-1.2.2-SNAPSHOT.jar>
to org.apache.deltaspike.modules/deltaspike-jpa-module-impl/1.2.2-SNAPSHOT/deltaspike-jpa-module-impl-1.2.2-SNAPSHOT.jar
[JENKINS] Archiving <https://builds.apache.org/job/DeltaSpike%20Weld%202.2.0/ws/deltaspike/modules/jpa/impl/target/deltaspike-jpa-module-impl-1.2.2-SNAPSHOT-tests.jar>
to org.apache.deltaspike.modules/deltaspike-jpa-module-impl/1.2.2-SNAPSHOT/deltaspike-jpa-module-impl-1.2.2-SNAPSHOT-tests.jar
[JENKINS] Archiving <https://builds.apache.org/job/DeltaSpike%20Weld%202.2.0/ws/deltaspike/modules/jpa/impl/target/deltaspike-jpa-module-impl-1.2.2-SNAPSHOT-sources.jar>
to org.apache.deltaspike.modules/deltaspike-jpa-module-impl/1.2.2-SNAPSHOT/deltaspike-jpa-module-impl-1.2.2-SNAPSHOT-sources.jar
Sending artifact delta relative to DeltaSpike Weld 2.2.0 » Apache DeltaSpike JPA-Module Impl
#303
Archived 4 artifacts
Archive block size is 32768
Received 0 blocks and 235676 bytes
Compression is 0.0%
Took 0.12 sec
[JENKINS] Archiving <https://builds.apache.org/job/DeltaSpike%20Weld%202.2.0/ws/deltaspike/modules/data/pom.xml>
to org.apache.deltaspike.modules/data-module-project/1.2.2-SNAPSHOT/data-module-project-1.2.2-SNAPSHOT.pom
[JENKINS] Archiving <https://builds.apache.org/job/DeltaSpike%20Weld%202.2.0/ws/deltaspike/modules/data/target/data-module-project-1.2.2-SNAPSHOT-tests.jar>
to org.apache.deltaspike.modules/data-module-project/1.2.2-SNAPSHOT/data-module-project-1.2.2-SNAPSHOT-tests.jar
Sending artifact delta relative to DeltaSpike Weld 2.2.0 » Apache DeltaSpike Data-Module
#303
Archived 2 artifacts
Archive block size is 32768
Received 0 blocks and 4958 bytes
Compression is 0.0%
Took 73 ms
[JENKINS] Archiving <https://builds.apache.org/job/DeltaSpike%20Weld%202.2.0/ws/deltaspike/pom.xml>
to org.apache.deltaspike/deltaspike-project/1.2.2-SNAPSHOT/deltaspike-project-1.2.2-SNAPSHOT.pom
Sending artifact delta relative to DeltaSpike Weld 2.2.0 » Apache DeltaSpike Sources #303
Archived 1 artifacts
Archive block size is 32768
Received 0 blocks and 9916 bytes
Compression is 0.0%
Took 72 ms
[JENKINS] Archiving <https://builds.apache.org/job/DeltaSpike%20Weld%202.2.0/ws/deltaspike/modules/security/api/pom.xml>
to org.apache.deltaspike.modules/deltaspike-security-module-api/1.2.2-SNAPSHOT/deltaspike-security-module-api-1.2.2-SNAPSHOT.pom
[JENKINS] Archiving <https://builds.apache.org/job/DeltaSpike%20Weld%202.2.0/ws/deltaspike/modules/security/api/target/deltaspike-security-module-api-1.2.2-SNAPSHOT.jar>
to org.apache.deltaspike.modules/deltaspike-security-module-api/1.2.2-SNAPSHOT/deltaspike-security-module-api-1.2.2-SNAPSHOT.jar
[JENKINS] Archiving <https://builds.apache.org/job/DeltaSpike%20Weld%202.2.0/ws/deltaspike/modules/security/api/target/deltaspike-security-module-api-1.2.2-SNAPSHOT-tests.jar>
to org.apache.deltaspike.modules/deltaspike-security-module-api/1.2.2-SNAPSHOT/deltaspike-security-module-api-1.2.2-SNAPSHOT-tests.jar
[JENKINS] Archiving <https://builds.apache.org/job/DeltaSpike%20Weld%202.2.0/ws/deltaspike/modules/security/api/target/deltaspike-security-module-api-1.2.2-SNAPSHOT-sources.jar>
to org.apache.deltaspike.modules/deltaspike-security-module-api/1.2.2-SNAPSHOT/deltaspike-security-module-api-1.2.2-SNAPSHOT-sources.jar
Sending artifact delta relative to DeltaSpike Weld 2.2.0 » Apache DeltaSpike Security-Module
API #303
Archived 4 artifacts
Archive block size is 32768
Received 0 blocks and 59180 bytes
Compression is 0.0%
Took 83 ms
channel stopped
FATAL: hudson.remoting.RequestAbortedException: hudson.remoting.Channel$OrderlyShutdown: java.util.concurrent.TimeoutException:
Ping started on 1425461169683 hasn't completed at 1425461409683
hudson.remoting.RequestAbortedException: hudson.remoting.RequestAbortedException: hudson.remoting.Channel$OrderlyShutdown:
java.util.concurrent.TimeoutException: Ping started on 1425461169683 hasn't completed at 1425461409683
	at hudson.remoting.RequestAbortedException.wrapForRethrow(RequestAbortedException.java:41)
	at hudson.remoting.RequestAbortedException.wrapForRethrow(RequestAbortedException.java:34)
	at hudson.remoting.Request.call(Request.java:174)
	at hudson.remoting.Channel.call(Channel.java:742)
	at hudson.Launcher$RemoteLauncher.kill(Launcher.java:918)
	at hudson.model.AbstractBuild$AbstractBuildExecution.run(AbstractBuild.java:552)
	at hudson.model.Run.execute(Run.java:1706)
	at hudson.maven.MavenModuleSetBuild.run(MavenModuleSetBuild.java:529)
	at hudson.model.ResourceController.execute(ResourceController.java:88)
	at hudson.model.Executor.run(Executor.java:232)
Caused by: hudson.remoting.RequestAbortedException: hudson.remoting.Channel$OrderlyShutdown:
java.util.concurrent.TimeoutException: Ping started on 1425461169683 hasn't completed at 1425461409683
	at hudson.remoting.Request.abort(Request.java:299)
	at hudson.remoting.Channel.terminate(Channel.java:805)
	at hudson.remoting.Channel$CloseCommand.execute(Channel.java:954)
	at hudson.remoting.Channel$2.handle(Channel.java:474)
	at hudson.remoting.SynchronousCommandTransport$ReaderThread.run(SynchronousCommandTransport.java:60)
Caused by: hudson.remoting.Channel$OrderlyShutdown: java.util.concurrent.TimeoutException:
Ping started on 1425461169683 hasn't completed at 1425461409683
	... 3 more
Caused by: Command close created at
	at hudson.remoting.Command.<init>(Command.java:56)
	at hudson.remoting.Channel$CloseCommand.<init>(Channel.java:948)
	at hudson.remoting.Channel$CloseCommand.<init>(Channel.java:946)
	at hudson.remoting.Channel.close(Channel.java:1029)
	at hudson.slaves.ChannelPinger$1.onDead(ChannelPinger.java:110)
	at hudson.remoting.PingThread.ping(PingThread.java:120)
	at hudson.remoting.PingThread.run(PingThread.java:81)
Caused by: java.util.concurrent.TimeoutException: Ping started on 1425461169683 hasn't completed
at 1425461409683
	... 2 more

Mime
View raw message