deltaspike-commits mailing list archives

Site index · List index
Message view « Date » · « Thread »
Top « Date » · « Thread »
From Apache Jenkins Server <jenk...@builds.apache.org>
Subject Build failed in Jenkins: DeltaSpike Weld 3.0.0 Alpha2 #2
Date Thu, 04 Dec 2014 14:19:39 GMT
See <https://builds.apache.org/job/DeltaSpike%20Weld%203.0.0%20Alpha2/2/changes>

Changes:

[gpetracek] [maven-release-plugin] prepare release deltaspike-project-1.2.0

[gpetracek] [maven-release-plugin] prepare for next development iteration

------------------------------------------
[...truncated 1594 lines...]
Downloading: https://repository.apache.org/content/repositories/snapshots/org/jboss/weld/se/weld-se/3.0.0.Alpha2/weld-se-3.0.0.Alpha2.jar
Downloading: http://repo.maven.apache.org/maven2/org/jboss/weld/se/weld-se/3.0.0.Alpha2/weld-se-3.0.0.Alpha2.jar
[INFO] ------------------------------------------------------------------------
[INFO] Reactor Summary:
[INFO] 
[INFO] Apache DeltaSpike ................................. SUCCESS [2.648s]
[INFO] Apache DeltaSpike CheckStyle-rules ................ SUCCESS [1.673s]
[INFO] Apache DeltaSpike Parent .......................... SUCCESS [3.107s]
[INFO] Apache DeltaSpike Test-Utils ...................... SUCCESS [4.436s]
[INFO] Apache DeltaSpike Code Parent ..................... SUCCESS [3.373s]
[INFO] Apache DeltaSpike Core ............................ SUCCESS [1.527s]
[INFO] Apache DeltaSpike Core-API ........................ SUCCESS [19.343s]
[INFO] Apache DeltaSpike Core-Implementation ............. SUCCESS [29.283s]
[INFO] Apache DeltaSpike ContainerControl parent ......... SUCCESS [1.309s]
[INFO] Apache DeltaSpike CDI ContainerControl API ........ SUCCESS [2.331s]
[INFO] Apache DeltaSpike CDI ContainerControl TCK ........ SUCCESS [2.500s]
[INFO] Apache DeltaSpike CDI OWB-ContainerControl ........ SUCCESS [4.255s]
[INFO] Apache DeltaSpike CDI Weld-ContainerControl ....... FAILURE [0.910s]
[INFO] Apache DeltaSpike CDI OpenEJB-ContainerControl .... SKIPPED
[INFO] Apache DeltaSpike CDI Servlet-ContainerControl .... SKIPPED
[INFO] Apache DeltaSpike Modules ......................... SKIPPED
[INFO] Apache DeltaSpike Security-Module ................. SKIPPED
[INFO] Apache DeltaSpike Security-Module API ............. SKIPPED
[INFO] Apache DeltaSpike Security-Module Impl ............ SKIPPED
[INFO] Apache DeltaSpike JPA-Module ...................... SKIPPED
[INFO] Apache DeltaSpike JPA-Module API .................. SKIPPED
[INFO] Apache DeltaSpike JPA-Module Impl ................. SKIPPED
[INFO] Apache DeltaSpike Servlet-Module .................. SKIPPED
[INFO] Apache DeltaSpike Servlet-Module API .............. SKIPPED
[INFO] Apache DeltaSpike Servlet-Module Impl ............. SKIPPED
[INFO] Apache DeltaSpike JSF-Module ...................... SKIPPED
[INFO] Apache DeltaSpike JSF-Module API .................. SKIPPED
[INFO] Apache DeltaSpike JSF-Module Impl ................. SKIPPED
[INFO] Apache DeltaSpike JSF-Module Impl (EE6 only) ...... SKIPPED
[INFO] Apache DeltaSpike Partial-Bean-Module ............. SKIPPED
[INFO] Apache DeltaSpike Partial-Bean-Module API ......... SKIPPED
[INFO] Apache DeltaSpike Partial-Bean-Module Impl ........ SKIPPED
[INFO] Apache DeltaSpike BeanValidation-Module ........... SKIPPED
[INFO] Apache DeltaSpike BeanValidation-Module API ....... SKIPPED
[INFO] Apache DeltaSpike BeanValidation-Module Impl ...... SKIPPED
[INFO] Apache DeltaSpike Data-Module ..................... SKIPPED
[INFO] Apache DeltaSpike Data-Module API ................. SKIPPED
[INFO] Apache DeltaSpike Data-Module Impl ................ SKIPPED
[INFO] Apache DeltaSpike Scheduler-Module ................ SKIPPED
[INFO] Apache DeltaSpike Scheduler-Module API ............ SKIPPED
[INFO] Apache DeltaSpike Scheduler-Module Impl ........... SKIPPED
[INFO] Apache DeltaSpike Test-Control-Module ............. SKIPPED
[INFO] Apache DeltaSpike Test-Control-Module API ......... SKIPPED
[INFO] Apache DeltaSpike Test-Control-Module Impl ........ SKIPPED
[INFO] Apache DeltaSpike Examples ........................ SKIPPED
[INFO] Apache DeltaSpike Java-SE Examples ................ SKIPPED
[INFO] Apache DeltaSpike JSF Examples .................... SKIPPED
[INFO] Apache DeltaSpike JSF Playground .................. SKIPPED
[INFO] Apache DeltaSpike Java-SE Scheduler Examples ...... SKIPPED
[INFO] ------------------------------------------------------------------------
[INFO] BUILD FAILURE
[INFO] ------------------------------------------------------------------------
[INFO] Total time: 1:28.211s
[INFO] Finished at: Thu Dec 04 14:19:13 UTC 2014
[INFO] Final Memory: 60M/575M
[INFO] ------------------------------------------------------------------------
Waiting for Jenkins to finish collecting data[ERROR] Failed to execute goal on project deltaspike-cdictrl-weld:
Could not resolve dependencies for project org.apache.deltaspike.cdictrl:deltaspike-cdictrl-weld:jar:1.2.1-SNAPSHOT:
Could not find artifact org.jboss.weld.se:weld-se:jar:3.0.0.Alpha2 in Apache Repository (https://repository.apache.org/content/repositories/releases)
-> [Help 1]
[ERROR] 
[ERROR] To see the full stack trace of the errors, re-run Maven with the -e switch.
[ERROR] Re-run Maven using the -X switch to enable full debug logging.
[ERROR] 
[ERROR] For more information about the errors and possible solutions, please read the following
articles:
[ERROR] [Help 1] http://cwiki.apache.org/confluence/display/MAVEN/DependencyResolutionException
[ERROR] 
[ERROR] After correcting the problems, you can resume the build with the command
[ERROR]   mvn <goals> -rf :deltaspike-cdictrl-weld

[JENKINS] Archiving <https://builds.apache.org/job/DeltaSpike%20Weld%203.0.0%20Alpha2/ws/deltaspike/examples/jse-examples/pom.xml>
to org.apache.deltaspike.examples/deltaspike-jse-example/1.2.1-SNAPSHOT/deltaspike-jse-example-1.2.1-SNAPSHOT.pom
No prior successful build to compare, so performing full copy of artifacts
[JENKINS] Archiving <https://builds.apache.org/job/DeltaSpike%20Weld%203.0.0%20Alpha2/ws/deltaspike/test-utils/pom.xml>
to org.apache.deltaspike.test/test-utils/1.2.1-SNAPSHOT/test-utils-1.2.1-SNAPSHOT.pom
[JENKINS] Archiving <https://builds.apache.org/job/DeltaSpike%20Weld%203.0.0%20Alpha2/ws/deltaspike/test-utils/target/test-utils-1.2.1-SNAPSHOT.jar>
to org.apache.deltaspike.test/test-utils/1.2.1-SNAPSHOT/test-utils-1.2.1-SNAPSHOT.jar
[JENKINS] Archiving <https://builds.apache.org/job/DeltaSpike%20Weld%203.0.0%20Alpha2/ws/deltaspike/test-utils/target/test-utils-1.2.1-SNAPSHOT-sources.jar>
to org.apache.deltaspike.test/test-utils/1.2.1-SNAPSHOT/test-utils-1.2.1-SNAPSHOT-sources.jar
Sending artifact delta relative to DeltaSpike Weld 3.0.0 Alpha2 » Apache DeltaSpike Test-Utils
#1
Archived 3 artifacts
Archive block size is 32768
Received 0 blocks and 52688 bytes
Compression is 0.0%
Took 0.12 sec
[JENKINS] Archiving <https://builds.apache.org/job/DeltaSpike%20Weld%203.0.0%20Alpha2/ws/deltaspike/modules/data/impl/pom.xml>
to org.apache.deltaspike.modules/deltaspike-data-module-impl/1.2.1-SNAPSHOT/deltaspike-data-module-impl-1.2.1-SNAPSHOT.pom
No prior successful build to compare, so performing full copy of artifacts
[JENKINS] Archiving <https://builds.apache.org/job/DeltaSpike%20Weld%203.0.0%20Alpha2/ws/deltaspike/modules/data/api/pom.xml>
to org.apache.deltaspike.modules/deltaspike-data-module-api/1.2.1-SNAPSHOT/deltaspike-data-module-api-1.2.1-SNAPSHOT.pom
No prior successful build to compare, so performing full copy of artifacts
[JENKINS] Archiving <https://builds.apache.org/job/DeltaSpike%20Weld%203.0.0%20Alpha2/ws/deltaspike/core/impl/pom.xml>
to org.apache.deltaspike.core/deltaspike-core-impl/1.2.1-SNAPSHOT/deltaspike-core-impl-1.2.1-SNAPSHOT.pom
[JENKINS] Archiving <https://builds.apache.org/job/DeltaSpike%20Weld%203.0.0%20Alpha2/ws/deltaspike/core/impl/target/deltaspike-core-impl-1.2.1-SNAPSHOT.jar>
to org.apache.deltaspike.core/deltaspike-core-impl/1.2.1-SNAPSHOT/deltaspike-core-impl-1.2.1-SNAPSHOT.jar
[JENKINS] Archiving <https://builds.apache.org/job/DeltaSpike%20Weld%203.0.0%20Alpha2/ws/deltaspike/core/impl/target/deltaspike-core-impl-1.2.1-SNAPSHOT-tests.jar>
to org.apache.deltaspike.core/deltaspike-core-impl/1.2.1-SNAPSHOT/deltaspike-core-impl-1.2.1-SNAPSHOT-tests.jar
[JENKINS] Archiving <https://builds.apache.org/job/DeltaSpike%20Weld%203.0.0%20Alpha2/ws/deltaspike/core/impl/target/deltaspike-core-impl-1.2.1-SNAPSHOT-sources.jar>
to org.apache.deltaspike.core/deltaspike-core-impl/1.2.1-SNAPSHOT/deltaspike-core-impl-1.2.1-SNAPSHOT-sources.jar
Sending artifact delta relative to DeltaSpike Weld 3.0.0 Alpha2 » Apache DeltaSpike Core-Implementation
#1
Archived 4 artifacts
Archive block size is 32768
Received 0 blocks and 452238 bytes
Compression is 0.0%
Took 0.26 sec
[JENKINS] Archiving <https://builds.apache.org/job/DeltaSpike%20Weld%203.0.0%20Alpha2/ws/deltaspike/modules/pom.xml>
to org.apache.deltaspike.modules/modules-project/1.2.1-SNAPSHOT/modules-project-1.2.1-SNAPSHOT.pom
No prior successful build to compare, so performing full copy of artifacts
[JENKINS] Archiving <https://builds.apache.org/job/DeltaSpike%20Weld%203.0.0%20Alpha2/ws/deltaspike/modules/test-control/pom.xml>
to org.apache.deltaspike.modules/test-control-module-project/1.2.1-SNAPSHOT/test-control-module-project-1.2.1-SNAPSHOT.pom
No prior successful build to compare, so performing full copy of artifacts
[JENKINS] Archiving <https://builds.apache.org/job/DeltaSpike%20Weld%203.0.0%20Alpha2/ws/deltaspike/examples/jsf-examples/pom.xml>
to org.apache.deltaspike.examples/deltaspike-jsf-example/1.2.1-SNAPSHOT/deltaspike-jsf-example-1.2.1-SNAPSHOT.pom
No prior successful build to compare, so performing full copy of artifacts
[JENKINS] Archiving <https://builds.apache.org/job/DeltaSpike%20Weld%203.0.0%20Alpha2/ws/deltaspike/cdictrl/servlet/pom.xml>
to org.apache.deltaspike.cdictrl/deltaspike-cdictrl-servlet/1.2.1-SNAPSHOT/deltaspike-cdictrl-servlet-1.2.1-SNAPSHOT.pom
No prior successful build to compare, so performing full copy of artifacts
[JENKINS] Archiving <https://builds.apache.org/job/DeltaSpike%20Weld%203.0.0%20Alpha2/ws/deltaspike/cdictrl/api/pom.xml>
to org.apache.deltaspike.cdictrl/deltaspike-cdictrl-api/1.2.1-SNAPSHOT/deltaspike-cdictrl-api-1.2.1-SNAPSHOT.pom
[JENKINS] Archiving <https://builds.apache.org/job/DeltaSpike%20Weld%203.0.0%20Alpha2/ws/deltaspike/cdictrl/api/target/deltaspike-cdictrl-api-1.2.1-SNAPSHOT.jar>
to org.apache.deltaspike.cdictrl/deltaspike-cdictrl-api/1.2.1-SNAPSHOT/deltaspike-cdictrl-api-1.2.1-SNAPSHOT.jar
[JENKINS] Archiving <https://builds.apache.org/job/DeltaSpike%20Weld%203.0.0%20Alpha2/ws/deltaspike/cdictrl/api/target/deltaspike-cdictrl-api-1.2.1-SNAPSHOT-sources.jar>
to org.apache.deltaspike.cdictrl/deltaspike-cdictrl-api/1.2.1-SNAPSHOT/deltaspike-cdictrl-api-1.2.1-SNAPSHOT-sources.jar
Sending artifact delta relative to DeltaSpike Weld 3.0.0 Alpha2 » Apache DeltaSpike CDI ContainerControl
API #1
Archived 3 artifacts
Archive block size is 32768
Received 0 blocks and 23149 bytes
Compression is 0.0%
Took 89 ms
[JENKINS] Archiving <https://builds.apache.org/job/DeltaSpike%20Weld%203.0.0%20Alpha2/ws/deltaspike/examples/scheduler-playground/pom.xml>
to org.apache.deltaspike.examples/deltaspike-scheduler-example/1.2.1-SNAPSHOT/deltaspike-scheduler-example-1.2.1-SNAPSHOT.pom
No prior successful build to compare, so performing full copy of artifacts
[JENKINS] Archiving <https://builds.apache.org/job/DeltaSpike%20Weld%203.0.0%20Alpha2/ws/deltaspike/checkstyle-rules/pom.xml>
to org.apache.deltaspike/checkstyle-rules/1.2.1-SNAPSHOT/checkstyle-rules-1.2.1-SNAPSHOT.pom
[JENKINS] Archiving <https://builds.apache.org/job/DeltaSpike%20Weld%203.0.0%20Alpha2/ws/deltaspike/checkstyle-rules/target/checkstyle-rules-1.2.1-SNAPSHOT.jar>
to org.apache.deltaspike/checkstyle-rules/1.2.1-SNAPSHOT/checkstyle-rules-1.2.1-SNAPSHOT.jar
Sending artifact delta relative to DeltaSpike Weld 3.0.0 Alpha2 » Apache DeltaSpike CheckStyle-rules
#1
Archived 2 artifacts
Archive block size is 32768
Received 0 blocks and 12041 bytes
Compression is 0.0%
Took 90 ms
[JENKINS] Archiving <https://builds.apache.org/job/DeltaSpike%20Weld%203.0.0%20Alpha2/ws/deltaspike/parent/code/pom.xml>
to org.apache.deltaspike/parent-code/1.2.1-SNAPSHOT/parent-code-1.2.1-SNAPSHOT.pom
[JENKINS] Archiving <https://builds.apache.org/job/DeltaSpike%20Weld%203.0.0%20Alpha2/ws/deltaspike/parent/code/target/parent-code-1.2.1-SNAPSHOT-tests.jar>
to org.apache.deltaspike/parent-code/1.2.1-SNAPSHOT/parent-code-1.2.1-SNAPSHOT-tests.jar
Sending artifact delta relative to DeltaSpike Weld 3.0.0 Alpha2 » Apache DeltaSpike Code
Parent #1
Archived 2 artifacts
Archive block size is 32768
Received 1 blocks and 36020 bytes
Compression is 47.6%
Took 91 ms
[JENKINS] Archiving <https://builds.apache.org/job/DeltaSpike%20Weld%203.0.0%20Alpha2/ws/deltaspike/modules/jsf/impl/pom.xml>
to org.apache.deltaspike.modules/deltaspike-jsf-module-impl/1.2.1-SNAPSHOT/deltaspike-jsf-module-impl-1.2.1-SNAPSHOT.pom
No prior successful build to compare, so performing full copy of artifacts
[JENKINS] Archiving <https://builds.apache.org/job/DeltaSpike%20Weld%203.0.0%20Alpha2/ws/deltaspike/modules/partial-bean/pom.xml>
to org.apache.deltaspike.modules/partial-bean-module-project/1.2.1-SNAPSHOT/partial-bean-module-project-1.2.1-SNAPSHOT.pom
No prior successful build to compare, so performing full copy of artifacts
[JENKINS] Archiving <https://builds.apache.org/job/DeltaSpike%20Weld%203.0.0%20Alpha2/ws/deltaspike/examples/pom.xml>
to org.apache.deltaspike.examples/examples-project/1.2.1-SNAPSHOT/examples-project-1.2.1-SNAPSHOT.pom
No prior successful build to compare, so performing full copy of artifacts
[JENKINS] Archiving <https://builds.apache.org/job/DeltaSpike%20Weld%203.0.0%20Alpha2/ws/deltaspike/cdictrl/impl-openejb/pom.xml>
to org.apache.deltaspike.cdictrl/deltaspike-cdictrl-openejb/1.2.1-SNAPSHOT/deltaspike-cdictrl-openejb-1.2.1-SNAPSHOT.pom
No prior successful build to compare, so performing full copy of artifacts
[JENKINS] Archiving <https://builds.apache.org/job/DeltaSpike%20Weld%203.0.0%20Alpha2/ws/deltaspike/modules/jsf/pom.xml>
to org.apache.deltaspike.modules/jsf-module-project/1.2.1-SNAPSHOT/jsf-module-project-1.2.1-SNAPSHOT.pom
No prior successful build to compare, so performing full copy of artifacts
[JENKINS] Archiving <https://builds.apache.org/job/DeltaSpike%20Weld%203.0.0%20Alpha2/ws/deltaspike/cdictrl/tck/pom.xml>
to org.apache.deltaspike.test/deltaspike-cdictrl-tck/1.2.1-SNAPSHOT/deltaspike-cdictrl-tck-1.2.1-SNAPSHOT.pom
[JENKINS] Archiving <https://builds.apache.org/job/DeltaSpike%20Weld%203.0.0%20Alpha2/ws/deltaspike/cdictrl/tck/target/deltaspike-cdictrl-tck-1.2.1-SNAPSHOT.jar>
to org.apache.deltaspike.test/deltaspike-cdictrl-tck/1.2.1-SNAPSHOT/deltaspike-cdictrl-tck-1.2.1-SNAPSHOT.jar
[JENKINS] Archiving <https://builds.apache.org/job/DeltaSpike%20Weld%203.0.0%20Alpha2/ws/deltaspike/cdictrl/tck/target/deltaspike-cdictrl-tck-1.2.1-SNAPSHOT-sources.jar>
to org.apache.deltaspike.test/deltaspike-cdictrl-tck/1.2.1-SNAPSHOT/deltaspike-cdictrl-tck-1.2.1-SNAPSHOT-sources.jar
Sending artifact delta relative to DeltaSpike Weld 3.0.0 Alpha2 » Apache DeltaSpike CDI ContainerControl
TCK #1
Archived 3 artifacts
Archive block size is 32768
Received 0 blocks and 41864 bytes
Compression is 0.0%
Took 95 ms
[JENKINS] Archiving <https://builds.apache.org/job/DeltaSpike%20Weld%203.0.0%20Alpha2/ws/deltaspike/modules/jsf/api/pom.xml>
to org.apache.deltaspike.modules/deltaspike-jsf-module-api/1.2.1-SNAPSHOT/deltaspike-jsf-module-api-1.2.1-SNAPSHOT.pom
No prior successful build to compare, so performing full copy of artifacts
[JENKINS] Archiving <https://builds.apache.org/job/DeltaSpike%20Weld%203.0.0%20Alpha2/ws/deltaspike/modules/security/pom.xml>
to org.apache.deltaspike.modules/security-module-project/1.2.1-SNAPSHOT/security-module-project-1.2.1-SNAPSHOT.pom
No prior successful build to compare, so performing full copy of artifacts
[JENKINS] Archiving <https://builds.apache.org/job/DeltaSpike%20Weld%203.0.0%20Alpha2/ws/deltaspike/modules/bean-validation/pom.xml>
to org.apache.deltaspike.modules/bean-validation-module-project/1.2.1-SNAPSHOT/bean-validation-module-project-1.2.1-SNAPSHOT.pom
No prior successful build to compare, so performing full copy of artifacts
[JENKINS] Archiving <https://builds.apache.org/job/DeltaSpike%20Weld%203.0.0%20Alpha2/ws/deltaspike/modules/partial-bean/impl/pom.xml>
to org.apache.deltaspike.modules/deltaspike-partial-bean-module-impl/1.2.1-SNAPSHOT/deltaspike-partial-bean-module-impl-1.2.1-SNAPSHOT.pom
No prior successful build to compare, so performing full copy of artifacts
[JENKINS] Archiving <https://builds.apache.org/job/DeltaSpike%20Weld%203.0.0%20Alpha2/ws/deltaspike/cdictrl/impl-weld/pom.xml>
to org.apache.deltaspike.cdictrl/deltaspike-cdictrl-weld/1.2.1-SNAPSHOT/deltaspike-cdictrl-weld-1.2.1-SNAPSHOT.pom
No prior successful build to compare, so performing full copy of artifacts
[JENKINS] Archiving <https://builds.apache.org/job/DeltaSpike%20Weld%203.0.0%20Alpha2/ws/deltaspike/modules/jpa/api/pom.xml>
to org.apache.deltaspike.modules/deltaspike-jpa-module-api/1.2.1-SNAPSHOT/deltaspike-jpa-module-api-1.2.1-SNAPSHOT.pom
No prior successful build to compare, so performing full copy of artifacts
[JENKINS] Archiving <https://builds.apache.org/job/DeltaSpike%20Weld%203.0.0%20Alpha2/ws/deltaspike/modules/servlet/api/pom.xml>
to org.apache.deltaspike.modules/deltaspike-servlet-module-api/1.2.1-SNAPSHOT/deltaspike-servlet-module-api-1.2.1-SNAPSHOT.pom
No prior successful build to compare, so performing full copy of artifacts
[JENKINS] Archiving <https://builds.apache.org/job/DeltaSpike%20Weld%203.0.0%20Alpha2/ws/deltaspike/modules/jpa/pom.xml>
to org.apache.deltaspike.modules/jpa-module-project/1.2.1-SNAPSHOT/jpa-module-project-1.2.1-SNAPSHOT.pom
No prior successful build to compare, so performing full copy of artifacts
[JENKINS] Archiving <https://builds.apache.org/job/DeltaSpike%20Weld%203.0.0%20Alpha2/ws/deltaspike/cdictrl/pom.xml>
to org.apache.deltaspike.cdictrl/cdictrl-project/1.2.1-SNAPSHOT/cdictrl-project-1.2.1-SNAPSHOT.pom
Sending artifact delta relative to DeltaSpike Weld 3.0.0 Alpha2 » Apache DeltaSpike ContainerControl
parent #1
Archived 1 artifacts
Archive block size is 32768
Received 0 blocks and 1849 bytes
Compression is 0.0%
Took 89 ms
[JENKINS] Archiving <https://builds.apache.org/job/DeltaSpike%20Weld%203.0.0%20Alpha2/ws/deltaspike/modules/scheduler/api/pom.xml>
to org.apache.deltaspike.modules/deltaspike-scheduler-module-api/1.2.1-SNAPSHOT/deltaspike-scheduler-module-api-1.2.1-SNAPSHOT.pom
No prior successful build to compare, so performing full copy of artifacts
[JENKINS] Archiving <https://builds.apache.org/job/DeltaSpike%20Weld%203.0.0%20Alpha2/ws/deltaspike/modules/test-control/impl/pom.xml>
to org.apache.deltaspike.modules/deltaspike-test-control-module-impl/1.2.1-SNAPSHOT/deltaspike-test-control-module-impl-1.2.1-SNAPSHOT.pom
No prior successful build to compare, so performing full copy of artifacts
[JENKINS] Archiving <https://builds.apache.org/job/DeltaSpike%20Weld%203.0.0%20Alpha2/ws/deltaspike/modules/servlet/pom.xml>
to org.apache.deltaspike.modules/servlet-module-project/1.2.1-SNAPSHOT/servlet-module-project-1.2.1-SNAPSHOT.pom
No prior successful build to compare, so performing full copy of artifacts
[JENKINS] Archiving <https://builds.apache.org/job/DeltaSpike%20Weld%203.0.0%20Alpha2/ws/deltaspike/modules/test-control/api/pom.xml>
to org.apache.deltaspike.modules/deltaspike-test-control-module-api/1.2.1-SNAPSHOT/deltaspike-test-control-module-api-1.2.1-SNAPSHOT.pom
No prior successful build to compare, so performing full copy of artifacts
[JENKINS] Archiving <https://builds.apache.org/job/DeltaSpike%20Weld%203.0.0%20Alpha2/ws/deltaspike/modules/jsf/impl-ee6/pom.xml>
to org.apache.deltaspike.modules/deltaspike-jsf-module-impl-ee6/1.2.1-SNAPSHOT/deltaspike-jsf-module-impl-ee6-1.2.1-SNAPSHOT.pom
No prior successful build to compare, so performing full copy of artifacts
[JENKINS] Archiving <https://builds.apache.org/job/DeltaSpike%20Weld%203.0.0%20Alpha2/ws/deltaspike/modules/partial-bean/api/pom.xml>
to org.apache.deltaspike.modules/deltaspike-partial-bean-module-api/1.2.1-SNAPSHOT/deltaspike-partial-bean-module-api-1.2.1-SNAPSHOT.pom
No prior successful build to compare, so performing full copy of artifacts
[JENKINS] Archiving <https://builds.apache.org/job/DeltaSpike%20Weld%203.0.0%20Alpha2/ws/deltaspike/modules/scheduler/impl/pom.xml>
to org.apache.deltaspike.modules/deltaspike-scheduler-module-impl/1.2.1-SNAPSHOT/deltaspike-scheduler-module-impl-1.2.1-SNAPSHOT.pom
No prior successful build to compare, so performing full copy of artifacts
[JENKINS] Archiving <https://builds.apache.org/job/DeltaSpike%20Weld%203.0.0%20Alpha2/ws/deltaspike/parent/pom.xml>
to org.apache.deltaspike/parent/1.2.1-SNAPSHOT/parent-1.2.1-SNAPSHOT.pom
Sending artifact delta relative to DeltaSpike Weld 3.0.0 Alpha2 » Apache DeltaSpike Parent
#1
Archived 1 artifacts
Archive block size is 32768
Received 0 blocks and 38712 bytes
Compression is 0.0%
Took 80 ms
[JENKINS] Archiving <https://builds.apache.org/job/DeltaSpike%20Weld%203.0.0%20Alpha2/ws/deltaspike/core/pom.xml>
to org.apache.deltaspike.core/core-project/1.2.1-SNAPSHOT/core-project-1.2.1-SNAPSHOT.pom
[JENKINS] Archiving <https://builds.apache.org/job/DeltaSpike%20Weld%203.0.0%20Alpha2/ws/deltaspike/core/target/core-project-1.2.1-SNAPSHOT-tests.jar>
to org.apache.deltaspike.core/core-project/1.2.1-SNAPSHOT/core-project-1.2.1-SNAPSHOT-tests.jar
Sending artifact delta relative to DeltaSpike Weld 3.0.0 Alpha2 » Apache DeltaSpike Core
#1
Archived 2 artifacts
Archive block size is 32768
Received 0 blocks and 4011 bytes
Compression is 0.0%
Took 85 ms
[JENKINS] Archiving <https://builds.apache.org/job/DeltaSpike%20Weld%203.0.0%20Alpha2/ws/deltaspike/modules/bean-validation/api/pom.xml>
to org.apache.deltaspike.modules/deltaspike-bean-validation-module-api/1.2.1-SNAPSHOT/deltaspike-bean-validation-module-api-1.2.1-SNAPSHOT.pom
No prior successful build to compare, so performing full copy of artifacts
[JENKINS] Archiving <https://builds.apache.org/job/DeltaSpike%20Weld%203.0.0%20Alpha2/ws/deltaspike/core/api/pom.xml>
to org.apache.deltaspike.core/deltaspike-core-api/1.2.1-SNAPSHOT/deltaspike-core-api-1.2.1-SNAPSHOT.pom
[JENKINS] Archiving <https://builds.apache.org/job/DeltaSpike%20Weld%203.0.0%20Alpha2/ws/deltaspike/core/api/target/deltaspike-core-api-1.2.1-SNAPSHOT.jar>
to org.apache.deltaspike.core/deltaspike-core-api/1.2.1-SNAPSHOT/deltaspike-core-api-1.2.1-SNAPSHOT.jar
[JENKINS] Archiving <https://builds.apache.org/job/DeltaSpike%20Weld%203.0.0%20Alpha2/ws/deltaspike/core/api/target/deltaspike-core-api-1.2.1-SNAPSHOT-tests.jar>
to org.apache.deltaspike.core/deltaspike-core-api/1.2.1-SNAPSHOT/deltaspike-core-api-1.2.1-SNAPSHOT-tests.jar
[JENKINS] Archiving <https://builds.apache.org/job/DeltaSpike%20Weld%203.0.0%20Alpha2/ws/deltaspike/core/api/target/deltaspike-core-api-1.2.1-SNAPSHOT-sources.jar>
to org.apache.deltaspike.core/deltaspike-core-api/1.2.1-SNAPSHOT/deltaspike-core-api-1.2.1-SNAPSHOT-sources.jar
Sending artifact delta relative to DeltaSpike Weld 3.0.0 Alpha2 » Apache DeltaSpike Core-API
#1
Archived 4 artifacts
Archive block size is 32768
Received 0 blocks and 481958 bytes
Compression is 0.0%
Took 0.22 sec
[JENKINS] Archiving <https://builds.apache.org/job/DeltaSpike%20Weld%203.0.0%20Alpha2/ws/deltaspike/modules/security/impl/pom.xml>
to org.apache.deltaspike.modules/deltaspike-security-module-impl/1.2.1-SNAPSHOT/deltaspike-security-module-impl-1.2.1-SNAPSHOT.pom
No prior successful build to compare, so performing full copy of artifacts
[JENKINS] Archiving <https://builds.apache.org/job/DeltaSpike%20Weld%203.0.0%20Alpha2/ws/deltaspike/modules/scheduler/pom.xml>
to org.apache.deltaspike.modules/scheduler-module-project/1.2.1-SNAPSHOT/scheduler-module-project-1.2.1-SNAPSHOT.pom
No prior successful build to compare, so performing full copy of artifacts
[JENKINS] Archiving <https://builds.apache.org/job/DeltaSpike%20Weld%203.0.0%20Alpha2/ws/deltaspike/examples/jsf-playground/pom.xml>
to org.apache.deltaspike.examples/deltaspike-jsf-playground/1.2.1-SNAPSHOT/deltaspike-jsf-playground-1.2.1-SNAPSHOT.pom
No prior successful build to compare, so performing full copy of artifacts
[JENKINS] Archiving <https://builds.apache.org/job/DeltaSpike%20Weld%203.0.0%20Alpha2/ws/deltaspike/modules/servlet/impl/pom.xml>
to org.apache.deltaspike.modules/deltaspike-servlet-module-impl/1.2.1-SNAPSHOT/deltaspike-servlet-module-impl-1.2.1-SNAPSHOT.pom
No prior successful build to compare, so performing full copy of artifacts
[JENKINS] Archiving <https://builds.apache.org/job/DeltaSpike%20Weld%203.0.0%20Alpha2/ws/deltaspike/modules/bean-validation/impl/pom.xml>
to org.apache.deltaspike.modules/deltaspike-bean-validation-module-impl/1.2.1-SNAPSHOT/deltaspike-bean-validation-module-impl-1.2.1-SNAPSHOT.pom
No prior successful build to compare, so performing full copy of artifacts
[JENKINS] Archiving <https://builds.apache.org/job/DeltaSpike%20Weld%203.0.0%20Alpha2/ws/deltaspike/cdictrl/impl-owb/pom.xml>
to org.apache.deltaspike.cdictrl/deltaspike-cdictrl-owb/1.2.1-SNAPSHOT/deltaspike-cdictrl-owb-1.2.1-SNAPSHOT.pom
[JENKINS] Archiving <https://builds.apache.org/job/DeltaSpike%20Weld%203.0.0%20Alpha2/ws/deltaspike/cdictrl/impl-owb/target/deltaspike-cdictrl-owb-1.2.1-SNAPSHOT.jar>
to org.apache.deltaspike.cdictrl/deltaspike-cdictrl-owb/1.2.1-SNAPSHOT/deltaspike-cdictrl-owb-1.2.1-SNAPSHOT.jar
[JENKINS] Archiving <https://builds.apache.org/job/DeltaSpike%20Weld%203.0.0%20Alpha2/ws/deltaspike/cdictrl/impl-owb/target/deltaspike-cdictrl-owb-1.2.1-SNAPSHOT-sources.jar>
to org.apache.deltaspike.cdictrl/deltaspike-cdictrl-owb/1.2.1-SNAPSHOT/deltaspike-cdictrl-owb-1.2.1-SNAPSHOT-sources.jar
Sending artifact delta relative to DeltaSpike Weld 3.0.0 Alpha2 » Apache DeltaSpike CDI OWB-ContainerControl
#1
Archived 3 artifacts
Archive block size is 32768
Received 0 blocks and 40790 bytes
Compression is 0.0%
Took 93 ms
[JENKINS] Archiving <https://builds.apache.org/job/DeltaSpike%20Weld%203.0.0%20Alpha2/ws/deltaspike/modules/jpa/impl/pom.xml>
to org.apache.deltaspike.modules/deltaspike-jpa-module-impl/1.2.1-SNAPSHOT/deltaspike-jpa-module-impl-1.2.1-SNAPSHOT.pom
No prior successful build to compare, so performing full copy of artifacts
[JENKINS] Archiving <https://builds.apache.org/job/DeltaSpike%20Weld%203.0.0%20Alpha2/ws/deltaspike/modules/data/pom.xml>
to org.apache.deltaspike.modules/data-module-project/1.2.1-SNAPSHOT/data-module-project-1.2.1-SNAPSHOT.pom
No prior successful build to compare, so performing full copy of artifacts
[JENKINS] Archiving <https://builds.apache.org/job/DeltaSpike%20Weld%203.0.0%20Alpha2/ws/deltaspike/pom.xml>
to org.apache.deltaspike/deltaspike-project/1.2.1-SNAPSHOT/deltaspike-project-1.2.1-SNAPSHOT.pom
Sending artifact delta relative to DeltaSpike Weld 3.0.0 Alpha2 » Apache DeltaSpike #1
Archived 1 artifacts
Archive block size is 32768
Received 0 blocks and 10581 bytes
Compression is 0.0%
Took 92 ms
[JENKINS] Archiving <https://builds.apache.org/job/DeltaSpike%20Weld%203.0.0%20Alpha2/ws/deltaspike/modules/security/api/pom.xml>
to org.apache.deltaspike.modules/deltaspike-security-module-api/1.2.1-SNAPSHOT/deltaspike-security-module-api-1.2.1-SNAPSHOT.pom
No prior successful build to compare, so performing full copy of artifacts
Sending e-mails to: commits@deltaspike.apache.org
channel stopped

Mime
View raw message