deltaspike-commits mailing list archives

Site index · List index
Message view « Date » · « Thread »
Top « Date » · « Thread »
From Apache Jenkins Server <jenk...@builds.apache.org>
Subject Build failed in Jenkins: DeltaSpike OWB 1.2.3 » Apache DeltaSpike JSF-Module API #107
Date Fri, 03 Oct 2014 18:05:44 GMT
See <https://builds.apache.org/job/DeltaSpike%20OWB%201.2.3/org.apache.deltaspike.modules$deltaspike-jsf-module-api/107/>

------------------------------------------
[INFO]                                                                         
[INFO] ------------------------------------------------------------------------
[INFO] Building Apache DeltaSpike JSF-Module API 1.0.4-SNAPSHOT
[INFO] ------------------------------------------------------------------------
[INFO] 
[INFO] --- maven-clean-plugin:2.5:clean (default-clean) @ deltaspike-jsf-module-api ---
[INFO] Deleting <https://builds.apache.org/job/DeltaSpike%20OWB%201.2.3/org.apache.deltaspike.modules$deltaspike-jsf-module-api/ws/target>
[INFO] 
[INFO] --- maven-bundle-plugin:2.3.7:cleanVersions (versions) @ deltaspike-jsf-module-api
---
[INFO] 
[INFO] --- maven-antrun-plugin:1.6:run (javadoc.resources) @ deltaspike-jsf-module-api ---
[WARNING] Parameter tasks is deprecated, use target instead
[INFO] Executing tasks

main:
[INFO] Executed tasks
[INFO] 
[INFO] --- maven-remote-resources-plugin:1.3:process (process-remote-resources) @ deltaspike-jsf-module-api
---
[INFO] 
[INFO] --- maven-remote-resources-plugin:1.3:process (default) @ deltaspike-jsf-module-api
---
[INFO] 
[INFO] --- maven-resources-plugin:2.5:resources (default-resources) @ deltaspike-jsf-module-api
---
[debug] execute contextualize
[INFO] Using 'UTF-8' encoding to copy filtered resources.
[INFO] Copying 1 resource
[INFO] Copying 4 resources
[INFO] Copying 4 resources
[INFO] 
[INFO] --- maven-compiler-plugin:2.5:compile (default-compile) @ deltaspike-jsf-module-api
---
[INFO] Compiling 15 source files to <https://builds.apache.org/job/DeltaSpike%20OWB%201.2.3/org.apache.deltaspike.modules$deltaspike-jsf-module-api/ws/target/classes>
[INFO] -------------------------------------------------------------
[ERROR] COMPILATION ERROR : 
[INFO] -------------------------------------------------------------
[ERROR] error: error reading /home/jenkins/tools/java/jdk1.6.0_45-32/lib/ct.sym; cannot read
zip file
[INFO] 1 error
[INFO] -------------------------------------------------------------

Mime
View raw message