deltaspike-commits mailing list archives

Site index · List index
Message view « Date » · « Thread »
Top « Date » · « Thread »
From Apache Jenkins Server <jenk...@builds.apache.org>
Subject Build failed in Jenkins: DeltaSpike Weld 2.2.1 » Apache DeltaSpike Test-Control-Module Impl #126
Date Tue, 23 Sep 2014 23:21:07 GMT
See <https://builds.apache.org/job/DeltaSpike%20Weld%202.2.1/org.apache.deltaspike.modules$deltaspike-test-control-module-impl/126/>

------------------------------------------
[INFO]                                                                         
[INFO] ------------------------------------------------------------------------
[INFO] Building Apache DeltaSpike Test-Control-Module Impl 1.0.3-SNAPSHOT
[INFO] ------------------------------------------------------------------------
Downloading: https://repository.apache.org/content/repositories/releases/org/apache/myfaces/test/myfaces-test20/1.0.6/myfaces-test20-1.0.6.pom
Downloaded: https://repository.apache.org/content/repositories/releases/org/apache/myfaces/test/myfaces-test20/1.0.6/myfaces-test20-1.0.6.pom
(10 KB at 17.3 KB/sec)
Downloading: https://repository.apache.org/content/repositories/releases/org/apache/myfaces/test/myfaces-test-project/1.0.6/myfaces-test-project-1.0.6.pom
Downloaded: https://repository.apache.org/content/repositories/releases/org/apache/myfaces/test/myfaces-test-project/1.0.6/myfaces-test-project-1.0.6.pom
(8 KB at 27.0 KB/sec)
Downloading: https://repository.apache.org/content/repositories/releases/org/apache/myfaces/myfaces/10/myfaces-10.pom
Downloaded: https://repository.apache.org/content/repositories/releases/org/apache/myfaces/myfaces/10/myfaces-10.pom
(34 KB at 86.2 KB/sec)
Downloading: https://repository.apache.org/content/repositories/releases/org/apache/apache/8/apache-8.pom
Downloaded: https://repository.apache.org/content/repositories/releases/org/apache/apache/8/apache-8.pom
(14 KB at 81.2 KB/sec)
Downloading: https://repository.apache.org/content/repositories/releases/org/apache/myfaces/core/myfaces-impl-test/2.2.3/myfaces-impl-test-2.2.3.pom
Downloaded: https://repository.apache.org/content/repositories/releases/org/apache/myfaces/core/myfaces-impl-test/2.2.3/myfaces-impl-test-2.2.3.pom
(10 KB at 27.4 KB/sec)
Downloading: https://repository.apache.org/content/repositories/releases/org/apache/myfaces/core/myfaces-impl/2.2.3/myfaces-impl-2.2.3.pom
Downloaded: https://repository.apache.org/content/repositories/releases/org/apache/myfaces/core/myfaces-impl/2.2.3/myfaces-impl-2.2.3.pom
(61 KB at 68.4 KB/sec)
Downloading: https://repository.apache.org/content/repositories/releases/commons-beanutils/commons-beanutils/1.8.3/commons-beanutils-1.8.3.pom
Downloaded: https://repository.apache.org/content/repositories/releases/commons-beanutils/commons-beanutils/1.8.3/commons-beanutils-1.8.3.pom
(11 KB at 64.0 KB/sec)
Downloading: https://repository.apache.org/content/repositories/releases/org/mockito/mockito-all/1.9.5/mockito-all-1.9.5.pom
Downloading: https://repository.apache.org/content/repositories/snapshots/org/mockito/mockito-all/1.9.5/mockito-all-1.9.5.pom
Downloading: http://repo.maven.apache.org/maven2/org/mockito/mockito-all/1.9.5/mockito-all-1.9.5.pom
Downloaded: http://repo.maven.apache.org/maven2/org/mockito/mockito-all/1.9.5/mockito-all-1.9.5.pom
(2 KB at 56.4 KB/sec)
Downloading: https://repository.apache.org/content/repositories/releases/org/apache/myfaces/test/myfaces-test20/1.0.6/myfaces-test20-1.0.6.jar
Downloading: https://repository.apache.org/content/repositories/releases/org/apache/myfaces/core/myfaces-impl-test/2.2.3/myfaces-impl-test-2.2.3.jar
Downloading: https://repository.apache.org/content/repositories/releases/org/apache/myfaces/core/myfaces-impl/2.2.3/myfaces-impl-2.2.3.jar
Downloading: https://repository.apache.org/content/repositories/releases/commons-beanutils/commons-beanutils/1.8.3/commons-beanutils-1.8.3.jar
Downloading: https://repository.apache.org/content/repositories/releases/org/mockito/mockito-all/1.9.5/mockito-all-1.9.5.jar
Downloaded: https://repository.apache.org/content/repositories/releases/org/apache/myfaces/core/myfaces-impl-test/2.2.3/myfaces-impl-test-2.2.3.jar
(90 KB at 130.8 KB/sec)
Downloaded: https://repository.apache.org/content/repositories/releases/commons-beanutils/commons-beanutils/1.8.3/commons-beanutils-1.8.3.jar
(227 KB at 291.6 KB/sec)
Downloaded: https://repository.apache.org/content/repositories/releases/org/apache/myfaces/test/myfaces-test20/1.0.6/myfaces-test20-1.0.6.jar
(275 KB at 308.2 KB/sec)
Downloaded: https://repository.apache.org/content/repositories/releases/org/apache/myfaces/core/myfaces-impl/2.2.3/myfaces-impl-2.2.3.jar
(2440 KB at 1290.2 KB/sec)
Downloading: https://repository.apache.org/content/repositories/snapshots/org/mockito/mockito-all/1.9.5/mockito-all-1.9.5.jar
Downloading: http://repo.maven.apache.org/maven2/org/mockito/mockito-all/1.9.5/mockito-all-1.9.5.jar
Downloaded: http://repo.maven.apache.org/maven2/org/mockito/mockito-all/1.9.5/mockito-all-1.9.5.jar
(1545 KB at 26620.9 KB/sec)
[INFO] 
[INFO] --- maven-clean-plugin:2.5:clean (default-clean) @ deltaspike-test-control-module-impl
---
[INFO] 
[INFO] --- maven-bundle-plugin:2.3.7:cleanVersions (versions) @ deltaspike-test-control-module-impl
---
[INFO] 
[INFO] --- maven-antrun-plugin:1.6:run (javadoc.resources) @ deltaspike-test-control-module-impl
---
[WARNING] Parameter tasks is deprecated, use target instead
[INFO] Executing tasks

main:
[INFO] Executed tasks
[INFO] 
[INFO] --- maven-remote-resources-plugin:1.3:process (process-remote-resources) @ deltaspike-test-control-module-impl
---
[INFO] 
[INFO] --- maven-remote-resources-plugin:1.3:process (default) @ deltaspike-test-control-module-impl
---
[INFO] 
[INFO] --- maven-resources-plugin:2.5:resources (default-resources) @ deltaspike-test-control-module-impl
---
[debug] execute contextualize
[INFO] Using 'UTF-8' encoding to copy filtered resources.
[INFO] Copying 3 resources
[INFO] Copying 4 resources
[INFO] Copying 4 resources
[INFO] 
[INFO] --- maven-compiler-plugin:2.5:compile (default-compile) @ deltaspike-test-control-module-impl
---
[INFO] Compiling 14 source files to <https://builds.apache.org/job/DeltaSpike%20Weld%202.2.1/org.apache.deltaspike.modules$deltaspike-test-control-module-impl/ws/target/classes>
[INFO] -------------------------------------------------------------
[ERROR] COMPILATION ERROR : 
[INFO] -------------------------------------------------------------
[ERROR] error: error reading /jenkins/maven-repositories/0/commons-collections/commons-collections/3.2/commons-collections-3.2.jar;
error in opening zip file
[INFO] 1 error
[INFO] -------------------------------------------------------------

Mime
View raw message