deltaspike-commits mailing list archives

Site index · List index
Message view « Date » · « Thread »
Top « Date » · « Thread »
From Apache Jenkins Server <jenk...@builds.apache.org>
Subject Build failed in Jenkins: DeltaSpike RAT-Check #1407
Date Wed, 17 Sep 2014 14:24:13 GMT
See <https://builds.apache.org/job/DeltaSpike%20RAT-Check/1407/>

------------------------------------------
[...truncated 8595 lines...]
[INFO] --- maven-remote-resources-plugin:1.3:process (process-remote-resources) @ deltaspike-bean-validation-module-impl
---
[INFO] 
[INFO] --- maven-remote-resources-plugin:1.3:process (default) @ deltaspike-bean-validation-module-impl
---
[INFO] 
[INFO] --- maven-resources-plugin:2.5:resources (default-resources) @ deltaspike-bean-validation-module-impl
---
[debug] execute contextualize
[INFO] Using 'UTF-8' encoding to copy filtered resources.
[INFO] skip non existing resourceDirectory <https://builds.apache.org/job/DeltaSpike%20RAT-Check/ws/deltaspike/modules/bean-validation/impl/src/main/resources>
[INFO] Copying 4 resources
[INFO] Copying 4 resources
[INFO] 
[INFO] --- maven-compiler-plugin:2.5:compile (default-compile) @ deltaspike-bean-validation-module-impl
---
[INFO] Compiling 1 source file to <https://builds.apache.org/job/DeltaSpike%20RAT-Check/ws/deltaspike/modules/bean-validation/impl/target/classes>
[INFO] 
[INFO] --- maven-resources-plugin:2.5:testResources (default-testResources) @ deltaspike-bean-validation-module-impl
---
[debug] execute contextualize
[INFO] Using 'UTF-8' encoding to copy filtered resources.
[INFO] Copying 1 resource
[INFO] Copying 4 resources
[INFO] Copying 4 resources
[INFO] 
[INFO] --- maven-compiler-plugin:2.5:testCompile (default-testCompile) @ deltaspike-bean-validation-module-impl
---
[INFO] Compiling 6 source files to <https://builds.apache.org/job/DeltaSpike%20RAT-Check/ws/deltaspike/modules/bean-validation/impl/target/test-classes>
[INFO] 
[INFO] --- maven-surefire-plugin:2.11:test (default-test) @ deltaspike-bean-validation-module-impl
---
[INFO] Surefire report directory: <https://builds.apache.org/job/DeltaSpike%20RAT-Check/ws/deltaspike/modules/bean-validation/impl/target/surefire-reports>
[INFO] Using configured provider org.apache.maven.surefire.junitcore.JUnitCoreProvider

-------------------------------------------------------
 T E S T S
-------------------------------------------------------
Concurrency config is parallel='none', perCoreThreadCount=true, threadCount=2, useUnlimitedThreads=false
Sep 17, 2014 2:23:47 PM org.apache.deltaspike.test.utils.ShrinkWrapArchiveUtil getArchives
INFO: Test org.apache.deltaspike.beanvalidation.test.InjectedValidationTest Adding Java ClassPath
URL as JavaArchive jar:<https://builds.apache.org/job/DeltaSpike%20RAT-Check/ws/deltaspike/core/api/target/deltaspike-core-api-1.0.3-SNAPSHOT.jar!/META-INF/beans.xml>
Sep 17, 2014 2:23:47 PM org.apache.deltaspike.test.utils.ShrinkWrapArchiveUtil getArchives
INFO: Test org.apache.deltaspike.beanvalidation.test.InjectedValidationTest Adding Java ClassPath
URL as JavaArchive jar:<https://builds.apache.org/job/DeltaSpike%20RAT-Check/ws/deltaspike/core/impl/target/deltaspike-core-impl-1.0.3-SNAPSHOT.jar!/META-INF/beans.xml>
Sep 17, 2014 2:23:47 PM org.apache.webbeans.lifecycle.AbstractLifeCycle startApplication
INFO: OpenWebBeans Container is starting...
Sep 17, 2014 2:23:47 PM org.apache.deltaspike.core.util.ProjectStageProducer initProjectStage
INFO: Computed the following DeltaSpike ProjectStage: UnitTest
Sep 17, 2014 2:23:48 PM org.apache.deltaspike.core.util.ClassDeactivationUtils cacheResult
INFO: class: org.apache.deltaspike.core.impl.message.MessageBundleExtension activated=true
Sep 17, 2014 2:23:48 PM org.apache.deltaspike.core.util.ClassDeactivationUtils cacheResult
INFO: class: org.apache.deltaspike.core.impl.message.NamedMessageBundleInvocationHandler activated=true
Sep 17, 2014 2:23:48 PM org.apache.deltaspike.core.util.ClassDeactivationUtils cacheResult
INFO: class: org.apache.deltaspike.core.impl.jmx.MBeanExtension activated=true
Sep 17, 2014 2:23:48 PM org.apache.deltaspike.core.util.ClassDeactivationUtils cacheResult
INFO: class: org.apache.deltaspike.core.impl.exception.control.extension.ExceptionControlExtension
activated=true
Sep 17, 2014 2:23:48 PM org.apache.deltaspike.core.util.ClassDeactivationUtils cacheResult
INFO: class: org.apache.deltaspike.core.impl.scope.DeltaSpikeContextExtension activated=true
Sep 17, 2014 2:23:48 PM org.apache.deltaspike.core.util.ClassDeactivationUtils cacheResult
INFO: class: org.apache.deltaspike.core.impl.config.ConfigurationExtension activated=true
Sep 17, 2014 2:23:48 PM org.apache.deltaspike.core.util.ClassDeactivationUtils cacheResult
INFO: class: org.apache.deltaspike.core.impl.exclude.extension.ExcludeExtension activated=true
Sep 17, 2014 2:23:48 PM org.apache.deltaspike.core.util.ClassDeactivationUtils cacheResult
INFO: class: org.apache.deltaspike.core.impl.exclude.CustomProjectStageBeanFilter activated=true
Sep 17, 2014 2:23:48 PM org.apache.deltaspike.core.util.ClassDeactivationUtils cacheResult
INFO: class: org.apache.deltaspike.core.impl.exclude.GlobalAlternative activated=true
Sep 17, 2014 2:23:48 PM org.apache.webbeans.config.BeansDeployer validateInjectionPoints
INFO: All injection points were validated successfully.
Sep 17, 2014 2:23:48 PM org.apache.webbeans.lifecycle.AbstractLifeCycle startApplication
INFO: OpenWebBeans Container has started, it took [593] ms.
Running org.apache.deltaspike.beanvalidation.test.InjectedValidationTest
Sep 17, 2014 2:23:48 PM org.apache.deltaspike.core.api.provider.BeanProvider logWarningIfDependent
WARNING: BeanProvider shall not be used to create @Dependent scoped beans. Bean: InjectableConstraintValidator,
Name:null, WebBeans Type:MANAGED, API Types:[java.lang.Object,org.apache.deltaspike.beanvalidation.test.InjectableConstraintValidator,javax.validation.ConstraintValidator],
Qualifiers:[javax.enterprise.inject.Any,javax.enterprise.inject.Default]
Tests run: 1, Failures: 0, Errors: 0, Skipped: 0, Time elapsed: 0.14 sec

Results :

Tests run: 1, Failures: 0, Errors: 0, Skipped: 0

[JENKINS] Recording test results
[INFO] 
[INFO] --- maven-bundle-plugin:2.3.7:bundle (default-bundle) @ deltaspike-bean-validation-module-impl
---
[WARNING] Bundle org.apache.deltaspike.modules:deltaspike-bean-validation-module-impl:bundle:1.0.3-SNAPSHOT
: Did not find matching referal for !org.apache.deltaspike.beanvalidation.impl.*
[INFO] 
[INFO] --- maven-site-plugin:3.1:attach-descriptor (attach-descriptor) @ deltaspike-bean-validation-module-impl
---
[INFO] 
[INFO] --- maven-jar-plugin:2.4:test-jar (default) @ deltaspike-bean-validation-module-impl
---
[INFO] Building jar: <https://builds.apache.org/job/DeltaSpike%20RAT-Check/ws/deltaspike/modules/bean-validation/impl/target/deltaspike-bean-validation-module-impl-1.0.3-SNAPSHOT-tests.jar>
[INFO] 
[INFO] --- apache-rat-plugin:0.8:check (default) @ deltaspike-bean-validation-module-impl
---
[INFO] Exclude: .idea/**/*
[INFO] Exclude: readme/**/*
[INFO] Exclude: **/*.log
[INFO] 
[INFO] --- maven-bundle-plugin:2.3.7:cleanVersions (versions) @ deltaspike-bean-validation-module-impl
---
[INFO] 
[INFO] --- maven-antrun-plugin:1.6:run (javadoc.resources) @ deltaspike-bean-validation-module-impl
---
[WARNING] Parameter tasks is deprecated, use target instead
[INFO] Executing tasks

main:
[INFO] Executed tasks
[WARNING] Failed to getClass for org.apache.maven.plugin.source.SourceJarMojo
[INFO] 
[INFO] --- maven-source-plugin:2.1.2:jar (attach-sources) @ deltaspike-bean-validation-module-impl
---
[INFO] META-INF already added, skipping
[INFO] META-INF/LICENSE already added, skipping
[INFO] META-INF/DISCLAIMER already added, skipping
[INFO] META-INF/NOTICE already added, skipping
[INFO] META-INF/DEPENDENCIES already added, skipping
[INFO] META-INF already added, skipping
[INFO] META-INF/LICENSE already added, skipping
[INFO] META-INF/DISCLAIMER already added, skipping
[INFO] META-INF/NOTICE already added, skipping
[INFO] META-INF/DEPENDENCIES already added, skipping
[INFO] META-INF already added, skipping
[INFO] META-INF/LICENSE already added, skipping
[INFO] META-INF/DISCLAIMER already added, skipping
[INFO] META-INF/NOTICE already added, skipping
[INFO] META-INF/DEPENDENCIES already added, skipping
[INFO] Building jar: <https://builds.apache.org/job/DeltaSpike%20RAT-Check/ws/deltaspike/modules/bean-validation/impl/target/deltaspike-bean-validation-module-impl-1.0.3-SNAPSHOT-sources.jar>
[INFO] META-INF already added, skipping
[INFO] META-INF/LICENSE already added, skipping
[INFO] META-INF/DISCLAIMER already added, skipping
[INFO] META-INF/NOTICE already added, skipping
[INFO] META-INF/DEPENDENCIES already added, skipping
[INFO] META-INF already added, skipping
[INFO] META-INF/LICENSE already added, skipping
[INFO] META-INF/DISCLAIMER already added, skipping
[INFO] META-INF/NOTICE already added, skipping
[INFO] META-INF/DEPENDENCIES already added, skipping
[INFO] META-INF already added, skipping
[INFO] META-INF/LICENSE already added, skipping
[INFO] META-INF/DISCLAIMER already added, skipping
[INFO] META-INF/NOTICE already added, skipping
[INFO] META-INF/DEPENDENCIES already added, skipping
[INFO] 
[INFO] --- maven-checkstyle-plugin:2.9.1:check (verify-style) @ deltaspike-bean-validation-module-impl
---
[INFO] Starting audit...
Audit done.

[INFO] 
[INFO] --- maven-install-plugin:2.3.1:install (default-install) @ deltaspike-bean-validation-module-impl
---
[INFO] Installing <https://builds.apache.org/job/DeltaSpike%20RAT-Check/ws/deltaspike/modules/bean-validation/impl/target/deltaspike-bean-validation-module-impl-1.0.3-SNAPSHOT.jar>
to /jenkins/maven-repositories/0/org/apache/deltaspike/modules/deltaspike-bean-validation-module-impl/1.0.3-SNAPSHOT/deltaspike-bean-validation-module-impl-1.0.3-SNAPSHOT.jar
[INFO] Installing <https://builds.apache.org/job/DeltaSpike%20RAT-Check/ws/deltaspike/modules/bean-validation/impl/pom.xml>
to /jenkins/maven-repositories/0/org/apache/deltaspike/modules/deltaspike-bean-validation-module-impl/1.0.3-SNAPSHOT/deltaspike-bean-validation-module-impl-1.0.3-SNAPSHOT.pom
[INFO] Installing <https://builds.apache.org/job/DeltaSpike%20RAT-Check/ws/deltaspike/modules/bean-validation/impl/target/deltaspike-bean-validation-module-impl-1.0.3-SNAPSHOT-tests.jar>
to /jenkins/maven-repositories/0/org/apache/deltaspike/modules/deltaspike-bean-validation-module-impl/1.0.3-SNAPSHOT/deltaspike-bean-validation-module-impl-1.0.3-SNAPSHOT-tests.jar
[INFO] Installing <https://builds.apache.org/job/DeltaSpike%20RAT-Check/ws/deltaspike/modules/bean-validation/impl/target/deltaspike-bean-validation-module-impl-1.0.3-SNAPSHOT-sources.jar>
to /jenkins/maven-repositories/0/org/apache/deltaspike/modules/deltaspike-bean-validation-module-impl/1.0.3-SNAPSHOT/deltaspike-bean-validation-module-impl-1.0.3-SNAPSHOT-sources.jar
[INFO] 
[INFO] --- maven-bundle-plugin:2.3.7:install (default-install) @ deltaspike-bean-validation-module-impl
---
[INFO] Installing org/apache/deltaspike/modules/deltaspike-bean-validation-module-impl/1.0.3-SNAPSHOT/deltaspike-bean-validation-module-impl-1.0.3-SNAPSHOT.jar
[INFO] Writing OBR metadata
Build timed out (after 30 minutes). Marking the build as failed.
[INFO] ------------------------------------------------------------------------
[INFO] Reactor Summary:
[INFO] 
[INFO] Apache DeltaSpike ................................. SUCCESS [1:38.786s]
[INFO] Apache DeltaSpike CheckStyle-rules ................ SUCCESS [9.613s]
[INFO] Apache DeltaSpike Parent .......................... SUCCESS [27.343s]
[INFO] Apache DeltaSpike Test-Utils ...................... SUCCESS [15.758s]
[INFO] Apache DeltaSpike Code Parent ..................... SUCCESS [24.466s]
[INFO] Apache DeltaSpike Core ............................ SUCCESS [9.141s]
[INFO] Apache DeltaSpike Core-API ........................ SUCCESS [39.479s]
[INFO] Apache DeltaSpike Core-Implementation ............. SUCCESS [42.121s]
[INFO] Apache DeltaSpike ContainerControl parent ......... SUCCESS [8.916s]
[INFO] Apache DeltaSpike CDI ContainerControl API ........ SUCCESS [16.535s]
[INFO] Apache DeltaSpike CDI ContainerControl TCK ........ SUCCESS [11.580s]
[INFO] Apache DeltaSpike CDI OWB-ContainerControl ........ SUCCESS [17.747s]
[INFO] Apache DeltaSpike CDI Weld-ContainerControl ....... SUCCESS [21.091s]
[INFO] Apache DeltaSpike CDI OpenEJB-ContainerControl .... SUCCESS [1:05.591s]
[INFO] Apache DeltaSpike CDI Servlet-ContainerControl .... SUCCESS [32.489s]
[INFO] Apache DeltaSpike Modules ......................... SUCCESS [8.239s]
[INFO] Apache DeltaSpike Security-Module ................. SUCCESS [8.723s]
[INFO] Apache DeltaSpike Security-Module API ............. SUCCESS [17.343s]
[INFO] Apache DeltaSpike Security-Module Impl ............ SUCCESS [20.693s]
[INFO] Apache DeltaSpike JPA-Module ...................... SUCCESS [9.092s]
[INFO] Apache DeltaSpike JPA-Module API .................. SUCCESS [17.812s]
[INFO] Apache DeltaSpike JPA-Module Impl ................. SUCCESS [32.752s]
[INFO] Apache DeltaSpike Servlet-Module .................. SUCCESS [11.548s]
[INFO] Apache DeltaSpike Servlet-Module API .............. SUCCESS [15.217s]
[INFO] Apache DeltaSpike Servlet-Module Impl ............. SUCCESS [18.012s]
[INFO] Apache DeltaSpike JSF-Module ...................... SUCCESS [14.589s]
[INFO] Apache DeltaSpike JSF-Module API .................. SUCCESS [14.251s]
[INFO] Apache DeltaSpike JSF-Module Impl ................. SUCCESS [1:26.997s]
[INFO] Apache DeltaSpike JSF-Module Impl (EE6 only) ...... SUCCESS [17.834s]
[INFO] Apache DeltaSpike Partial-Bean-Module ............. SUCCESS [11.209s]
[INFO] Apache DeltaSpike Partial-Bean-Module API ......... SUCCESS [12.075s]
[INFO] Apache DeltaSpike Partial-Bean-Module Impl ........ SUCCESS [17.180s]
[INFO] Apache DeltaSpike BeanValidation-Module ........... SUCCESS [8.689s]
[INFO] Apache DeltaSpike BeanValidation-Module API ....... SUCCESS [9.849s]
[INFO] Apache DeltaSpike BeanValidation-Module Impl ...... SUCCESS [14.644s]
[INFO] Apache DeltaSpike Data-Module ..................... FAILURE [0.076s]
[INFO] Apache DeltaSpike Data-Module API ................. SKIPPED
[INFO] Apache DeltaSpike Data-Module Impl ................ SKIPPED
[INFO] Apache DeltaSpike Scheduler-Module ................ SKIPPED
[INFO] Apache DeltaSpike Scheduler-Module API ............ SKIPPED
[INFO] Apache DeltaSpike Scheduler-Module Impl ........... SKIPPED
[INFO] Apache DeltaSpike Test-Control-Module ............. SKIPPED
[INFO] Apache DeltaSpike Test-Control-Module API ......... SKIPPED
[INFO] Apache DeltaSpike Test-Control-Module Impl ........ SKIPPED
[INFO] Apache DeltaSpike Examples ........................ SKIPPED
[INFO] Apache DeltaSpike Java-SE Examples ................ SKIPPED
[INFO] Apache DeltaSpike JSF Examples .................... SKIPPED
[INFO] Apache DeltaSpike JSF Playground .................. SKIPPED
[INFO] Apache DeltaSpike Java-SE Scheduler Examples ...... SKIPPED
[INFO] ------------------------------------------------------------------------
[INFO] BUILD FAILURE
[INFO] ------------------------------------------------------------------------
[INFO] Total time: 16:15.891s
[INFO] Finished at: Wed Sep 17 14:24:00 UTC 2014
[INFO] Final Memory: 63M/102M
[INFO] ------------------------------------------------------------------------
[ERROR] Internal error: java.lang.IllegalStateException: Unable to call isArchivingDisabled.
Invalid object ID 53 -> [Help 1]
org.apache.maven.InternalErrorException: Internal error: java.lang.IllegalStateException:
Unable to call isArchivingDisabled. Invalid object ID 53
	at org.apache.maven.DefaultMaven.execute(DefaultMaven.java:168)
	at org.jvnet.hudson.maven3.launcher.Maven3Launcher.main(Maven3Launcher.java:117)
	at sun.reflect.NativeMethodAccessorImpl.invoke0(Native Method)
	at sun.reflect.NativeMethodAccessorImpl.invoke(NativeMethodAccessorImpl.java:39)
	at sun.reflect.DelegatingMethodAccessorImpl.invoke(DelegatingMethodAccessorImpl.java:25)
	at java.lang.reflect.Method.invoke(Method.java:597)
	at org.codehaus.plexus.classworlds.launcher.Launcher.launchStandard(Launcher.java:329)
	at org.codehaus.plexus.classworlds.launcher.Launcher.launch(Launcher.java:239)
	at org.jvnet.hudson.maven3.agent.Maven3Main.launch(Maven3Main.java:178)
	at sun.reflect.NativeMethodAccessorImpl.invoke0(Native Method)
	at sun.reflect.NativeMethodAccessorImpl.invoke(NativeMethodAccessorImpl.java:39)
	at sun.reflect.DelegatingMethodAccessorImpl.invoke(DelegatingMethodAccessorImpl.java:25)
	at java.lang.reflect.Method.invoke(Method.java:597)
	at hudson.maven.Maven3Builder.call(Maven3Builder.java:134)
	at hudson.maven.Maven3Builder.call(Maven3Builder.java:69)
	at hudson.remoting.UserRequest.perform(UserRequest.java:118)
	at hudson.remoting.UserRequest.perform(UserRequest.java:48)
	at hudson.remoting.Request$2.run(Request.java:328)
	at hudson.remoting.InterceptingExecutorService$1.call(InterceptingExecutorService.java:72)
	at java.util.concurrent.FutureTask$Sync.innerRun(FutureTask.java:303)
	at java.util.concurrent.FutureTask.run(FutureTask.java:138)
	at java.util.concurrent.ThreadPoolExecutor$Worker.runTask(ThreadPoolExecutor.java:895)
	at java.util.concurrent.ThreadPoolExecutor$Worker.run(ThreadPoolExecutor.java:918)
	at java.lang.Thread.run(Thread.java:662)
Caused by: java.lang.IllegalStateException: Unable to call isArchivingDisabled. Invalid object
ID 53
	at hudson.remoting.RemoteInvocationHandler$RPCRequest.perform(RemoteInvocationHandler.java:293)
	at hudson.remoting.RemoteInvocationHandler$RPCRequest.call(RemoteInvocationHandler.java:280)
	at hudson.remoting.RemoteInvocationHandler$RPCRequest.call(RemoteInvocationHandler.java:239)
	at hudson.remoting.UserRequest.perform(UserRequest.java:118)
	at hudson.remoting.UserRequest.perform(UserRequest.java:48)
	at hudson.remoting.Request$2.run(Request.java:328)
	at hudson.remoting.InterceptingExecutorService$1.call(InterceptingExecutorService.java:72)
	at java.util.concurrent.FutureTask.run(FutureTask.java:262)
	at java.util.concurrent.ThreadPoolExecutor.runWorker(ThreadPoolExecutor.java:1145)
	at java.util.concurrent.ThreadPoolExecutor$Worker.run(ThreadPoolExecutor.java:615)
	at java.lang.Thread.run(Thread.java:745)
[ERROR] 
[ERROR] To see the full stack trace of the errors, re-run Maven with the -e switch.
[ERROR] Re-run Maven using the -X switch to enable full debug logging.
[ERROR] 
[ERROR] For more information about the errors and possible solutions, please read the following
articles:
[ERROR] [Help 1] http://cwiki.apache.org/confluence/display/MAVEN/InternalErrorException
channel stopped
Build was aborted

Mime
View raw message