deltaspike-commits mailing list archives

Site index · List index
Message view « Date » · « Thread »
Top « Date » · « Thread »
From Apache Jenkins Server <jenk...@builds.apache.org>
Subject Build failed in Jenkins: DeltaSpike OWB JDK8 » Apache DeltaSpike Test-Control-Module Impl #167
Date Tue, 30 Sep 2014 02:19:13 GMT
See <https://builds.apache.org/job/DeltaSpike%20OWB%20JDK8/org.apache.deltaspike.modules$deltaspike-test-control-module-impl/167/>

------------------------------------------
[INFO]                                                                         
[INFO] ------------------------------------------------------------------------
[INFO] Building Apache DeltaSpike Test-Control-Module Impl 1.0.4-SNAPSHOT
[INFO] ------------------------------------------------------------------------
[INFO] 
[INFO] --- maven-clean-plugin:2.5:clean (default-clean) @ deltaspike-test-control-module-impl
---
[INFO] 
[INFO] --- maven-bundle-plugin:2.3.7:cleanVersions (versions) @ deltaspike-test-control-module-impl
---
[INFO] 
[INFO] --- maven-antrun-plugin:1.6:run (javadoc.resources) @ deltaspike-test-control-module-impl
---
[WARNING] Parameter tasks is deprecated, use target instead
[INFO] Executing tasks

main:
[INFO] Executed tasks
[INFO] 
[INFO] --- maven-remote-resources-plugin:1.3:process (process-remote-resources) @ deltaspike-test-control-module-impl
---
[INFO] 
[INFO] --- maven-remote-resources-plugin:1.3:process (default) @ deltaspike-test-control-module-impl
---
[INFO] 
[INFO] --- maven-resources-plugin:2.5:resources (default-resources) @ deltaspike-test-control-module-impl
---
[debug] execute contextualize
[INFO] Using 'UTF-8' encoding to copy filtered resources.
[INFO] Copying 3 resources
[INFO] Copying 4 resources
[INFO] Copying 4 resources
[INFO] 
[INFO] --- maven-compiler-plugin:2.5:compile (default-compile) @ deltaspike-test-control-module-impl
---
[INFO] Compiling 14 source files to <https://builds.apache.org/job/DeltaSpike%20OWB%20JDK8/org.apache.deltaspike.modules$deltaspike-test-control-module-impl/ws/target/classes>
[INFO] -------------------------------------------------------------
[ERROR] COMPILATION ERROR : 
[INFO] -------------------------------------------------------------
[ERROR] error: error reading /jenkins/maven-repositories/0/commons-collections/commons-collections/3.2/commons-collections-3.2.jar;
error in opening zip file
[INFO] 1 error
[INFO] -------------------------------------------------------------

Mime
View raw message