deltaspike-commits mailing list archives

Site index · List index
Message view « Date » · « Thread »
Top « Date » · « Thread »
From Apache Jenkins Server <jenk...@builds.apache.org>
Subject Build failed in Jenkins: DeltaSpike Weld 1.1.4 » Apache DeltaSpike Core-Implementation #112
Date Tue, 17 Jun 2014 19:48:07 GMT
See <https://builds.apache.org/job/DeltaSpike%20Weld%201.1.4/org.apache.deltaspike.core$deltaspike-core-impl/112/changes>

Changes:

[gpetracek] [maven-release-plugin] prepare release deltaspike-project-1.0.0

[gpetracek] [maven-release-plugin] prepare for next development iteration

[lightguardjp] Should fix up DELTASPIKE-638

[lightguardjp] Looks like I missed one case.

------------------------------------------
[...truncated 278 lines...]
INFO: Computed the following DeltaSpike ProjectStage: SystemTest
Jun 17, 2014 7:46:02 PM org.apache.deltaspike.core.util.ProjectStageProducer initProjectStage
INFO: Computed the following DeltaSpike ProjectStage: IntegrationTest
Jun 17, 2014 7:46:02 PM org.apache.deltaspike.core.util.ProjectStageProducer initProjectStage
INFO: Computed the following DeltaSpike ProjectStage: SystemTest
Jun 17, 2014 7:46:02 PM org.apache.deltaspike.core.util.ProjectStageProducer initProjectStage
INFO: Computed the following DeltaSpike ProjectStage: IntegrationTest
Jun 17, 2014 7:46:02 PM org.apache.deltaspike.core.util.ProjectStageProducer initProjectStage
INFO: Computed the following DeltaSpike ProjectStage: SystemTest
Jun 17, 2014 7:46:02 PM org.apache.deltaspike.core.util.ProjectStageProducer initProjectStage
INFO: Computed the following DeltaSpike ProjectStage: IntegrationTest
Tests run: 1, Failures: 0, Errors: 0, Skipped: 0, Time elapsed: 0.053 sec
Concurrency config is parallel='none', perCoreThreadCount=true, threadCount=2, useUnlimitedThreads=false
Running org.apache.deltaspike.test.core.api.config.ConfigSourceTest
Jun 17, 2014 7:46:02 PM org.apache.deltaspike.core.impl.config.EnvironmentPropertyConfigSourceProvider
<init>
INFO: Custom config found by DeltaSpike. Name: 'META-INF/apache-deltaspike.properties', URL:
'<https://builds.apache.org/job/DeltaSpike%20Weld%201.1.4/org.apache.deltaspike.core$deltaspike-core-impl/ws/target/test-classes/META-INF/apache-deltaspike.properties'>
Tests run: 4, Failures: 0, Errors: 0, Skipped: 0, Time elapsed: 0.047 sec
Concurrency config is parallel='none', perCoreThreadCount=true, threadCount=2, useUnlimitedThreads=false
Jun 17, 2014 7:46:03 PM org.apache.deltaspike.test.utils.ShrinkWrapArchiveUtil getArchives
INFO: Test org.apache.deltaspike.test.core.api.config.injectable.InjectableConfigPropertyTest
Adding Java ClassPath URL as JavaArchive <https://builds.apache.org/job/DeltaSpike%20Weld%201.1.4/org.apache.deltaspike.core$deltaspike-core-impl/ws/target/classes/META-INF/beans.xml>
Jun 17, 2014 7:46:03 PM org.apache.deltaspike.test.utils.ShrinkWrapArchiveUtil getArchives
INFO: Test org.apache.deltaspike.test.core.api.config.injectable.InjectableConfigPropertyTest
Adding Java ClassPath URL as JavaArchive jar:file:/home/jenkins/jenkins-slave/workspace/DeltaSpike%20Weld%201.1.4/deltaspike/core/api/target/deltaspike-core-api-1.0.1-SNAPSHOT.jar!/META-INF/beans.xml
SLF4J: The requested version 1.6.99 by your slf4j binding is not compatible with [1.5.5, 1.5.6,
1.5.7, 1.5.8, 1.5.9, 1.5.10]
SLF4J: See http://www.slf4j.org/codes.html#version_mismatch for further details.
Running org.apache.deltaspike.test.core.api.config.injectable.InjectableConfigPropertyTest
Tests run: 1, Failures: 0, Errors: 1, Skipped: 0, Time elapsed: 0 sec <<< FAILURE!
Concurrency config is parallel='none', perCoreThreadCount=true, threadCount=2, useUnlimitedThreads=false
Jun 17, 2014 7:46:05 PM org.apache.deltaspike.test.utils.ShrinkWrapArchiveUtil getArchives
INFO: Test org.apache.deltaspike.test.core.api.config.propertyconfigsource.PropertyConfigSourceTest
Adding Java ClassPath URL as JavaArchive <https://builds.apache.org/job/DeltaSpike%20Weld%201.1.4/org.apache.deltaspike.core$deltaspike-core-impl/ws/target/classes/META-INF/beans.xml>
Jun 17, 2014 7:46:05 PM org.apache.deltaspike.test.utils.ShrinkWrapArchiveUtil getArchives
INFO: Test org.apache.deltaspike.test.core.api.config.propertyconfigsource.PropertyConfigSourceTest
Adding Java ClassPath URL as JavaArchive jar:file:/home/jenkins/jenkins-slave/workspace/DeltaSpike%20Weld%201.1.4/deltaspike/core/api/target/deltaspike-core-api-1.0.1-SNAPSHOT.jar!/META-INF/beans.xml
SLF4J: The requested version 1.6.99 by your slf4j binding is not compatible with [1.5.5, 1.5.6,
1.5.7, 1.5.8, 1.5.9, 1.5.10]
SLF4J: See http://www.slf4j.org/codes.html#version_mismatch for further details.
Running org.apache.deltaspike.test.core.api.config.propertyconfigsource.PropertyConfigSourceTest
Tests run: 1, Failures: 0, Errors: 1, Skipped: 0, Time elapsed: 0 sec <<< FAILURE!
Concurrency config is parallel='none', perCoreThreadCount=true, threadCount=2, useUnlimitedThreads=false
Running org.apache.deltaspike.test.core.api.interpreter.PropertyExpressionInterpreterTest
Jun 17, 2014 7:46:05 PM org.apache.deltaspike.core.impl.config.EnvironmentPropertyConfigSourceProvider
<init>
INFO: Custom config found by DeltaSpike. Name: 'META-INF/apache-deltaspike.properties', URL:
'<https://builds.apache.org/job/DeltaSpike%20Weld%201.1.4/org.apache.deltaspike.core$deltaspike-core-impl/ws/target/test-classes/META-INF/apache-deltaspike.properties'>
Jun 17, 2014 7:46:05 PM org.apache.deltaspike.core.util.ProjectStageProducer initProjectStage
INFO: Computed the following DeltaSpike ProjectStage: UnitTest
Tests run: 3, Failures: 0, Errors: 0, Skipped: 0, Time elapsed: 0.057 sec
Concurrency config is parallel='none', perCoreThreadCount=true, threadCount=2, useUnlimitedThreads=false
Jun 17, 2014 7:46:06 PM org.apache.deltaspike.test.utils.ShrinkWrapArchiveUtil getArchives
INFO: Test org.apache.deltaspike.test.core.api.util.context.AbstractContextTest Adding Java
ClassPath URL as JavaArchive <https://builds.apache.org/job/DeltaSpike%20Weld%201.1.4/org.apache.deltaspike.core$deltaspike-core-impl/ws/target/classes/META-INF/beans.xml>
Jun 17, 2014 7:46:06 PM org.apache.deltaspike.test.utils.ShrinkWrapArchiveUtil getArchives
INFO: Test org.apache.deltaspike.test.core.api.util.context.AbstractContextTest Adding Java
ClassPath URL as JavaArchive jar:file:/home/jenkins/jenkins-slave/workspace/DeltaSpike%20Weld%201.1.4/deltaspike/core/api/target/deltaspike-core-api-1.0.1-SNAPSHOT.jar!/META-INF/beans.xml
SLF4J: The requested version 1.6.99 by your slf4j binding is not compatible with [1.5.5, 1.5.6,
1.5.7, 1.5.8, 1.5.9, 1.5.10]
SLF4J: See http://www.slf4j.org/codes.html#version_mismatch for further details.
Running org.apache.deltaspike.test.core.api.util.context.AbstractContextTest
Tests run: 1, Failures: 0, Errors: 1, Skipped: 0, Time elapsed: 0 sec <<< FAILURE!
Concurrency config is parallel='none', perCoreThreadCount=true, threadCount=2, useUnlimitedThreads=false
Jun 17, 2014 7:46:08 PM org.apache.deltaspike.test.utils.ShrinkWrapArchiveUtil getArchives
INFO: Test org.apache.deltaspike.test.core.api.scope.viewaccess.ViewAccessScopedTest Adding
Java ClassPath URL as JavaArchive <https://builds.apache.org/job/DeltaSpike%20Weld%201.1.4/org.apache.deltaspike.core$deltaspike-core-impl/ws/target/classes/META-INF/beans.xml>
Jun 17, 2014 7:46:08 PM org.apache.deltaspike.test.utils.ShrinkWrapArchiveUtil getArchives
INFO: Test org.apache.deltaspike.test.core.api.scope.viewaccess.ViewAccessScopedTest Adding
Java ClassPath URL as JavaArchive jar:file:/home/jenkins/jenkins-slave/workspace/DeltaSpike%20Weld%201.1.4/deltaspike/core/api/target/deltaspike-core-api-1.0.1-SNAPSHOT.jar!/META-INF/beans.xml
SLF4J: The requested version 1.6.99 by your slf4j binding is not compatible with [1.5.5, 1.5.6,
1.5.7, 1.5.8, 1.5.9, 1.5.10]
SLF4J: See http://www.slf4j.org/codes.html#version_mismatch for further details.
Running org.apache.deltaspike.test.core.api.scope.viewaccess.ViewAccessScopedTest
Tests run: 1, Failures: 0, Errors: 1, Skipped: 0, Time elapsed: 0 sec <<< FAILURE!
Concurrency config is parallel='none', perCoreThreadCount=true, threadCount=2, useUnlimitedThreads=false
Jun 17, 2014 7:46:09 PM org.apache.deltaspike.test.utils.ShrinkWrapArchiveUtil getArchives
INFO: Test org.apache.deltaspike.test.core.api.scope.conversation.subgroup.uc003.GroupedConversationSubGroupTest
Adding Java ClassPath URL as JavaArchive <https://builds.apache.org/job/DeltaSpike%20Weld%201.1.4/org.apache.deltaspike.core$deltaspike-core-impl/ws/target/classes/META-INF/beans.xml>
Jun 17, 2014 7:46:09 PM org.apache.deltaspike.test.utils.ShrinkWrapArchiveUtil getArchives
INFO: Test org.apache.deltaspike.test.core.api.scope.conversation.subgroup.uc003.GroupedConversationSubGroupTest
Adding Java ClassPath URL as JavaArchive jar:file:/home/jenkins/jenkins-slave/workspace/DeltaSpike%20Weld%201.1.4/deltaspike/core/api/target/deltaspike-core-api-1.0.1-SNAPSHOT.jar!/META-INF/beans.xml
SLF4J: The requested version 1.6.99 by your slf4j binding is not compatible with [1.5.5, 1.5.6,
1.5.7, 1.5.8, 1.5.9, 1.5.10]
SLF4J: See http://www.slf4j.org/codes.html#version_mismatch for further details.
Running org.apache.deltaspike.test.core.api.scope.conversation.subgroup.uc003.GroupedConversationSubGroupTest
Tests run: 1, Failures: 0, Errors: 1, Skipped: 0, Time elapsed: 0 sec <<< FAILURE!
Concurrency config is parallel='none', perCoreThreadCount=true, threadCount=2, useUnlimitedThreads=false
Jun 17, 2014 7:46:11 PM org.apache.deltaspike.test.utils.ShrinkWrapArchiveUtil getArchives
INFO: Test org.apache.deltaspike.test.core.api.scope.conversation.subgroup.uc001.GroupedConversationSubGroupTest
Adding Java ClassPath URL as JavaArchive <https://builds.apache.org/job/DeltaSpike%20Weld%201.1.4/org.apache.deltaspike.core$deltaspike-core-impl/ws/target/classes/META-INF/beans.xml>
Jun 17, 2014 7:46:11 PM org.apache.deltaspike.test.utils.ShrinkWrapArchiveUtil getArchives
INFO: Test org.apache.deltaspike.test.core.api.scope.conversation.subgroup.uc001.GroupedConversationSubGroupTest
Adding Java ClassPath URL as JavaArchive jar:file:/home/jenkins/jenkins-slave/workspace/DeltaSpike%20Weld%201.1.4/deltaspike/core/api/target/deltaspike-core-api-1.0.1-SNAPSHOT.jar!/META-INF/beans.xml
SLF4J: The requested version 1.6.99 by your slf4j binding is not compatible with [1.5.5, 1.5.6,
1.5.7, 1.5.8, 1.5.9, 1.5.10]
SLF4J: See http://www.slf4j.org/codes.html#version_mismatch for further details.
Running org.apache.deltaspike.test.core.api.scope.conversation.subgroup.uc001.GroupedConversationSubGroupTest
Tests run: 1, Failures: 0, Errors: 1, Skipped: 0, Time elapsed: 0 sec <<< FAILURE!
Concurrency config is parallel='none', perCoreThreadCount=true, threadCount=2, useUnlimitedThreads=false
Jun 17, 2014 7:46:12 PM org.apache.deltaspike.test.utils.ShrinkWrapArchiveUtil getArchives
INFO: Test org.apache.deltaspike.test.core.api.scope.conversation.subgroup.uc002.GroupedConversationSubGroupTest
Adding Java ClassPath URL as JavaArchive <https://builds.apache.org/job/DeltaSpike%20Weld%201.1.4/org.apache.deltaspike.core$deltaspike-core-impl/ws/target/classes/META-INF/beans.xml>
Jun 17, 2014 7:46:12 PM org.apache.deltaspike.test.utils.ShrinkWrapArchiveUtil getArchives
INFO: Test org.apache.deltaspike.test.core.api.scope.conversation.subgroup.uc002.GroupedConversationSubGroupTest
Adding Java ClassPath URL as JavaArchive jar:file:/home/jenkins/jenkins-slave/workspace/DeltaSpike%20Weld%201.1.4/deltaspike/core/api/target/deltaspike-core-api-1.0.1-SNAPSHOT.jar!/META-INF/beans.xml
SLF4J: The requested version 1.6.99 by your slf4j binding is not compatible with [1.5.5, 1.5.6,
1.5.7, 1.5.8, 1.5.9, 1.5.10]
SLF4J: See http://www.slf4j.org/codes.html#version_mismatch for further details.
Running org.apache.deltaspike.test.core.api.scope.conversation.subgroup.uc002.GroupedConversationSubGroupTest
Tests run: 1, Failures: 0, Errors: 1, Skipped: 0, Time elapsed: 0 sec <<< FAILURE!
Concurrency config is parallel='none', perCoreThreadCount=true, threadCount=2, useUnlimitedThreads=false
Jun 17, 2014 7:46:13 PM org.apache.deltaspike.test.utils.ShrinkWrapArchiveUtil getArchives
INFO: Test org.apache.deltaspike.test.core.api.scope.conversation.grouped.implicit.ImplicitlyGroupedConversationsTest
Adding Java ClassPath URL as JavaArchive <https://builds.apache.org/job/DeltaSpike%20Weld%201.1.4/org.apache.deltaspike.core$deltaspike-core-impl/ws/target/classes/META-INF/beans.xml>
Jun 17, 2014 7:46:13 PM org.apache.deltaspike.test.utils.ShrinkWrapArchiveUtil getArchives
INFO: Test org.apache.deltaspike.test.core.api.scope.conversation.grouped.implicit.ImplicitlyGroupedConversationsTest
Adding Java ClassPath URL as JavaArchive jar:file:/home/jenkins/jenkins-slave/workspace/DeltaSpike%20Weld%201.1.4/deltaspike/core/api/target/deltaspike-core-api-1.0.1-SNAPSHOT.jar!/META-INF/beans.xml
SLF4J: The requested version 1.6.99 by your slf4j binding is not compatible with [1.5.5, 1.5.6,
1.5.7, 1.5.8, 1.5.9, 1.5.10]
SLF4J: See http://www.slf4j.org/codes.html#version_mismatch for further details.
Running org.apache.deltaspike.test.core.api.scope.conversation.grouped.implicit.ImplicitlyGroupedConversationsTest
Tests run: 1, Failures: 0, Errors: 1, Skipped: 0, Time elapsed: 0 sec <<< FAILURE!
Concurrency config is parallel='none', perCoreThreadCount=true, threadCount=2, useUnlimitedThreads=false
Jun 17, 2014 7:46:15 PM org.apache.deltaspike.test.utils.ShrinkWrapArchiveUtil getArchives
INFO: Test org.apache.deltaspike.test.core.api.scope.conversation.grouped.explicit.ExplicitlyGroupedConversationsTest
Adding Java ClassPath URL as JavaArchive <https://builds.apache.org/job/DeltaSpike%20Weld%201.1.4/org.apache.deltaspike.core$deltaspike-core-impl/ws/target/classes/META-INF/beans.xml>
Jun 17, 2014 7:46:15 PM org.apache.deltaspike.test.utils.ShrinkWrapArchiveUtil getArchives
INFO: Test org.apache.deltaspike.test.core.api.scope.conversation.grouped.explicit.ExplicitlyGroupedConversationsTest
Adding Java ClassPath URL as JavaArchive jar:file:/home/jenkins/jenkins-slave/workspace/DeltaSpike%20Weld%201.1.4/deltaspike/core/api/target/deltaspike-core-api-1.0.1-SNAPSHOT.jar!/META-INF/beans.xml
SLF4J: The requested version 1.6.99 by your slf4j binding is not compatible with [1.5.5, 1.5.6,
1.5.7, 1.5.8, 1.5.9, 1.5.10]
SLF4J: See http://www.slf4j.org/codes.html#version_mismatch for further details.
Running org.apache.deltaspike.test.core.api.scope.conversation.grouped.explicit.ExplicitlyGroupedConversationsTest
Tests run: 1, Failures: 0, Errors: 1, Skipped: 0, Time elapsed: 0 sec <<< FAILURE!
Concurrency config is parallel='none', perCoreThreadCount=true, threadCount=2, useUnlimitedThreads=false
Jun 17, 2014 7:46:16 PM org.apache.deltaspike.test.utils.ShrinkWrapArchiveUtil getArchives
INFO: Test org.apache.deltaspike.test.core.api.exclude.uc001.EntityExcludeTest Adding Java
ClassPath URL as JavaArchive <https://builds.apache.org/job/DeltaSpike%20Weld%201.1.4/org.apache.deltaspike.core$deltaspike-core-impl/ws/target/classes/META-INF/beans.xml>
Jun 17, 2014 7:46:16 PM org.apache.deltaspike.test.utils.ShrinkWrapArchiveUtil getArchives
INFO: Test org.apache.deltaspike.test.core.api.exclude.uc001.EntityExcludeTest Adding Java
ClassPath URL as JavaArchive jar:file:/home/jenkins/jenkins-slave/workspace/DeltaSpike%20Weld%201.1.4/deltaspike/core/api/target/deltaspike-core-api-1.0.1-SNAPSHOT.jar!/META-INF/beans.xml
SLF4J: The requested version 1.6.99 by your slf4j binding is not compatible with [1.5.5, 1.5.6,
1.5.7, 1.5.8, 1.5.9, 1.5.10]
SLF4J: See http://www.slf4j.org/codes.html#version_mismatch for further details.
Running org.apache.deltaspike.test.core.api.exclude.uc001.EntityExcludeTest
Tests run: 1, Failures: 0, Errors: 1, Skipped: 0, Time elapsed: 0 sec <<< FAILURE!
Concurrency config is parallel='none', perCoreThreadCount=true, threadCount=2, useUnlimitedThreads=false
Jun 17, 2014 7:46:17 PM org.apache.deltaspike.test.utils.ShrinkWrapArchiveUtil getArchives
INFO: Test org.apache.deltaspike.test.core.api.exclude.ExcludeWarFileTest Adding Java ClassPath
URL as JavaArchive <https://builds.apache.org/job/DeltaSpike%20Weld%201.1.4/org.apache.deltaspike.core$deltaspike-core-impl/ws/target/classes/META-INF/beans.xml>
Jun 17, 2014 7:46:17 PM org.apache.deltaspike.test.utils.ShrinkWrapArchiveUtil getArchives
INFO: Test org.apache.deltaspike.test.core.api.exclude.ExcludeWarFileTest Adding Java ClassPath
URL as JavaArchive jar:file:/home/jenkins/jenkins-slave/workspace/DeltaSpike%20Weld%201.1.4/deltaspike/core/api/target/deltaspike-core-api-1.0.1-SNAPSHOT.jar!/META-INF/beans.xml
SLF4J: The requested version 1.6.99 by your slf4j binding is not compatible with [1.5.5, 1.5.6,
1.5.7, 1.5.8, 1.5.9, 1.5.10]
SLF4J: See http://www.slf4j.org/codes.html#version_mismatch for further details.
Running org.apache.deltaspike.test.core.api.exclude.ExcludeWarFileTest
Tests run: 1, Failures: 0, Errors: 1, Skipped: 0, Time elapsed: 0 sec <<< FAILURE!
Concurrency config is parallel='none', perCoreThreadCount=true, threadCount=2, useUnlimitedThreads=false
Jun 17, 2014 7:46:19 PM org.apache.deltaspike.test.utils.ShrinkWrapArchiveUtil getArchives
INFO: Test org.apache.deltaspike.test.core.api.provider.BeanManagerProviderWarFileTest Adding
Java ClassPath URL as JavaArchive <https://builds.apache.org/job/DeltaSpike%20Weld%201.1.4/org.apache.deltaspike.core$deltaspike-core-impl/ws/target/classes/META-INF/beans.xml>
Jun 17, 2014 7:46:19 PM org.apache.deltaspike.test.utils.ShrinkWrapArchiveUtil getArchives
INFO: Test org.apache.deltaspike.test.core.api.provider.BeanManagerProviderWarFileTest Adding
Java ClassPath URL as JavaArchive jar:file:/home/jenkins/jenkins-slave/workspace/DeltaSpike%20Weld%201.1.4/deltaspike/core/api/target/deltaspike-core-api-1.0.1-SNAPSHOT.jar!/META-INF/beans.xml
SLF4J: The requested version 1.6.99 by your slf4j binding is not compatible with [1.5.5, 1.5.6,
1.5.7, 1.5.8, 1.5.9, 1.5.10]
SLF4J: See http://www.slf4j.org/codes.html#version_mismatch for further details.
Running org.apache.deltaspike.test.core.api.provider.BeanManagerProviderWarFileTest
Tests run: 1, Failures: 0, Errors: 1, Skipped: 0, Time elapsed: 0 sec <<< FAILURE!
Concurrency config is parallel='none', perCoreThreadCount=true, threadCount=2, useUnlimitedThreads=false
Jun 17, 2014 7:46:20 PM org.apache.deltaspike.test.utils.ShrinkWrapArchiveUtil getArchives
INFO: Test org.apache.deltaspike.test.core.api.provider.BeanProviderTest Adding Java ClassPath
URL as JavaArchive <https://builds.apache.org/job/DeltaSpike%20Weld%201.1.4/org.apache.deltaspike.core$deltaspike-core-impl/ws/target/classes/META-INF/beans.xml>
Jun 17, 2014 7:46:20 PM org.apache.deltaspike.test.utils.ShrinkWrapArchiveUtil getArchives
INFO: Test org.apache.deltaspike.test.core.api.provider.BeanProviderTest Adding Java ClassPath
URL as JavaArchive jar:file:/home/jenkins/jenkins-slave/workspace/DeltaSpike%20Weld%201.1.4/deltaspike/core/api/target/deltaspike-core-api-1.0.1-SNAPSHOT.jar!/META-INF/beans.xml
SLF4J: The requested version 1.6.99 by your slf4j binding is not compatible with [1.5.5, 1.5.6,
1.5.7, 1.5.8, 1.5.9, 1.5.10]
SLF4J: See http://www.slf4j.org/codes.html#version_mismatch for further details.
Running org.apache.deltaspike.test.core.api.provider.BeanProviderTest
Tests run: 1, Failures: 0, Errors: 1, Skipped: 0, Time elapsed: 0 sec <<< FAILURE!

Results :

Tests in error: 
  org.apache.deltaspike.test.core.impl.exception.control.traversal.TraversalPathTest: org.slf4j.helpers.MessageFormatter.format(Ljava/lang/String;Ljava/lang/Object;Ljava/lang/Object;)Lorg/slf4j/helpers/FormattingTuple;
  org.apache.deltaspike.test.core.impl.exception.control.event.EventTest: org.slf4j.helpers.MessageFormatter.format(Ljava/lang/String;Ljava/lang/Object;Ljava/lang/Object;)Lorg/slf4j/helpers/FormattingTuple;
  org.apache.deltaspike.test.core.impl.exception.control.handler.CallingHandlersTest: org.slf4j.helpers.MessageFormatter.format(Ljava/lang/String;Ljava/lang/Object;Ljava/lang/Object;)Lorg/slf4j/helpers/FormattingTuple;
  org.apache.deltaspike.test.core.impl.exception.control.handler.UnMuteHandlerTest: org.slf4j.helpers.MessageFormatter.format(Ljava/lang/String;Ljava/lang/Object;Ljava/lang/Object;)Lorg/slf4j/helpers/FormattingTuple;
  org.apache.deltaspike.test.core.impl.exception.control.handler.HandlerComparatorTest: org.slf4j.helpers.MessageFormatter.format(Ljava/lang/String;Ljava/lang/Object;Ljava/lang/Object;)Lorg/slf4j/helpers/FormattingTuple;
  org.apache.deltaspike.test.core.impl.exception.control.flow.RethrowTest: org.slf4j.helpers.MessageFormatter.format(Ljava/lang/String;Ljava/lang/Object;Ljava/lang/Object;)Lorg/slf4j/helpers/FormattingTuple;
  org.apache.deltaspike.test.core.impl.exception.control.flow.ThrowingNewExceptionTest: org.slf4j.helpers.MessageFormatter.format(Ljava/lang/String;Ljava/lang/Object;Ljava/lang/Object;)Lorg/slf4j/helpers/FormattingTuple;
  org.apache.deltaspike.test.core.impl.exception.control.flow.BreadthFirstAbortControlTest:
org.slf4j.helpers.MessageFormatter.format(Ljava/lang/String;Ljava/lang/Object;Ljava/lang/Object;)Lorg/slf4j/helpers/FormattingTuple;
  org.apache.deltaspike.test.core.impl.exception.control.flow.HandledExceptionHandlerTest:
org.slf4j.helpers.MessageFormatter.format(Ljava/lang/String;Ljava/lang/Object;Ljava/lang/Object;)Lorg/slf4j/helpers/FormattingTuple;
  org.apache.deltaspike.test.core.impl.exception.control.flow.ProceedCauseHandlerTest: org.slf4j.helpers.MessageFormatter.format(Ljava/lang/String;Ljava/lang/Object;Ljava/lang/Object;)Lorg/slf4j/helpers/FormattingTuple;
  org.apache.deltaspike.test.core.impl.exception.control.flow.DepthAbortControlTest: org.slf4j.helpers.MessageFormatter.format(Ljava/lang/String;Ljava/lang/Object;Ljava/lang/Object;)Lorg/slf4j/helpers/FormattingTuple;
  org.apache.deltaspike.test.core.impl.jmx.SimpleRegistrationWarFileTest: org.slf4j.helpers.MessageFormatter.format(Ljava/lang/String;Ljava/lang/Object;Ljava/lang/Object;)Lorg/slf4j/helpers/FormattingTuple;
  org.apache.deltaspike.test.core.impl.scope.window.DefaultWindowContextTest: org.slf4j.helpers.MessageFormatter.format(Ljava/lang/String;Ljava/lang/Object;Ljava/lang/Object;)Lorg/slf4j/helpers/FormattingTuple;
  org.apache.deltaspike.test.core.impl.activation.ClassDeactivationWarFileTest: org.slf4j.helpers.MessageFormatter.format(Ljava/lang/String;Ljava/lang/Object;Ljava/lang/Object;)Lorg/slf4j/helpers/FormattingTuple;
  org.apache.deltaspike.test.core.impl.resourceloader.ClasspathResourceTest: org.slf4j.helpers.MessageFormatter.format(Ljava/lang/String;Ljava/lang/Object;Ljava/lang/Object;)Lorg/slf4j/helpers/FormattingTuple;
  org.apache.deltaspike.test.core.impl.resourceloader.FileResourceTest: org.slf4j.helpers.MessageFormatter.format(Ljava/lang/String;Ljava/lang/Object;Ljava/lang/Object;)Lorg/slf4j/helpers/FormattingTuple;
  org.apache.deltaspike.test.core.api.alternative.local.BdaAlternativeWarFileTest: org.slf4j.helpers.MessageFormatter.format(Ljava/lang/String;Ljava/lang/Object;Ljava/lang/Object;)Lorg/slf4j/helpers/FormattingTuple;
  org.apache.deltaspike.test.core.api.alternative.global.GlobalAlternativeTest: org.slf4j.helpers.MessageFormatter.format(Ljava/lang/String;Ljava/lang/Object;Ljava/lang/Object;)Lorg/slf4j/helpers/FormattingTuple;
  org.apache.deltaspike.test.core.api.message.MessageTest: org.slf4j.helpers.MessageFormatter.format(Ljava/lang/String;Ljava/lang/Object;Ljava/lang/Object;)Lorg/slf4j/helpers/FormattingTuple;
  org.apache.deltaspike.test.core.api.message.locale.ConfigurableLocaleMessageTest: org.slf4j.helpers.MessageFormatter.format(Ljava/lang/String;Ljava/lang/Object;Ljava/lang/Object;)Lorg/slf4j/helpers/FormattingTuple;
  org.apache.deltaspike.test.core.api.message.MessageContextTest: org.slf4j.helpers.MessageFormatter.format(Ljava/lang/String;Ljava/lang/Object;Ljava/lang/Object;)Lorg/slf4j/helpers/FormattingTuple;
  org.apache.deltaspike.test.core.api.message.MessageFormattedMessageTest: org.slf4j.helpers.MessageFormatter.format(Ljava/lang/String;Ljava/lang/Object;Ljava/lang/Object;)Lorg/slf4j/helpers/FormattingTuple;
  org.apache.deltaspike.test.core.api.message.SimpleMessageTest: org.slf4j.helpers.MessageFormatter.format(Ljava/lang/String;Ljava/lang/Object;Ljava/lang/Object;)Lorg/slf4j/helpers/FormattingTuple;
  org.apache.deltaspike.test.core.api.message.MinimalMessagesTest: org.slf4j.helpers.MessageFormatter.format(Ljava/lang/String;Ljava/lang/Object;Ljava/lang/Object;)Lorg/slf4j/helpers/FormattingTuple;
  org.apache.deltaspike.test.core.api.config.injectable.InjectableConfigPropertyTest: org.slf4j.helpers.MessageFormatter.format(Ljava/lang/String;Ljava/lang/Object;Ljava/lang/Object;)Lorg/slf4j/helpers/FormattingTuple;
  org.apache.deltaspike.test.core.api.config.propertyconfigsource.PropertyConfigSourceTest:
org.slf4j.helpers.MessageFormatter.format(Ljava/lang/String;Ljava/lang/Object;Ljava/lang/Object;)Lorg/slf4j/helpers/FormattingTuple;
  org.apache.deltaspike.test.core.api.util.context.AbstractContextTest: org.slf4j.helpers.MessageFormatter.format(Ljava/lang/String;Ljava/lang/Object;Ljava/lang/Object;)Lorg/slf4j/helpers/FormattingTuple;
  org.apache.deltaspike.test.core.api.scope.viewaccess.ViewAccessScopedTest: org.slf4j.helpers.MessageFormatter.format(Ljava/lang/String;Ljava/lang/Object;Ljava/lang/Object;)Lorg/slf4j/helpers/FormattingTuple;
  org.apache.deltaspike.test.core.api.scope.conversation.subgroup.uc003.GroupedConversationSubGroupTest:
org.slf4j.helpers.MessageFormatter.format(Ljava/lang/String;Ljava/lang/Object;Ljava/lang/Object;)Lorg/slf4j/helpers/FormattingTuple;
  org.apache.deltaspike.test.core.api.scope.conversation.subgroup.uc001.GroupedConversationSubGroupTest:
org.slf4j.helpers.MessageFormatter.format(Ljava/lang/String;Ljava/lang/Object;Ljava/lang/Object;)Lorg/slf4j/helpers/FormattingTuple;
  org.apache.deltaspike.test.core.api.scope.conversation.subgroup.uc002.GroupedConversationSubGroupTest:
org.slf4j.helpers.MessageFormatter.format(Ljava/lang/String;Ljava/lang/Object;Ljava/lang/Object;)Lorg/slf4j/helpers/FormattingTuple;
  org.apache.deltaspike.test.core.api.scope.conversation.grouped.implicit.ImplicitlyGroupedConversationsTest:
org.slf4j.helpers.MessageFormatter.format(Ljava/lang/String;Ljava/lang/Object;Ljava/lang/Object;)Lorg/slf4j/helpers/FormattingTuple;
  org.apache.deltaspike.test.core.api.scope.conversation.grouped.explicit.ExplicitlyGroupedConversationsTest:
org.slf4j.helpers.MessageFormatter.format(Ljava/lang/String;Ljava/lang/Object;Ljava/lang/Object;)Lorg/slf4j/helpers/FormattingTuple;
  org.apache.deltaspike.test.core.api.exclude.uc001.EntityExcludeTest: org.slf4j.helpers.MessageFormatter.format(Ljava/lang/String;Ljava/lang/Object;Ljava/lang/Object;)Lorg/slf4j/helpers/FormattingTuple;
  org.apache.deltaspike.test.core.api.exclude.ExcludeWarFileTest: org.slf4j.helpers.MessageFormatter.format(Ljava/lang/String;Ljava/lang/Object;Ljava/lang/Object;)Lorg/slf4j/helpers/FormattingTuple;
  org.apache.deltaspike.test.core.api.provider.BeanManagerProviderWarFileTest: org.slf4j.helpers.MessageFormatter.format(Ljava/lang/String;Ljava/lang/Object;Ljava/lang/Object;)Lorg/slf4j/helpers/FormattingTuple;
  org.apache.deltaspike.test.core.api.provider.BeanProviderTest: org.slf4j.helpers.MessageFormatter.format(Ljava/lang/String;Ljava/lang/Object;Ljava/lang/Object;)Lorg/slf4j/helpers/FormattingTuple;

Tests run: 46, Failures: 0, Errors: 37, Skipped: 0

[ERROR] There are test failures.

Please refer to <https://builds.apache.org/job/DeltaSpike%20Weld%201.1.4/org.apache.deltaspike.core$deltaspike-core-impl/ws/target/surefire-reports>
for the individual test results.
[JENKINS] Recording test results
[INFO] 
[INFO] --- maven-bundle-plugin:2.3.7:bundle (default-bundle) @ deltaspike-core-impl ---
[WARNING] Bundle org.apache.deltaspike.core:deltaspike-core-impl:bundle:1.0.1-SNAPSHOT : Did
not find matching referal for !org.apache.deltaspike.core.impl.*
[INFO] 
[INFO] --- maven-site-plugin:3.1:attach-descriptor (attach-descriptor) @ deltaspike-core-impl
---
[INFO] 
[INFO] --- maven-jar-plugin:2.4:test-jar (default) @ deltaspike-core-impl ---
[INFO] Building jar: <https://builds.apache.org/job/DeltaSpike%20Weld%201.1.4/org.apache.deltaspike.core$deltaspike-core-impl/ws/target/deltaspike-core-impl-1.0.1-SNAPSHOT-tests.jar>
[INFO] 
[INFO] --- maven-bundle-plugin:2.3.7:cleanVersions (versions) @ deltaspike-core-impl ---
[INFO] 
[INFO] --- maven-antrun-plugin:1.6:run (javadoc.resources) @ deltaspike-core-impl ---
[WARNING] Parameter tasks is deprecated, use target instead
[INFO] Executing tasks

main:
[INFO] Executed tasks
[WARNING] Failed to getClass for org.apache.maven.plugin.source.SourceJarMojo
[INFO] 
[INFO] --- maven-source-plugin:2.1.2:jar (attach-sources) @ deltaspike-core-impl ---
[INFO] META-INF already added, skipping
[INFO] META-INF/DISCLAIMER already added, skipping
[INFO] META-INF/LICENSE already added, skipping
[INFO] META-INF/NOTICE already added, skipping
[INFO] META-INF/DEPENDENCIES already added, skipping
[INFO] META-INF already added, skipping
[INFO] META-INF already added, skipping
[INFO] META-INF/DISCLAIMER already added, skipping
[INFO] META-INF/LICENSE already added, skipping
[INFO] META-INF/NOTICE already added, skipping
[INFO] META-INF/DEPENDENCIES already added, skipping
[INFO] META-INF already added, skipping
[INFO] META-INF/DISCLAIMER already added, skipping
[INFO] META-INF/LICENSE already added, skipping
[INFO] META-INF/NOTICE already added, skipping
[INFO] META-INF/DEPENDENCIES already added, skipping
[INFO] Building jar: <https://builds.apache.org/job/DeltaSpike%20Weld%201.1.4/org.apache.deltaspike.core$deltaspike-core-impl/ws/target/deltaspike-core-impl-1.0.1-SNAPSHOT-sources.jar>
[INFO] META-INF already added, skipping
[INFO] META-INF/DISCLAIMER already added, skipping
[INFO] META-INF/LICENSE already added, skipping
[INFO] META-INF/NOTICE already added, skipping
[INFO] META-INF/DEPENDENCIES already added, skipping
[INFO] META-INF already added, skipping
[INFO] META-INF already added, skipping
[INFO] META-INF/DISCLAIMER already added, skipping
[INFO] META-INF/LICENSE already added, skipping
[INFO] META-INF/NOTICE already added, skipping
[INFO] META-INF/DEPENDENCIES already added, skipping
[INFO] META-INF already added, skipping
[INFO] META-INF/DISCLAIMER already added, skipping
[INFO] META-INF/LICENSE already added, skipping
[INFO] META-INF/NOTICE already added, skipping
[INFO] META-INF/DEPENDENCIES already added, skipping
[INFO] 
[INFO] --- maven-checkstyle-plugin:2.9.1:check (verify-style) @ deltaspike-core-impl ---
[INFO] Starting audit...
<https://builds.apache.org/job/DeltaSpike%20Weld%201.1.4/org.apache.deltaspike.core$deltaspike-core-impl/ws/src/main/java/org/apache/deltaspike/core/impl/exception/control/ExceptionHandlerBroadcaster.java>:79:
label child at indentation level 12 not at correct indentation, 8
Audit done.

[INFO] There are 1 checkstyle errors.

Mime
View raw message