deltaspike-commits mailing list archives

Site index · List index
Message view « Date » · « Thread »
Top « Date » · « Thread »
From Apache Jenkins Server <jenk...@builds.apache.org>
Subject Build failed in Jenkins: DeltaSpike_TomEE-SNAPSHOT #219
Date Sun, 01 Jun 2014 12:36:50 GMT
See <https://builds.apache.org/job/DeltaSpike_TomEE-SNAPSHOT/219/>

------------------------------------------
[...truncated 8598 lines...]
[INFO] META-INF/DISCLAIMER already added, skipping
[INFO] META-INF/LICENSE already added, skipping
[INFO] META-INF/NOTICE already added, skipping
[INFO] META-INF/DEPENDENCIES already added, skipping
[INFO] META-INF already added, skipping
[INFO] META-INF already added, skipping
[INFO] META-INF/DISCLAIMER already added, skipping
[INFO] META-INF/LICENSE already added, skipping
[INFO] META-INF/NOTICE already added, skipping
[INFO] META-INF/DEPENDENCIES already added, skipping
[INFO] META-INF already added, skipping
[INFO] META-INF/DISCLAIMER already added, skipping
[INFO] META-INF/LICENSE already added, skipping
[INFO] META-INF/NOTICE already added, skipping
[INFO] META-INF/DEPENDENCIES already added, skipping
[INFO] 
[INFO] --- maven-checkstyle-plugin:2.9.1:check (verify-style) @ deltaspike-cdictrl-weld ---
[INFO] Starting audit...
Audit done.

[INFO] 
[INFO] --- maven-install-plugin:2.3.1:install (default-install) @ deltaspike-cdictrl-weld
---
[INFO] Installing <https://builds.apache.org/job/DeltaSpike_TomEE-SNAPSHOT/ws/deltaspike/cdictrl/impl-weld/target/deltaspike-cdictrl-weld-1.0.0-SNAPSHOT.jar>
to /home/jenkins/jenkins-slave/maven-repositories/1/org/apache/deltaspike/cdictrl/deltaspike-cdictrl-weld/1.0.0-SNAPSHOT/deltaspike-cdictrl-weld-1.0.0-SNAPSHOT.jar
[INFO] Installing <https://builds.apache.org/job/DeltaSpike_TomEE-SNAPSHOT/ws/deltaspike/cdictrl/impl-weld/pom.xml>
to /home/jenkins/jenkins-slave/maven-repositories/1/org/apache/deltaspike/cdictrl/deltaspike-cdictrl-weld/1.0.0-SNAPSHOT/deltaspike-cdictrl-weld-1.0.0-SNAPSHOT.pom
[INFO] Installing <https://builds.apache.org/job/DeltaSpike_TomEE-SNAPSHOT/ws/deltaspike/cdictrl/impl-weld/target/deltaspike-cdictrl-weld-1.0.0-SNAPSHOT-sources.jar>
to /home/jenkins/jenkins-slave/maven-repositories/1/org/apache/deltaspike/cdictrl/deltaspike-cdictrl-weld/1.0.0-SNAPSHOT/deltaspike-cdictrl-weld-1.0.0-SNAPSHOT-sources.jar
[INFO]                                                                         
[INFO] ------------------------------------------------------------------------
[INFO] Building Apache DeltaSpike CDI OpenEJB-ContainerControl 1.0.0-SNAPSHOT
[INFO] ------------------------------------------------------------------------
[INFO] 
[INFO] --- maven-clean-plugin:2.5:clean (default-clean) @ deltaspike-cdictrl-openejb ---
[INFO] 
[INFO] --- maven-bundle-plugin:2.3.7:cleanVersions (versions) @ deltaspike-cdictrl-openejb
---
[INFO] 
[INFO] --- maven-antrun-plugin:1.6:run (javadoc.resources) @ deltaspike-cdictrl-openejb ---
[WARNING] Parameter tasks is deprecated, use target instead
[INFO] Executing tasks

main:
[INFO] Executed tasks
[INFO] 
[INFO] --- maven-dependency-plugin:2.4:unpack (unpack-context) @ deltaspike-cdictrl-openejb
---
[INFO] Configured Artifact: org.apache.deltaspike.cdictrl:deltaspike-cdictrl-owb:1.0.0-SNAPSHOT:jar
[INFO] Unpacking <https://builds.apache.org/job/DeltaSpike_TomEE-SNAPSHOT/ws/deltaspike/cdictrl/impl-owb/target/deltaspike-cdictrl-owb-1.0.0-SNAPSHOT.jar>
to <https://builds.apache.org/job/DeltaSpike_TomEE-SNAPSHOT/ws/deltaspike/cdictrl/impl-openejb/target/classes>
with includes "" and excludes "**\/META-INF\/**,**\/OpenWebBeansContainerControl.class"
[INFO] 
[INFO] --- maven-remote-resources-plugin:1.3:process (process-remote-resources) @ deltaspike-cdictrl-openejb
---
[WARNING] Invalid POM for org.apache.openejb:openejb-core:jar:4.6.1-SNAPSHOT, transitive dependencies
(if any) will not be available, enable debug logging for more details
[INFO] 
[INFO] --- maven-remote-resources-plugin:1.3:process (default) @ deltaspike-cdictrl-openejb
---
[INFO] 
[INFO] --- maven-resources-plugin:2.5:resources (default-resources) @ deltaspike-cdictrl-openejb
---
[debug] execute contextualize
[INFO] Using 'UTF-8' encoding to copy filtered resources.
[INFO] Copying 2 resources
[INFO] Copying 4 resources
[INFO] Copying 4 resources
[INFO] 
[INFO] --- maven-compiler-plugin:2.5:compile (default-compile) @ deltaspike-cdictrl-openejb
---
[INFO] Compiling 1 source file to <https://builds.apache.org/job/DeltaSpike_TomEE-SNAPSHOT/ws/deltaspike/cdictrl/impl-openejb/target/classes>
[INFO] -------------------------------------------------------------
[ERROR] COMPILATION ERROR : 
[INFO] -------------------------------------------------------------
[ERROR] <https://builds.apache.org/job/DeltaSpike_TomEE-SNAPSHOT/ws/deltaspike/cdictrl/impl-openejb/src/main/java/org/apache/deltaspike/cdise/openejb/OpenEjbContainerControl.java>:[26,33]
package org.apache.webbeans.config does not exist
[ERROR] <https://builds.apache.org/job/DeltaSpike_TomEE-SNAPSHOT/ws/deltaspike/cdictrl/impl-openejb/src/main/java/org/apache/deltaspike/cdise/openejb/OpenEjbContainerControl.java>:[28,35]
package javax.enterprise.context.spi does not exist
[ERROR] <https://builds.apache.org/job/DeltaSpike_TomEE-SNAPSHOT/ws/deltaspike/cdictrl/impl-openejb/src/main/java/org/apache/deltaspike/cdise/openejb/OpenEjbContainerControl.java>:[29,34]
package javax.enterprise.inject.spi does not exist
[ERROR] <https://builds.apache.org/job/DeltaSpike_TomEE-SNAPSHOT/ws/deltaspike/cdictrl/impl-openejb/src/main/java/org/apache/deltaspike/cdise/openejb/OpenEjbContainerControl.java>:[30,34]
package javax.enterprise.inject.spi does not exist
[ERROR] <https://builds.apache.org/job/DeltaSpike_TomEE-SNAPSHOT/ws/deltaspike/cdictrl/impl-openejb/src/main/java/org/apache/deltaspike/cdise/openejb/OpenEjbContainerControl.java>:[65,12]
cannot find symbol
symbol  : class Bean
location: class org.apache.deltaspike.cdise.openejb.OpenEjbContainerControl
[ERROR] <https://builds.apache.org/job/DeltaSpike_TomEE-SNAPSHOT/ws/deltaspike/cdictrl/impl-openejb/src/main/java/org/apache/deltaspike/cdise/openejb/OpenEjbContainerControl.java>:[66,12]
cannot find symbol
symbol  : class CreationalContext
location: class org.apache.deltaspike.cdise.openejb.OpenEjbContainerControl
[ERROR] <https://builds.apache.org/job/DeltaSpike_TomEE-SNAPSHOT/ws/deltaspike/cdictrl/impl-openejb/src/main/java/org/apache/deltaspike/cdise/openejb/OpenEjbContainerControl.java>:[70,12]
cannot find symbol
symbol  : class BeanManager
location: class org.apache.deltaspike.cdise.openejb.OpenEjbContainerControl
[ERROR] <https://builds.apache.org/job/DeltaSpike_TomEE-SNAPSHOT/ws/deltaspike/cdictrl/impl-openejb/src/main/java/org/apache/deltaspike/cdise/openejb/OpenEjbContainerControl.java>:[73,12]
cannot find symbol
symbol  : class BeanManager
location: class org.apache.deltaspike.cdise.openejb.OpenEjbContainerControl
[ERROR] <https://builds.apache.org/job/DeltaSpike_TomEE-SNAPSHOT/ws/deltaspike/cdictrl/impl-openejb/src/main/java/org/apache/deltaspike/cdise/openejb/OpenEjbContainerControl.java>:[106,26]
cannot find symbol
symbol  : variable WebBeansContext
location: class org.apache.deltaspike.cdise.openejb.OpenEjbContainerControl
[ERROR] <https://builds.apache.org/job/DeltaSpike_TomEE-SNAPSHOT/ws/deltaspike/cdictrl/impl-openejb/src/main/java/org/apache/deltaspike/cdise/openejb/OpenEjbContainerControl.java>:[143,16]
cannot find symbol
symbol  : class Bean
location: class org.apache.deltaspike.cdise.openejb.OpenEjbContainerControl
[ERROR] <https://builds.apache.org/job/DeltaSpike_TomEE-SNAPSHOT/ws/deltaspike/cdictrl/impl-openejb/src/main/java/org/apache/deltaspike/cdise/openejb/OpenEjbContainerControl.java>:[144,27]
cannot find symbol
symbol  : class Bean
location: class org.apache.deltaspike.cdise.openejb.OpenEjbContainerControl
[INFO] 11 errors 
[INFO] -------------------------------------------------------------
[INFO] ------------------------------------------------------------------------
[INFO] Reactor Summary:
[INFO] 
[INFO] Apache DeltaSpike ................................. SUCCESS [44.432s]
[INFO] Apache DeltaSpike CheckStyle-rules ................ SUCCESS [9.609s]
[INFO] Apache DeltaSpike Parent .......................... SUCCESS [14.826s]
[INFO] Apache DeltaSpike Test-Utils ...................... SUCCESS [17.425s]
[INFO] Apache DeltaSpike Code Parent ..................... SUCCESS [33.768s]
[INFO] Apache DeltaSpike Core ............................ SUCCESS [8.949s]
[INFO] Apache DeltaSpike Core-API ........................ SUCCESS [29.397s]
[INFO] Apache DeltaSpike Core-Implementation ............. SUCCESS [1:39.260s]
[INFO] Apache DeltaSpike ContainerControl parent ......... SUCCESS [11.731s]
[INFO] Apache DeltaSpike CDI ContainerControl API ........ SUCCESS [17.226s]
[INFO] Apache DeltaSpike CDI ContainerControl TCK ........ SUCCESS [12.707s]
[INFO] Apache DeltaSpike CDI OWB-ContainerControl ........ SUCCESS [15.365s]
[INFO] Apache DeltaSpike CDI Weld-ContainerControl ....... SUCCESS [17.765s]
[INFO] Apache DeltaSpike CDI OpenEJB-ContainerControl .... FAILURE [9.138s]
[INFO] Apache DeltaSpike Modules ......................... SKIPPED
[INFO] Apache DeltaSpike Security-Module ................. SKIPPED
[INFO] Apache DeltaSpike Security-Module API ............. SKIPPED
[INFO] Apache DeltaSpike Security-Module Impl ............ SKIPPED
[INFO] Apache DeltaSpike JPA-Module ...................... SKIPPED
[INFO] Apache DeltaSpike JPA-Module API .................. SKIPPED
[INFO] Apache DeltaSpike JPA-Module Impl ................. SKIPPED
[INFO] Apache DeltaSpike Servlet-Module .................. SKIPPED
[INFO] Apache DeltaSpike Servlet-Module API .............. SKIPPED
[INFO] Apache DeltaSpike Servlet-Module Impl ............. SKIPPED
[INFO] Apache DeltaSpike JSF-Module ...................... SKIPPED
[INFO] Apache DeltaSpike JSF-Module API .................. SKIPPED
[INFO] Apache DeltaSpike JSF-Module Impl ................. SKIPPED
[INFO] Apache DeltaSpike Partial-Bean-Module ............. SKIPPED
[INFO] Apache DeltaSpike Partial-Bean-Module API ......... SKIPPED
[INFO] Apache DeltaSpike Partial-Bean-Module Impl ........ SKIPPED
[INFO] Apache DeltaSpike BeanValidation-Module ........... SKIPPED
[INFO] Apache DeltaSpike BeanValidation-Module API ....... SKIPPED
[INFO] Apache DeltaSpike BeanValidation-Module Impl ...... SKIPPED
[INFO] Apache DeltaSpike Data-Module ..................... SKIPPED
[INFO] Apache DeltaSpike Data-Module API ................. SKIPPED
[INFO] Apache DeltaSpike Data-Module Impl ................ SKIPPED
[INFO] Apache DeltaSpike Scheduler-Module ................ SKIPPED
[INFO] Apache DeltaSpike Scheduler-Module API ............ SKIPPED
[INFO] Apache DeltaSpike Scheduler-Module Impl ........... SKIPPED
[INFO] Apache DeltaSpike Test-Control-Module ............. SKIPPED
[INFO] Apache DeltaSpike Test-Control-Module API ......... SKIPPED
[INFO] Apache DeltaSpike Test-Control-Module Impl ........ SKIPPED
[INFO] Apache DeltaSpike Examples ........................ SKIPPED
[INFO] Apache DeltaSpike Java-SE Examples ................ SKIPPED
[INFO] Apache DeltaSpike JSF Examples .................... SKIPPED
[INFO] Apache DeltaSpike JSF Playground .................. SKIPPED
[INFO] ------------------------------------------------------------------------
[INFO] BUILD FAILURE
[INFO] ------------------------------------------------------------------------
[INFO] Total time: 6:19.618s
[INFO] Finished at: Sun Jun 01 12:32:25 UTC 2014
[INFO] Final Memory: 43M/84M
[INFO] ------------------------------------------------------------------------
Waiting for Jenkins to finish collecting data
[ERROR] Failed to execute goal org.apache.maven.plugins:maven-compiler-plugin:2.5:compile
(default-compile) on project deltaspike-cdictrl-openejb: Compilation failure: Compilation
failure:
[ERROR] <https://builds.apache.org/job/DeltaSpike_TomEE-SNAPSHOT/ws/deltaspike/cdictrl/impl-openejb/src/main/java/org/apache/deltaspike/cdise/openejb/OpenEjbContainerControl.java>:[26,33]
package org.apache.webbeans.config does not exist
[ERROR] <https://builds.apache.org/job/DeltaSpike_TomEE-SNAPSHOT/ws/deltaspike/cdictrl/impl-openejb/src/main/java/org/apache/deltaspike/cdise/openejb/OpenEjbContainerControl.java>:[28,35]
package javax.enterprise.context.spi does not exist
[ERROR] <https://builds.apache.org/job/DeltaSpike_TomEE-SNAPSHOT/ws/deltaspike/cdictrl/impl-openejb/src/main/java/org/apache/deltaspike/cdise/openejb/OpenEjbContainerControl.java>:[29,34]
package javax.enterprise.inject.spi does not exist
[ERROR] <https://builds.apache.org/job/DeltaSpike_TomEE-SNAPSHOT/ws/deltaspike/cdictrl/impl-openejb/src/main/java/org/apache/deltaspike/cdise/openejb/OpenEjbContainerControl.java>:[30,34]
package javax.enterprise.inject.spi does not exist
[ERROR] <https://builds.apache.org/job/DeltaSpike_TomEE-SNAPSHOT/ws/deltaspike/cdictrl/impl-openejb/src/main/java/org/apache/deltaspike/cdise/openejb/OpenEjbContainerControl.java>:[65,12]
cannot find symbol
[JENKINS] Archiving <https://builds.apache.org/job/DeltaSpike_TomEE-SNAPSHOT/ws/deltaspike/modules/partial-bean/api/pom.xml>
to org.apache.deltaspike.modules/deltaspike-partial-bean-module-api/1.0.0-SNAPSHOT/deltaspike-partial-bean-module-api-1.0.0-SNAPSHOT.pom
[ERROR] symbol  : class Bean
[ERROR] location: class org.apache.deltaspike.cdise.openejb.OpenEjbContainerControl
[ERROR] <https://builds.apache.org/job/DeltaSpike_TomEE-SNAPSHOT/ws/deltaspike/cdictrl/impl-openejb/src/main/java/org/apache/deltaspike/cdise/openejb/OpenEjbContainerControl.java>:[66,12]
cannot find symbol
[ERROR] symbol  : class CreationalContext
[ERROR] location: class org.apache.deltaspike.cdise.openejb.OpenEjbContainerControl
[ERROR] <https://builds.apache.org/job/DeltaSpike_TomEE-SNAPSHOT/ws/deltaspike/cdictrl/impl-openejb/src/main/java/org/apache/deltaspike/cdise/openejb/OpenEjbContainerControl.java>:[70,12]
cannot find symbol
[ERROR] symbol  : class BeanManager
[ERROR] location: class org.apache.deltaspike.cdise.openejb.OpenEjbContainerControl
[ERROR] <https://builds.apache.org/job/DeltaSpike_TomEE-SNAPSHOT/ws/deltaspike/cdictrl/impl-openejb/src/main/java/org/apache/deltaspike/cdise/openejb/OpenEjbContainerControl.java>:[73,12]
cannot find symbol
[ERROR] symbol  : class BeanManager
[ERROR] location: class org.apache.deltaspike.cdise.openejb.OpenEjbContainerControl
[ERROR] <https://builds.apache.org/job/DeltaSpike_TomEE-SNAPSHOT/ws/deltaspike/cdictrl/impl-openejb/src/main/java/org/apache/deltaspike/cdise/openejb/OpenEjbContainerControl.java>:[106,26]
cannot find symbol
[ERROR] symbol  : variable WebBeansContext
[ERROR] location: class org.apache.deltaspike.cdise.openejb.OpenEjbContainerControl
[ERROR] <https://builds.apache.org/job/DeltaSpike_TomEE-SNAPSHOT/ws/deltaspike/cdictrl/impl-openejb/src/main/java/org/apache/deltaspike/cdise/openejb/OpenEjbContainerControl.java>:[143,16]
cannot find symbol
[ERROR] symbol  : class Bean
[ERROR] location: class org.apache.deltaspike.cdise.openejb.OpenEjbContainerControl
[ERROR] <https://builds.apache.org/job/DeltaSpike_TomEE-SNAPSHOT/ws/deltaspike/cdictrl/impl-openejb/src/main/java/org/apache/deltaspike/cdise/openejb/OpenEjbContainerControl.java>:[144,27]
cannot find symbol
[ERROR] symbol  : class Bean
[ERROR] location: class org.apache.deltaspike.cdise.openejb.OpenEjbContainerControl
[ERROR] -> [Help 1]
[ERROR] 
[ERROR] To see the full stack trace of the errors, re-run Maven with the -e switch.
[ERROR] Re-run Maven using the -X switch to enable full debug logging.
[ERROR] 
[ERROR] For more information about the errors and possible solutions, please read the following
articles:
[ERROR] [Help 1] http://cwiki.apache.org/confluence/display/MAVEN/MojoFailureException
[ERROR] 
[ERROR] After correcting the problems, you can resume the build with the command
[ERROR]   mvn <goals> -rf :deltaspike-cdictrl-openejb
[JENKINS] Archiving <https://builds.apache.org/job/DeltaSpike_TomEE-SNAPSHOT/ws/deltaspike/modules/scheduler/impl/pom.xml>
to org.apache.deltaspike.modules/deltaspike-scheduler-module-impl/1.0.0-SNAPSHOT/deltaspike-scheduler-module-impl-1.0.0-SNAPSHOT.pom
[JENKINS] Archiving <https://builds.apache.org/job/DeltaSpike_TomEE-SNAPSHOT/ws/deltaspike/parent/pom.xml>
to org.apache.deltaspike/parent/1.0.0-SNAPSHOT/parent-1.0.0-SNAPSHOT.pom
[JENKINS] Archiving <https://builds.apache.org/job/DeltaSpike_TomEE-SNAPSHOT/ws/deltaspike/examples/jse-examples/pom.xml>
to org.apache.deltaspike.examples/deltaspike-jse-example/1.0.0-SNAPSHOT/deltaspike-jse-example-1.0.0-SNAPSHOT.pom
[JENKINS] Archiving <https://builds.apache.org/job/DeltaSpike_TomEE-SNAPSHOT/ws/deltaspike/modules/bean-validation/api/pom.xml>
to org.apache.deltaspike.modules/deltaspike-bean-validation-module-api/1.0.0-SNAPSHOT/deltaspike-bean-validation-module-api-1.0.0-SNAPSHOT.pom
[JENKINS] Archiving <https://builds.apache.org/job/DeltaSpike_TomEE-SNAPSHOT/ws/deltaspike/core/pom.xml>
to org.apache.deltaspike.core/core-project/1.0.0-SNAPSHOT/core-project-1.0.0-SNAPSHOT.pom
[JENKINS] Archiving <https://builds.apache.org/job/DeltaSpike_TomEE-SNAPSHOT/ws/deltaspike/core/target/core-project-1.0.0-SNAPSHOT-tests.jar>
to org.apache.deltaspike.core/core-project/1.0.0-SNAPSHOT/core-project-1.0.0-SNAPSHOT-tests.jar
[JENKINS] Archiving <https://builds.apache.org/job/DeltaSpike_TomEE-SNAPSHOT/ws/deltaspike/test-utils/pom.xml>
to org.apache.deltaspike.test/test-utils/1.0.0-SNAPSHOT/test-utils-1.0.0-SNAPSHOT.pom
[JENKINS] Archiving <https://builds.apache.org/job/DeltaSpike_TomEE-SNAPSHOT/ws/deltaspike/test-utils/target/test-utils-1.0.0-SNAPSHOT.jar>
to org.apache.deltaspike.test/test-utils/1.0.0-SNAPSHOT/test-utils-1.0.0-SNAPSHOT.jar
[JENKINS] Archiving <https://builds.apache.org/job/DeltaSpike_TomEE-SNAPSHOT/ws/deltaspike/test-utils/target/test-utils-1.0.0-SNAPSHOT-sources.jar>
to org.apache.deltaspike.test/test-utils/1.0.0-SNAPSHOT/test-utils-1.0.0-SNAPSHOT-sources.jar
[JENKINS] Archiving <https://builds.apache.org/job/DeltaSpike_TomEE-SNAPSHOT/ws/deltaspike/modules/data/impl/pom.xml>
to org.apache.deltaspike.modules/deltaspike-data-module-impl/1.0.0-SNAPSHOT/deltaspike-data-module-impl-1.0.0-SNAPSHOT.pom
[JENKINS] Archiving <https://builds.apache.org/job/DeltaSpike_TomEE-SNAPSHOT/ws/deltaspike/core/api/pom.xml>
to org.apache.deltaspike.core/deltaspike-core-api/1.0.0-SNAPSHOT/deltaspike-core-api-1.0.0-SNAPSHOT.pom
[JENKINS] Archiving <https://builds.apache.org/job/DeltaSpike_TomEE-SNAPSHOT/ws/deltaspike/core/api/target/deltaspike-core-api-1.0.0-SNAPSHOT.jar>
to org.apache.deltaspike.core/deltaspike-core-api/1.0.0-SNAPSHOT/deltaspike-core-api-1.0.0-SNAPSHOT.jar
[JENKINS] Archiving <https://builds.apache.org/job/DeltaSpike_TomEE-SNAPSHOT/ws/deltaspike/core/api/target/deltaspike-core-api-1.0.0-SNAPSHOT-tests.jar>
to org.apache.deltaspike.core/deltaspike-core-api/1.0.0-SNAPSHOT/deltaspike-core-api-1.0.0-SNAPSHOT-tests.jar
[JENKINS] Archiving <https://builds.apache.org/job/DeltaSpike_TomEE-SNAPSHOT/ws/deltaspike/core/api/target/deltaspike-core-api-1.0.0-SNAPSHOT-sources.jar>
to org.apache.deltaspike.core/deltaspike-core-api/1.0.0-SNAPSHOT/deltaspike-core-api-1.0.0-SNAPSHOT-sources.jar
[JENKINS] Archiving <https://builds.apache.org/job/DeltaSpike_TomEE-SNAPSHOT/ws/deltaspike/modules/scheduler/pom.xml>
to org.apache.deltaspike.modules/scheduler-module-project/1.0.0-SNAPSHOT/scheduler-module-project-1.0.0-SNAPSHOT.pom
[JENKINS] Archiving <https://builds.apache.org/job/DeltaSpike_TomEE-SNAPSHOT/ws/deltaspike/modules/data/api/pom.xml>
to org.apache.deltaspike.modules/deltaspike-data-module-api/1.0.0-SNAPSHOT/deltaspike-data-module-api-1.0.0-SNAPSHOT.pom
[JENKINS] Archiving <https://builds.apache.org/job/DeltaSpike_TomEE-SNAPSHOT/ws/deltaspike/modules/security/impl/pom.xml>
to org.apache.deltaspike.modules/deltaspike-security-module-impl/1.0.0-SNAPSHOT/deltaspike-security-module-impl-1.0.0-SNAPSHOT.pom
[JENKINS] Archiving <https://builds.apache.org/job/DeltaSpike_TomEE-SNAPSHOT/ws/deltaspike/core/impl/pom.xml>
to org.apache.deltaspike.core/deltaspike-core-impl/1.0.0-SNAPSHOT/deltaspike-core-impl-1.0.0-SNAPSHOT.pom
[JENKINS] Archiving <https://builds.apache.org/job/DeltaSpike_TomEE-SNAPSHOT/ws/deltaspike/core/impl/target/deltaspike-core-impl-1.0.0-SNAPSHOT.jar>
to org.apache.deltaspike.core/deltaspike-core-impl/1.0.0-SNAPSHOT/deltaspike-core-impl-1.0.0-SNAPSHOT.jar
[JENKINS] Archiving <https://builds.apache.org/job/DeltaSpike_TomEE-SNAPSHOT/ws/deltaspike/core/impl/target/deltaspike-core-impl-1.0.0-SNAPSHOT-tests.jar>
to org.apache.deltaspike.core/deltaspike-core-impl/1.0.0-SNAPSHOT/deltaspike-core-impl-1.0.0-SNAPSHOT-tests.jar
[JENKINS] Archiving <https://builds.apache.org/job/DeltaSpike_TomEE-SNAPSHOT/ws/deltaspike/core/impl/target/deltaspike-core-impl-1.0.0-SNAPSHOT-sources.jar>
to org.apache.deltaspike.core/deltaspike-core-impl/1.0.0-SNAPSHOT/deltaspike-core-impl-1.0.0-SNAPSHOT-sources.jar
[JENKINS] Archiving <https://builds.apache.org/job/DeltaSpike_TomEE-SNAPSHOT/ws/deltaspike/modules/test-control/pom.xml>
to org.apache.deltaspike.modules/test-control-module-project/1.0.0-SNAPSHOT/test-control-module-project-1.0.0-SNAPSHOT.pom
[JENKINS] Archiving <https://builds.apache.org/job/DeltaSpike_TomEE-SNAPSHOT/ws/deltaspike/modules/pom.xml>
to org.apache.deltaspike.modules/modules-project/1.0.0-SNAPSHOT/modules-project-1.0.0-SNAPSHOT.pom
[JENKINS] Archiving <https://builds.apache.org/job/DeltaSpike_TomEE-SNAPSHOT/ws/deltaspike/examples/jsf-examples/pom.xml>
to org.apache.deltaspike.examples/deltaspike-jsf-example/1.0.0-SNAPSHOT/deltaspike-jsf-example-1.0.0-SNAPSHOT.pom
[JENKINS] Archiving <https://builds.apache.org/job/DeltaSpike_TomEE-SNAPSHOT/ws/deltaspike/cdictrl/api/pom.xml>
to org.apache.deltaspike.cdictrl/deltaspike-cdictrl-api/1.0.0-SNAPSHOT/deltaspike-cdictrl-api-1.0.0-SNAPSHOT.pom
[JENKINS] Archiving <https://builds.apache.org/job/DeltaSpike_TomEE-SNAPSHOT/ws/deltaspike/cdictrl/api/target/deltaspike-cdictrl-api-1.0.0-SNAPSHOT.jar>
to org.apache.deltaspike.cdictrl/deltaspike-cdictrl-api/1.0.0-SNAPSHOT/deltaspike-cdictrl-api-1.0.0-SNAPSHOT.jar
[JENKINS] Archiving <https://builds.apache.org/job/DeltaSpike_TomEE-SNAPSHOT/ws/deltaspike/cdictrl/api/target/deltaspike-cdictrl-api-1.0.0-SNAPSHOT-sources.jar>
to org.apache.deltaspike.cdictrl/deltaspike-cdictrl-api/1.0.0-SNAPSHOT/deltaspike-cdictrl-api-1.0.0-SNAPSHOT-sources.jar
[JENKINS] Archiving <https://builds.apache.org/job/DeltaSpike_TomEE-SNAPSHOT/ws/deltaspike/checkstyle-rules/pom.xml>
to org.apache.deltaspike/checkstyle-rules/1.0.0-SNAPSHOT/checkstyle-rules-1.0.0-SNAPSHOT.pom
[JENKINS] Archiving <https://builds.apache.org/job/DeltaSpike_TomEE-SNAPSHOT/ws/deltaspike/checkstyle-rules/target/checkstyle-rules-1.0.0-SNAPSHOT.jar>
to org.apache.deltaspike/checkstyle-rules/1.0.0-SNAPSHOT/checkstyle-rules-1.0.0-SNAPSHOT.jar
[JENKINS] Archiving <https://builds.apache.org/job/DeltaSpike_TomEE-SNAPSHOT/ws/deltaspike/parent/code/pom.xml>
to org.apache.deltaspike/parent-code/1.0.0-SNAPSHOT/parent-code-1.0.0-SNAPSHOT.pom
[JENKINS] Archiving <https://builds.apache.org/job/DeltaSpike_TomEE-SNAPSHOT/ws/deltaspike/parent/code/target/parent-code-1.0.0-SNAPSHOT-tests.jar>
to org.apache.deltaspike/parent-code/1.0.0-SNAPSHOT/parent-code-1.0.0-SNAPSHOT-tests.jar
[JENKINS] Archiving <https://builds.apache.org/job/DeltaSpike_TomEE-SNAPSHOT/ws/deltaspike/modules/partial-bean/pom.xml>
to org.apache.deltaspike.modules/partial-bean-module-project/1.0.0-SNAPSHOT/partial-bean-module-project-1.0.0-SNAPSHOT.pom
[JENKINS] Archiving <https://builds.apache.org/job/DeltaSpike_TomEE-SNAPSHOT/ws/deltaspike/modules/jsf/impl/pom.xml>
to org.apache.deltaspike.modules/deltaspike-jsf-module-impl/1.0.0-SNAPSHOT/deltaspike-jsf-module-impl-1.0.0-SNAPSHOT.pom
[JENKINS] Archiving <https://builds.apache.org/job/DeltaSpike_TomEE-SNAPSHOT/ws/deltaspike/examples/pom.xml>
to org.apache.deltaspike.examples/examples-project/1.0.0-SNAPSHOT/examples-project-1.0.0-SNAPSHOT.pom
[JENKINS] Archiving <https://builds.apache.org/job/DeltaSpike_TomEE-SNAPSHOT/ws/deltaspike/modules/jsf/pom.xml>
to org.apache.deltaspike.modules/jsf-module-project/1.0.0-SNAPSHOT/jsf-module-project-1.0.0-SNAPSHOT.pom
[JENKINS] Archiving <https://builds.apache.org/job/DeltaSpike_TomEE-SNAPSHOT/ws/deltaspike/cdictrl/impl-openejb/pom.xml>
to org.apache.deltaspike.cdictrl/deltaspike-cdictrl-openejb/1.0.0-SNAPSHOT/deltaspike-cdictrl-openejb-1.0.0-SNAPSHOT.pom
[JENKINS] Archiving <https://builds.apache.org/job/DeltaSpike_TomEE-SNAPSHOT/ws/deltaspike/cdictrl/tck/pom.xml>
to org.apache.deltaspike.test/deltaspike-cdictrl-tck/1.0.0-SNAPSHOT/deltaspike-cdictrl-tck-1.0.0-SNAPSHOT.pom
[JENKINS] Archiving <https://builds.apache.org/job/DeltaSpike_TomEE-SNAPSHOT/ws/deltaspike/cdictrl/tck/target/deltaspike-cdictrl-tck-1.0.0-SNAPSHOT.jar>
to org.apache.deltaspike.test/deltaspike-cdictrl-tck/1.0.0-SNAPSHOT/deltaspike-cdictrl-tck-1.0.0-SNAPSHOT.jar
[JENKINS] Archiving <https://builds.apache.org/job/DeltaSpike_TomEE-SNAPSHOT/ws/deltaspike/cdictrl/tck/target/deltaspike-cdictrl-tck-1.0.0-SNAPSHOT-sources.jar>
to org.apache.deltaspike.test/deltaspike-cdictrl-tck/1.0.0-SNAPSHOT/deltaspike-cdictrl-tck-1.0.0-SNAPSHOT-sources.jar
[JENKINS] Archiving <https://builds.apache.org/job/DeltaSpike_TomEE-SNAPSHOT/ws/deltaspike/modules/jsf/api/pom.xml>
to org.apache.deltaspike.modules/deltaspike-jsf-module-api/1.0.0-SNAPSHOT/deltaspike-jsf-module-api-1.0.0-SNAPSHOT.pom
[JENKINS] Archiving <https://builds.apache.org/job/DeltaSpike_TomEE-SNAPSHOT/ws/deltaspike/examples/jsf-playground/pom.xml>
to org.apache.deltaspike.examples/deltaspike-jsf-playground/1.0.0-SNAPSHOT/deltaspike-jsf-playground-1.0.0-SNAPSHOT.pom
[JENKINS] Archiving <https://builds.apache.org/job/DeltaSpike_TomEE-SNAPSHOT/ws/deltaspike/modules/security/pom.xml>
to org.apache.deltaspike.modules/security-module-project/1.0.0-SNAPSHOT/security-module-project-1.0.0-SNAPSHOT.pom
[JENKINS] Archiving <https://builds.apache.org/job/DeltaSpike_TomEE-SNAPSHOT/ws/deltaspike/modules/bean-validation/pom.xml>
to org.apache.deltaspike.modules/bean-validation-module-project/1.0.0-SNAPSHOT/bean-validation-module-project-1.0.0-SNAPSHOT.pom
[JENKINS] Archiving <https://builds.apache.org/job/DeltaSpike_TomEE-SNAPSHOT/ws/deltaspike/modules/partial-bean/impl/pom.xml>
to org.apache.deltaspike.modules/deltaspike-partial-bean-module-impl/1.0.0-SNAPSHOT/deltaspike-partial-bean-module-impl-1.0.0-SNAPSHOT.pom
[JENKINS] Archiving <https://builds.apache.org/job/DeltaSpike_TomEE-SNAPSHOT/ws/deltaspike/cdictrl/impl-weld/pom.xml>
to org.apache.deltaspike.cdictrl/deltaspike-cdictrl-weld/1.0.0-SNAPSHOT/deltaspike-cdictrl-weld-1.0.0-SNAPSHOT.pom
[JENKINS] Archiving <https://builds.apache.org/job/DeltaSpike_TomEE-SNAPSHOT/ws/deltaspike/cdictrl/impl-weld/target/deltaspike-cdictrl-weld-1.0.0-SNAPSHOT.jar>
to org.apache.deltaspike.cdictrl/deltaspike-cdictrl-weld/1.0.0-SNAPSHOT/deltaspike-cdictrl-weld-1.0.0-SNAPSHOT.jar
[JENKINS] Archiving <https://builds.apache.org/job/DeltaSpike_TomEE-SNAPSHOT/ws/deltaspike/cdictrl/impl-weld/target/deltaspike-cdictrl-weld-1.0.0-SNAPSHOT-sources.jar>
to org.apache.deltaspike.cdictrl/deltaspike-cdictrl-weld/1.0.0-SNAPSHOT/deltaspike-cdictrl-weld-1.0.0-SNAPSHOT-sources.jar
[JENKINS] Archiving <https://builds.apache.org/job/DeltaSpike_TomEE-SNAPSHOT/ws/deltaspike/modules/servlet/impl/pom.xml>
to org.apache.deltaspike.modules/deltaspike-servlet-module-impl/1.0.0-SNAPSHOT/deltaspike-servlet-module-impl-1.0.0-SNAPSHOT.pom
[JENKINS] Archiving <https://builds.apache.org/job/DeltaSpike_TomEE-SNAPSHOT/ws/deltaspike/modules/jpa/api/pom.xml>
to org.apache.deltaspike.modules/deltaspike-jpa-module-api/1.0.0-SNAPSHOT/deltaspike-jpa-module-api-1.0.0-SNAPSHOT.pom
[JENKINS] Archiving <https://builds.apache.org/job/DeltaSpike_TomEE-SNAPSHOT/ws/deltaspike/modules/bean-validation/impl/pom.xml>
to org.apache.deltaspike.modules/deltaspike-bean-validation-module-impl/1.0.0-SNAPSHOT/deltaspike-bean-validation-module-impl-1.0.0-SNAPSHOT.pom
[JENKINS] Archiving <https://builds.apache.org/job/DeltaSpike_TomEE-SNAPSHOT/ws/deltaspike/cdictrl/impl-owb/pom.xml>
to org.apache.deltaspike.cdictrl/deltaspike-cdictrl-owb/1.0.0-SNAPSHOT/deltaspike-cdictrl-owb-1.0.0-SNAPSHOT.pom
[JENKINS] Archiving <https://builds.apache.org/job/DeltaSpike_TomEE-SNAPSHOT/ws/deltaspike/cdictrl/impl-owb/target/deltaspike-cdictrl-owb-1.0.0-SNAPSHOT.jar>
to org.apache.deltaspike.cdictrl/deltaspike-cdictrl-owb/1.0.0-SNAPSHOT/deltaspike-cdictrl-owb-1.0.0-SNAPSHOT.jar
[JENKINS] Archiving <https://builds.apache.org/job/DeltaSpike_TomEE-SNAPSHOT/ws/deltaspike/cdictrl/impl-owb/target/deltaspike-cdictrl-owb-1.0.0-SNAPSHOT-sources.jar>
to org.apache.deltaspike.cdictrl/deltaspike-cdictrl-owb/1.0.0-SNAPSHOT/deltaspike-cdictrl-owb-1.0.0-SNAPSHOT-sources.jar
[JENKINS] Archiving <https://builds.apache.org/job/DeltaSpike_TomEE-SNAPSHOT/ws/deltaspike/modules/servlet/api/pom.xml>
to org.apache.deltaspike.modules/deltaspike-servlet-module-api/1.0.0-SNAPSHOT/deltaspike-servlet-module-api-1.0.0-SNAPSHOT.pom
[JENKINS] Archiving <https://builds.apache.org/job/DeltaSpike_TomEE-SNAPSHOT/ws/deltaspike/modules/jpa/pom.xml>
to org.apache.deltaspike.modules/jpa-module-project/1.0.0-SNAPSHOT/jpa-module-project-1.0.0-SNAPSHOT.pom
[JENKINS] Archiving <https://builds.apache.org/job/DeltaSpike_TomEE-SNAPSHOT/ws/deltaspike/modules/jpa/impl/pom.xml>
to org.apache.deltaspike.modules/deltaspike-jpa-module-impl/1.0.0-SNAPSHOT/deltaspike-jpa-module-impl-1.0.0-SNAPSHOT.pom
[JENKINS] Archiving <https://builds.apache.org/job/DeltaSpike_TomEE-SNAPSHOT/ws/deltaspike/modules/data/pom.xml>
to org.apache.deltaspike.modules/data-module-project/1.0.0-SNAPSHOT/data-module-project-1.0.0-SNAPSHOT.pom
[JENKINS] Archiving <https://builds.apache.org/job/DeltaSpike_TomEE-SNAPSHOT/ws/deltaspike/cdictrl/pom.xml>
to org.apache.deltaspike.cdictrl/cdictrl-project/1.0.0-SNAPSHOT/cdictrl-project-1.0.0-SNAPSHOT.pom
[JENKINS] Archiving <https://builds.apache.org/job/DeltaSpike_TomEE-SNAPSHOT/ws/deltaspike/modules/scheduler/api/pom.xml>
to org.apache.deltaspike.modules/deltaspike-scheduler-module-api/1.0.0-SNAPSHOT/deltaspike-scheduler-module-api-1.0.0-SNAPSHOT.pom
[JENKINS] Archiving <https://builds.apache.org/job/DeltaSpike_TomEE-SNAPSHOT/ws/deltaspike/modules/test-control/impl/pom.xml>
to org.apache.deltaspike.modules/deltaspike-test-control-module-impl/1.0.0-SNAPSHOT/deltaspike-test-control-module-impl-1.0.0-SNAPSHOT.pom
[JENKINS] Archiving <https://builds.apache.org/job/DeltaSpike_TomEE-SNAPSHOT/ws/deltaspike/modules/servlet/pom.xml>
to org.apache.deltaspike.modules/servlet-module-project/1.0.0-SNAPSHOT/servlet-module-project-1.0.0-SNAPSHOT.pom
[JENKINS] Archiving <https://builds.apache.org/job/DeltaSpike_TomEE-SNAPSHOT/ws/deltaspike/pom.xml>
to org.apache.deltaspike/deltaspike-project/1.0.0-SNAPSHOT/deltaspike-project-1.0.0-SNAPSHOT.pom
[JENKINS] Archiving <https://builds.apache.org/job/DeltaSpike_TomEE-SNAPSHOT/ws/deltaspike/modules/test-control/api/pom.xml>
to org.apache.deltaspike.modules/deltaspike-test-control-module-api/1.0.0-SNAPSHOT/deltaspike-test-control-module-api-1.0.0-SNAPSHOT.pom
[JENKINS] Archiving <https://builds.apache.org/job/DeltaSpike_TomEE-SNAPSHOT/ws/deltaspike/modules/security/api/pom.xml>
to org.apache.deltaspike.modules/deltaspike-security-module-api/1.0.0-SNAPSHOT/deltaspike-security-module-api-1.0.0-SNAPSHOT.pom
Sending e-mails to: commits@deltaspike.apache.org
channel stopped

Mime
View raw message