deltaspike-commits mailing list archives

Site index · List index
Message view « Date » · « Thread »
Top « Date » · « Thread »
From Apache Jenkins Server <jenk...@builds.apache.org>
Subject Build failed in Jenkins: DeltaSpike RAT-Check #1091
Date Tue, 03 Jun 2014 10:02:38 GMT
See <https://builds.apache.org/job/DeltaSpike%20RAT-Check/1091/>

------------------------------------------
[...truncated 9510 lines...]
INFO: [run] org.apache.deltaspike.test.testcontrol.uc002.SessionScopePerTestClassTest#secondTest
Jun 3, 2014 9:58:37 AM org.apache.deltaspike.testcontrol.api.junit.CdiTestSuiteRunner$LogRunListener
testStarted
INFO: [run] org.apache.deltaspike.test.testcontrol.uc002.SessionScopePerTestClassTest#secondTest
Jun 3, 2014 9:58:37 AM org.apache.deltaspike.testcontrol.api.junit.CdiTestSuiteRunner$LogRunListener
testStarted
INFO: [run] org.apache.deltaspike.test.testcontrol.uc002.SessionScopePerTestClassTest#secondTest
Jun 3, 2014 9:58:37 AM org.apache.deltaspike.testcontrol.api.junit.CdiTestSuiteRunner$LogRunListener
testStarted
INFO: [run] org.apache.deltaspike.test.testcontrol.uc002.SessionScopePerTestClassTest#secondTest
Jun 3, 2014 9:58:37 AM org.apache.deltaspike.testcontrol.api.junit.CdiTestSuiteRunner$LogRunListener
testStarted
INFO: [run] org.apache.deltaspike.test.testcontrol.uc002.SessionScopePerTestClassTest#secondTest
Jun 3, 2014 9:58:37 AM org.apache.deltaspike.testcontrol.api.junit.CdiTestSuiteRunner$LogRunListener
testStarted
INFO: [run] org.apache.deltaspike.test.testcontrol.uc002.SessionScopePerTestClassTest#secondTest
Jun 3, 2014 9:58:37 AM org.apache.deltaspike.testcontrol.api.junit.CdiTestSuiteRunner$LogRunListener
testStarted
INFO: [run] org.apache.deltaspike.test.testcontrol.uc002.SessionScopePerTestClassTest#secondTest
Jun 3, 2014 9:58:37 AM org.apache.deltaspike.testcontrol.api.junit.CdiTestSuiteRunner$LogRunListener
testStarted
INFO: [run] org.apache.deltaspike.test.testcontrol.uc002.SessionScopePerTestClassTest#secondTest
Jun 3, 2014 9:58:37 AM org.apache.deltaspike.testcontrol.api.junit.CdiTestSuiteRunner$LogRunListener
testStarted
INFO: [run] org.apache.deltaspike.test.testcontrol.uc002.SessionScopePerTestClassTest#secondTest
Jun 3, 2014 9:58:37 AM org.apache.deltaspike.testcontrol.api.junit.CdiTestSuiteRunner$LogRunListener
testStarted
INFO: [run] org.apache.deltaspike.test.testcontrol.uc002.SessionScopePerTestClassTest#secondTest
Jun 3, 2014 9:58:37 AM org.apache.deltaspike.testcontrol.api.junit.CdiTestSuiteRunner$LogRunListener
testStarted
INFO: [run] org.apache.deltaspike.test.testcontrol.uc002.SessionScopePerTestClassTest#secondTest
Jun 3, 2014 9:58:37 AM org.apache.deltaspike.testcontrol.api.junit.CdiTestSuiteRunner$LogRunListener
testStarted
INFO: [run] org.apache.deltaspike.test.testcontrol.uc002.SessionScopePerTestClassTest#secondTest
Jun 3, 2014 9:58:37 AM org.apache.deltaspike.testcontrol.api.junit.CdiTestSuiteRunner$LogRunListener
testStarted
INFO: [run] org.apache.deltaspike.test.testcontrol.uc002.SessionScopePerTestClassTest#secondTest
Tests run: 2, Failures: 0, Errors: 0, Skipped: 0, Time elapsed: 0.007 sec

Results :

Tests run: 42, Failures: 0, Errors: 0, Skipped: 0

[INFO] 
[INFO] --- maven-bundle-plugin:2.3.7:bundle (default-bundle) @ deltaspike-test-control-module-impl
---
[WARNING] Bundle org.apache.deltaspike.modules:deltaspike-test-control-module-impl:bundle:1.0.0-SNAPSHOT
: Did not find matching referal for !org.apache.deltaspike.testcontrol.impl.*
[INFO] 
[INFO] --- maven-site-plugin:3.1:attach-descriptor (attach-descriptor) @ deltaspike-test-control-module-impl
---
[INFO] 
[INFO] --- maven-jar-plugin:2.4:test-jar (default) @ deltaspike-test-control-module-impl ---
[INFO] Building jar: <https://builds.apache.org/job/DeltaSpike%20RAT-Check/ws/deltaspike/modules/test-control/impl/target/deltaspike-test-control-module-impl-1.0.0-SNAPSHOT-tests.jar>
[INFO] 
[INFO] --- apache-rat-plugin:0.8:check (default) @ deltaspike-test-control-module-impl ---
[INFO] Exclude: .idea/**/*
[INFO] Exclude: readme/**/*
[INFO] Exclude: **/*.log
[INFO] 
[INFO] --- maven-bundle-plugin:2.3.7:cleanVersions (versions) @ deltaspike-test-control-module-impl
---
[INFO] 
[INFO] --- maven-antrun-plugin:1.6:run (javadoc.resources) @ deltaspike-test-control-module-impl
---
[WARNING] Parameter tasks is deprecated, use target instead
[INFO] Executing tasks

main:
[INFO] Executed tasks
[WARNING] Failed to getClass for org.apache.maven.plugin.source.SourceJarMojo
[INFO] 
[INFO] --- maven-source-plugin:2.1.2:jar (attach-sources) @ deltaspike-test-control-module-impl
---
[INFO] META-INF already added, skipping
[INFO] META-INF/DISCLAIMER already added, skipping
[INFO] META-INF/LICENSE already added, skipping
[INFO] META-INF/NOTICE already added, skipping
[INFO] META-INF/DEPENDENCIES already added, skipping
[INFO] META-INF already added, skipping
[INFO] META-INF already added, skipping
[INFO] META-INF/DISCLAIMER already added, skipping
[INFO] META-INF/LICENSE already added, skipping
[INFO] META-INF/NOTICE already added, skipping
[INFO] META-INF/DEPENDENCIES already added, skipping
[INFO] META-INF already added, skipping
[INFO] META-INF/DISCLAIMER already added, skipping
[INFO] META-INF/LICENSE already added, skipping
[INFO] META-INF/NOTICE already added, skipping
[INFO] META-INF/DEPENDENCIES already added, skipping
[INFO] Building jar: <https://builds.apache.org/job/DeltaSpike%20RAT-Check/ws/deltaspike/modules/test-control/impl/target/deltaspike-test-control-module-impl-1.0.0-SNAPSHOT-sources.jar>
[INFO] META-INF already added, skipping
[INFO] META-INF/DISCLAIMER already added, skipping
[INFO] META-INF/LICENSE already added, skipping
[INFO] META-INF/NOTICE already added, skipping
[INFO] META-INF/DEPENDENCIES already added, skipping
[INFO] META-INF already added, skipping
[INFO] META-INF already added, skipping
[INFO] META-INF/DISCLAIMER already added, skipping
[INFO] META-INF/LICENSE already added, skipping
[INFO] META-INF/NOTICE already added, skipping
[INFO] META-INF/DEPENDENCIES already added, skipping
[INFO] META-INF already added, skipping
[INFO] META-INF/DISCLAIMER already added, skipping
[INFO] META-INF/LICENSE already added, skipping
[INFO] META-INF/NOTICE already added, skipping
[INFO] META-INF/DEPENDENCIES already added, skipping
[INFO] 
[INFO] --- maven-checkstyle-plugin:2.9.1:check (verify-style) @ deltaspike-test-control-module-impl
---
[INFO] Starting audit...
Audit done.

[INFO] 
[INFO] --- maven-install-plugin:2.3.1:install (default-install) @ deltaspike-test-control-module-impl
---
[INFO] Installing <https://builds.apache.org/job/DeltaSpike%20RAT-Check/ws/deltaspike/modules/test-control/impl/target/deltaspike-test-control-module-impl-1.0.0-SNAPSHOT.jar>
to /home/jenkins/jenkins-slave/maven-repositories/1/org/apache/deltaspike/modules/deltaspike-test-control-module-impl/1.0.0-SNAPSHOT/deltaspike-test-control-module-impl-1.0.0-SNAPSHOT.jar
[INFO] Installing <https://builds.apache.org/job/DeltaSpike%20RAT-Check/ws/deltaspike/modules/test-control/impl/pom.xml>
to /home/jenkins/jenkins-slave/maven-repositories/1/org/apache/deltaspike/modules/deltaspike-test-control-module-impl/1.0.0-SNAPSHOT/deltaspike-test-control-module-impl-1.0.0-SNAPSHOT.pom
[INFO] Installing <https://builds.apache.org/job/DeltaSpike%20RAT-Check/ws/deltaspike/modules/test-control/impl/target/deltaspike-test-control-module-impl-1.0.0-SNAPSHOT-tests.jar>
to /home/jenkins/jenkins-slave/maven-repositories/1/org/apache/deltaspike/modules/deltaspike-test-control-module-impl/1.0.0-SNAPSHOT/deltaspike-test-control-module-impl-1.0.0-SNAPSHOT-tests.jar
[INFO] Installing <https://builds.apache.org/job/DeltaSpike%20RAT-Check/ws/deltaspike/modules/test-control/impl/target/deltaspike-test-control-module-impl-1.0.0-SNAPSHOT-sources.jar>
to /home/jenkins/jenkins-slave/maven-repositories/1/org/apache/deltaspike/modules/deltaspike-test-control-module-impl/1.0.0-SNAPSHOT/deltaspike-test-control-module-impl-1.0.0-SNAPSHOT-sources.jar
[INFO] 
[INFO] --- maven-bundle-plugin:2.3.7:install (default-install) @ deltaspike-test-control-module-impl
---
[WARNING] Exception while updating local OBR: Unable to read repository xml: file:/home/jenkins/jenkins-slave/maven-repositories/1/repository.xml
org.apache.maven.plugin.MojoExecutionException: Unable to read repository xml: file:/home/jenkins/jenkins-slave/maven-repositories/1/repository.xml
	at org.apache.felix.obrplugin.ObrUpdate.parseRepositoryXml(ObrUpdate.java:324)
	at org.apache.felix.obrplugin.ObrInstall.execute(ObrInstall.java:141)
	at org.apache.maven.plugin.DefaultBuildPluginManager.executeMojo(DefaultBuildPluginManager.java:101)
	at org.apache.maven.lifecycle.internal.MojoExecutor.execute(MojoExecutor.java:209)
	at org.apache.maven.lifecycle.internal.MojoExecutor.execute(MojoExecutor.java:153)
	at org.apache.maven.lifecycle.internal.MojoExecutor.execute(MojoExecutor.java:145)
	at org.apache.maven.lifecycle.internal.LifecycleModuleBuilder.buildProject(LifecycleModuleBuilder.java:84)
	at org.apache.maven.lifecycle.internal.LifecycleModuleBuilder.buildProject(LifecycleModuleBuilder.java:59)
	at org.apache.maven.lifecycle.internal.LifecycleStarter.singleThreadedBuild(LifecycleStarter.java:183)
	at org.apache.maven.lifecycle.internal.LifecycleStarter.execute(LifecycleStarter.java:161)
	at org.apache.maven.DefaultMaven.doExecute(DefaultMaven.java:320)
	at org.apache.maven.DefaultMaven.execute(DefaultMaven.java:156)
	at org.jvnet.hudson.maven3.launcher.Maven3Launcher.main(Maven3Launcher.java:117)
	at sun.reflect.NativeMethodAccessorImpl.invoke0(Native Method)
	at sun.reflect.NativeMethodAccessorImpl.invoke(NativeMethodAccessorImpl.java:39)
	at sun.reflect.DelegatingMethodAccessorImpl.invoke(DelegatingMethodAccessorImpl.java:25)
	at java.lang.reflect.Method.invoke(Method.java:597)
	at org.codehaus.plexus.classworlds.launcher.Launcher.launchStandard(Launcher.java:329)
	at org.codehaus.plexus.classworlds.launcher.Launcher.launch(Launcher.java:239)
	at org.jvnet.hudson.maven3.agent.Maven3Main.launch(Maven3Main.java:178)
	at sun.reflect.NativeMethodAccessorImpl.invoke0(Native Method)
	at sun.reflect.NativeMethodAccessorImpl.invoke(NativeMethodAccessorImpl.java:39)
	at sun.reflect.DelegatingMethodAccessorImpl.invoke(DelegatingMethodAccessorImpl.java:25)
	at java.lang.reflect.Method.invoke(Method.java:597)
	at hudson.maven.Maven3Builder.call(Maven3Builder.java:134)
	at hudson.maven.Maven3Builder.call(Maven3Builder.java:69)
	at hudson.remoting.UserRequest.perform(UserRequest.java:118)
	at hudson.remoting.UserRequest.perform(UserRequest.java:48)
	at hudson.remoting.Request$2.run(Request.java:328)
	at hudson.remoting.InterceptingExecutorService$1.call(InterceptingExecutorService.java:72)
	at java.util.concurrent.FutureTask$Sync.innerRun(FutureTask.java:303)
	at java.util.concurrent.FutureTask.run(FutureTask.java:138)
	at java.util.concurrent.ThreadPoolExecutor$Worker.runTask(ThreadPoolExecutor.java:895)
	at java.util.concurrent.ThreadPoolExecutor$Worker.run(ThreadPoolExecutor.java:918)
	at java.lang.Thread.run(Thread.java:662)
Caused by: org.xmlpull.v1.XmlPullParserException: unexpected type (position:END_DOCUMENT null@3:1
in java.io.InputStreamReader@1b7f48c) 
	at org.kxml2.io.KXmlParser.exception(Unknown Source)
	at org.kxml2.io.KXmlParser.nextTag(Unknown Source)
	at org.apache.felix.bundlerepository.impl.PullParser.parseRepository(PullParser.java:43)
	at org.apache.felix.bundlerepository.impl.DataModelHelperImpl.repository(DataModelHelperImpl.java:147)
	at org.apache.felix.bundlerepository.impl.DataModelHelperImpl.repository(DataModelHelperImpl.java:118)
	at org.apache.felix.obrplugin.ObrUpdate.parseRepositoryXml(ObrUpdate.java:316)
	... 34 more
[INFO] ------------------------------------------------------------------------
[INFO] Reactor Summary:
[INFO] 
[INFO] Apache DeltaSpike ................................. SUCCESS [1:02.504s]
[INFO] Apache DeltaSpike CheckStyle-rules ................ SUCCESS [27.856s]
[INFO] Apache DeltaSpike Parent .......................... SUCCESS [32.975s]
[INFO] Apache DeltaSpike Test-Utils ...................... SUCCESS [41.829s]
[INFO] Apache DeltaSpike Code Parent ..................... SUCCESS [41.387s]
[INFO] Apache DeltaSpike Core ............................ SUCCESS [38.014s]
[INFO] Apache DeltaSpike Core-API ........................ SUCCESS [58.969s]
[INFO] Apache DeltaSpike Core-Implementation ............. SUCCESS [59.519s]
[INFO] Apache DeltaSpike ContainerControl parent ......... SUCCESS [32.953s]
[INFO] Apache DeltaSpike CDI ContainerControl API ........ SUCCESS [35.407s]
[INFO] Apache DeltaSpike CDI ContainerControl TCK ........ SUCCESS [35.999s]
[INFO] Apache DeltaSpike CDI OWB-ContainerControl ........ SUCCESS [41.622s]
[INFO] Apache DeltaSpike CDI Weld-ContainerControl ....... SUCCESS [35.899s]
[INFO] Apache DeltaSpike CDI OpenEJB-ContainerControl .... SUCCESS [42.752s]
[INFO] Apache DeltaSpike Modules ......................... SUCCESS [30.418s]
[INFO] Apache DeltaSpike Security-Module ................. SUCCESS [32.475s]
[INFO] Apache DeltaSpike Security-Module API ............. SUCCESS [31.840s]
[INFO] Apache DeltaSpike Security-Module Impl ............ SUCCESS [40.608s]
[INFO] Apache DeltaSpike JPA-Module ...................... SUCCESS [31.454s]
[INFO] Apache DeltaSpike JPA-Module API .................. SUCCESS [35.981s]
[INFO] Apache DeltaSpike JPA-Module Impl ................. SUCCESS [50.739s]
[INFO] Apache DeltaSpike Servlet-Module .................. SUCCESS [32.863s]
[INFO] Apache DeltaSpike Servlet-Module API .............. SUCCESS [33.350s]
[INFO] Apache DeltaSpike Servlet-Module Impl ............. SUCCESS [41.294s]
[INFO] Apache DeltaSpike JSF-Module ...................... SUCCESS [35.762s]
[INFO] Apache DeltaSpike JSF-Module API .................. SUCCESS [41.941s]
[INFO] Apache DeltaSpike JSF-Module Impl ................. SUCCESS [53.981s]
[INFO] Apache DeltaSpike Partial-Bean-Module ............. SUCCESS [30.093s]
[INFO] Apache DeltaSpike Partial-Bean-Module API ......... SUCCESS [36.442s]
[INFO] Apache DeltaSpike Partial-Bean-Module Impl ........ SUCCESS [47.514s]
[INFO] Apache DeltaSpike BeanValidation-Module ........... SUCCESS [36.590s]
[INFO] Apache DeltaSpike BeanValidation-Module API ....... SUCCESS [38.953s]
[INFO] Apache DeltaSpike BeanValidation-Module Impl ...... SUCCESS [45.468s]
[INFO] Apache DeltaSpike Data-Module ..................... SUCCESS [32.121s]
[INFO] Apache DeltaSpike Data-Module API ................. SUCCESS [35.482s]
[INFO] Apache DeltaSpike Data-Module Impl ................ SUCCESS [48.310s]
[INFO] Apache DeltaSpike Scheduler-Module ................ SUCCESS [32.942s]
[INFO] Apache DeltaSpike Scheduler-Module API ............ SUCCESS [33.003s]
[INFO] Apache DeltaSpike Scheduler-Module Impl ........... SUCCESS [39.692s]
[INFO] Apache DeltaSpike Test-Control-Module ............. SUCCESS [34.894s]
[INFO] Apache DeltaSpike Test-Control-Module API ......... SUCCESS [35.014s]
[INFO] Apache DeltaSpike Test-Control-Module Impl ........ FAILURE [1:00.699s]
[INFO] Apache DeltaSpike Examples ........................ SKIPPED
[INFO] Apache DeltaSpike Java-SE Examples ................ SKIPPED
[INFO] Apache DeltaSpike JSF Examples .................... SKIPPED
[INFO] Apache DeltaSpike JSF Playground .................. SKIPPED
[INFO] ------------------------------------------------------------------------
[INFO] BUILD FAILURE
[INFO] ------------------------------------------------------------------------
[INFO] Total time: 29:20.159s
[INFO] Finished at: Tue Jun 03 09:58:50 UTC 2014
[INFO] Final Memory: 70M/121M
[INFO] ------------------------------------------------------------------------
[ERROR] Internal error: java.lang.IllegalStateException: Unable to call isArchivingDisabled.
Invalid object ID 49 -> [Help 1]
org.apache.maven.InternalErrorException: Internal error: java.lang.IllegalStateException:
Unable to call isArchivingDisabled. Invalid object ID 49
	at org.apache.maven.DefaultMaven.execute(DefaultMaven.java:168)
	at org.jvnet.hudson.maven3.launcher.Maven3Launcher.main(Maven3Launcher.java:117)
	at sun.reflect.NativeMethodAccessorImpl.invoke0(Native Method)
	at sun.reflect.NativeMethodAccessorImpl.invoke(NativeMethodAccessorImpl.java:39)
	at sun.reflect.DelegatingMethodAccessorImpl.invoke(DelegatingMethodAccessorImpl.java:25)
	at java.lang.reflect.Method.invoke(Method.java:597)
	at org.codehaus.plexus.classworlds.launcher.Launcher.launchStandard(Launcher.java:329)
	at org.codehaus.plexus.classworlds.launcher.Launcher.launch(Launcher.java:239)
	at org.jvnet.hudson.maven3.agent.Maven3Main.launch(Maven3Main.java:178)
	at sun.reflect.NativeMethodAccessorImpl.invoke0(Native Method)
	at sun.reflect.NativeMethodAccessorImpl.invoke(NativeMethodAccessorImpl.java:39)
	at sun.reflect.DelegatingMethodAccessorImpl.invoke(DelegatingMethodAccessorImpl.java:25)
	at java.lang.reflect.Method.invoke(Method.java:597)
	at hudson.maven.Maven3Builder.call(Maven3Builder.java:134)
	at hudson.maven.Maven3Builder.call(Maven3Builder.java:69)
	at hudson.remoting.UserRequest.perform(UserRequest.java:118)
	at hudson.remoting.UserRequest.perform(UserRequest.java:48)
	at hudson.remoting.Request$2.run(Request.java:328)
	at hudson.remoting.InterceptingExecutorService$1.call(InterceptingExecutorService.java:72)
	at java.util.concurrent.FutureTask$Sync.innerRun(FutureTask.java:303)
	at java.util.concurrent.FutureTask.run(FutureTask.java:138)
	at java.util.concurrent.ThreadPoolExecutor$Worker.runTask(ThreadPoolExecutor.java:895)
	at java.util.concurrent.ThreadPoolExecutor$Worker.run(ThreadPoolExecutor.java:918)
	at java.lang.Thread.run(Thread.java:662)
Caused by: java.lang.IllegalStateException: Unable to call isArchivingDisabled. Invalid object
ID 49
	at hudson.remoting.RemoteInvocationHandler$RPCRequest.perform(RemoteInvocationHandler.java:293)
	at hudson.remoting.RemoteInvocationHandler$RPCRequest.call(RemoteInvocationHandler.java:280)
	at hudson.remoting.RemoteInvocationHandler$RPCRequest.call(RemoteInvocationHandler.java:239)
	at hudson.remoting.UserRequest.perform(UserRequest.java:118)
	at hudson.remoting.UserRequest.perform(UserRequest.java:48)
	at hudson.remoting.Request$2.run(Request.java:328)
	at hudson.remoting.InterceptingExecutorService$1.call(InterceptingExecutorService.java:72)
	at java.util.concurrent.FutureTask.run(FutureTask.java:262)
	at java.util.concurrent.ThreadPoolExecutor.runWorker(ThreadPoolExecutor.java:1145)
	at java.util.concurrent.ThreadPoolExecutor$Worker.run(ThreadPoolExecutor.java:615)
	at java.lang.Thread.run(Thread.java:745)
[ERROR] 
[ERROR] To see the full stack trace of the errors, re-run Maven with the -e switch.
[ERROR] Re-run Maven using the -X switch to enable full debug logging.
[ERROR] 
[ERROR] For more information about the errors and possible solutions, please read the following
articles:
[ERROR] [Help 1] http://cwiki.apache.org/confluence/display/MAVEN/InternalErrorException
channel stopped
Build was aborted

Mime
View raw message