deltaspike-commits mailing list archives

Site index · List index
Message view « Date » · « Thread »
Top « Date » · « Thread »
From Apache Jenkins Server <jenk...@builds.apache.org>
Subject Build failed in Jenkins: DeltaSpike Weld 1.1.8 #154
Date Sat, 03 May 2014 09:09:28 GMT
See <https://builds.apache.org/job/DeltaSpike%20Weld%201.1.8/154/changes>

Changes:

[gpetracek] DELTASPIKE-543 upgraded version numbers

[gpetracek] DELTASPIKE-587 release notes for v0.7

------------------------------------------
[...truncated 7606 lines...]
[INFO] META-INF/DEPENDENCIES already added, skipping
[INFO] META-INF/DISCLAIMER already added, skipping
[INFO] META-INF/NOTICE already added, skipping
[INFO] META-INF/LICENSE already added, skipping
[INFO] Building jar: <https://builds.apache.org/job/DeltaSpike%20Weld%201.1.8/ws/deltaspike/examples/jsf-playground/target/ds-sources.jar>
[INFO] META-INF already added, skipping
[INFO] META-INF/DEPENDENCIES already added, skipping
[INFO] META-INF/DISCLAIMER already added, skipping
[INFO] META-INF/NOTICE already added, skipping
[INFO] META-INF/LICENSE already added, skipping
[INFO] META-INF already added, skipping
[INFO] META-INF already added, skipping
[INFO] META-INF/DEPENDENCIES already added, skipping
[INFO] META-INF/DISCLAIMER already added, skipping
[INFO] META-INF/NOTICE already added, skipping
[INFO] META-INF/LICENSE already added, skipping
[INFO] META-INF already added, skipping
[INFO] META-INF/DEPENDENCIES already added, skipping
[INFO] META-INF/DISCLAIMER already added, skipping
[INFO] META-INF/NOTICE already added, skipping
[INFO] META-INF/LICENSE already added, skipping
[INFO] 
[INFO] --- maven-checkstyle-plugin:2.9.1:check (verify-style) @ deltaspike-jsf-playground
---
[INFO] Starting audit...
Audit done.

[INFO] 
[INFO] --- maven-install-plugin:2.3.1:install (default-install) @ deltaspike-jsf-playground
---
[INFO] Installing <https://builds.apache.org/job/DeltaSpike%20Weld%201.1.8/ws/deltaspike/examples/jsf-playground/target/ds.war>
to /home/jenkins/jenkins-slave/maven-repositories/0/org/apache/deltaspike/examples/deltaspike-jsf-playground/0.7-SNAPSHOT/deltaspike-jsf-playground-0.7-SNAPSHOT.war
[INFO] Installing <https://builds.apache.org/job/DeltaSpike%20Weld%201.1.8/ws/deltaspike/examples/jsf-playground/pom.xml>
to /home/jenkins/jenkins-slave/maven-repositories/0/org/apache/deltaspike/examples/deltaspike-jsf-playground/0.7-SNAPSHOT/deltaspike-jsf-playground-0.7-SNAPSHOT.pom
[INFO] Installing <https://builds.apache.org/job/DeltaSpike%20Weld%201.1.8/ws/deltaspike/examples/jsf-playground/target/ds-sources.jar>
to /home/jenkins/jenkins-slave/maven-repositories/0/org/apache/deltaspike/examples/deltaspike-jsf-playground/0.7-SNAPSHOT/deltaspike-jsf-playground-0.7-SNAPSHOT-sources.jar
[INFO] ------------------------------------------------------------------------
[INFO] Reactor Summary:
[INFO] 
[INFO] Apache DeltaSpike ................................. SUCCESS [2.891s]
[INFO] Apache DeltaSpike CheckStyle-rules ................ SUCCESS [2.424s]
[INFO] Apache DeltaSpike Parent .......................... SUCCESS [7.957s]
[INFO] Apache DeltaSpike Test-Utils ...................... SUCCESS [13.547s]
[INFO] Apache DeltaSpike Code Parent ..................... SUCCESS [3.550s]
[INFO] Apache DeltaSpike Core ............................ SUCCESS [9.926s]
[INFO] Apache DeltaSpike Core-API ........................ SUCCESS [24.973s]
[INFO] Apache DeltaSpike Core-Implementation ............. SUCCESS [1:35.395s]
[INFO] Apache DeltaSpike ContainerControl parent ......... SUCCESS [3.377s]
[INFO] Apache DeltaSpike CDI ContainerControl API ........ SUCCESS [2.585s]
[INFO] Apache DeltaSpike CDI ContainerControl TCK ........ SUCCESS [3.500s]
[INFO] Apache DeltaSpike CDI OWB-ContainerControl ........ SUCCESS [9.054s]
[INFO] Apache DeltaSpike CDI Weld-ContainerControl ....... SUCCESS [4.900s]
[INFO] Apache DeltaSpike CDI OpenEJB-ContainerControl .... SUCCESS [11.442s]
[INFO] Apache DeltaSpike Modules ......................... SUCCESS [3.295s]
[INFO] Apache DeltaSpike Security-Module ................. SUCCESS [3.045s]
[INFO] Apache DeltaSpike Security-Module API ............. SUCCESS [5.812s]
[INFO] Apache DeltaSpike Security-Module Impl ............ SUCCESS [13.803s]
[INFO] Apache DeltaSpike JPA-Module ...................... SUCCESS [6.314s]
[INFO] Apache DeltaSpike JPA-Module API .................. SUCCESS [11.923s]
[INFO] Apache DeltaSpike JPA-Module Impl ................. SUCCESS [1:20.506s]
[INFO] Apache DeltaSpike Servlet-Module .................. SUCCESS [2.667s]
[INFO] Apache DeltaSpike Servlet-Module API .............. SUCCESS [6.359s]
[INFO] Apache DeltaSpike Servlet-Module Impl ............. SUCCESS [6.030s]
[INFO] Apache DeltaSpike JSF-Module ...................... SUCCESS [6.688s]
[INFO] Apache DeltaSpike JSF-Module API .................. SUCCESS [6.400s]
[INFO] Apache DeltaSpike JSF-Module Impl ................. SUCCESS [38.732s]
[INFO] Apache DeltaSpike Partial-Bean-Module ............. SUCCESS [3.369s]
[INFO] Apache DeltaSpike Partial-Bean-Module API ......... SUCCESS [3.773s]
[INFO] Apache DeltaSpike Partial-Bean-Module Impl ........ SUCCESS [9.247s]
[INFO] Apache DeltaSpike BeanValidation-Module ........... SUCCESS [6.508s]
[INFO] Apache DeltaSpike BeanValidation-Module API ....... SUCCESS [8.126s]
[INFO] Apache DeltaSpike BeanValidation-Module Impl ...... SUCCESS [15.041s]
[INFO] Apache DeltaSpike Data-Module ..................... SUCCESS [3.147s]
[INFO] Apache DeltaSpike Data-Module API ................. SUCCESS [11.885s]
[INFO] Apache DeltaSpike Data-Module Impl ................ SUCCESS [15.824s]
[INFO] Apache DeltaSpike Scheduler-Module ................ SUCCESS [7.372s]
[INFO] Apache DeltaSpike Scheduler-Module API ............ SUCCESS [10.963s]
[INFO] Apache DeltaSpike Scheduler-Module Impl ........... SUCCESS [14.657s]
[INFO] Apache DeltaSpike Test-Control-Module ............. SUCCESS [5.739s]
[INFO] Apache DeltaSpike Test-Control-Module API ......... SUCCESS [12.278s]
[INFO] Apache DeltaSpike Test-Control-Module Impl ........ SUCCESS [24.715s]
[INFO] Apache DeltaSpike Examples ........................ SUCCESS [2.449s]
[INFO] Apache DeltaSpike Java-SE Examples ................ SUCCESS [7.092s]
[INFO] Apache DeltaSpike JSF Examples .................... SUCCESS [7.695s]
[INFO] Apache DeltaSpike JSF Playground .................. SUCCESS [6.296s]
[INFO] ------------------------------------------------------------------------
[INFO] BUILD SUCCESS
[INFO] ------------------------------------------------------------------------
[INFO] Total time: 11:39.762s
[INFO] Finished at: Sat May 03 06:20:44 UTC 2014
[INFO] Final Memory: 86M/552M
[INFO] ------------------------------------------------------------------------
Waiting for Jenkins to finish collecting data
[JENKINS] Archiving <https://builds.apache.org/job/DeltaSpike%20Weld%201.1.8/ws/deltaspike/modules/security/impl/pom.xml>
to org.apache.deltaspike.modules/deltaspike-security-module-impl/0.7-SNAPSHOT/deltaspike-security-module-impl-0.7-SNAPSHOT.pom
[JENKINS] Archiving <https://builds.apache.org/job/DeltaSpike%20Weld%201.1.8/ws/deltaspike/modules/security/impl/target/deltaspike-security-module-impl-0.7-SNAPSHOT.jar>
to org.apache.deltaspike.modules/deltaspike-security-module-impl/0.7-SNAPSHOT/deltaspike-security-module-impl-0.7-SNAPSHOT.jar
[JENKINS] Archiving <https://builds.apache.org/job/DeltaSpike%20Weld%201.1.8/ws/deltaspike/modules/security/impl/target/deltaspike-security-module-impl-0.7-SNAPSHOT-tests.jar>
to org.apache.deltaspike.modules/deltaspike-security-module-impl/0.7-SNAPSHOT/deltaspike-security-module-impl-0.7-SNAPSHOT-tests.jar
[JENKINS] Archiving <https://builds.apache.org/job/DeltaSpike%20Weld%201.1.8/ws/deltaspike/modules/security/impl/target/deltaspike-security-module-impl-0.7-SNAPSHOT-sources.jar>
to org.apache.deltaspike.modules/deltaspike-security-module-impl/0.7-SNAPSHOT/deltaspike-security-module-impl-0.7-SNAPSHOT-sources.jar
[JENKINS] Archiving <https://builds.apache.org/job/DeltaSpike%20Weld%201.1.8/ws/deltaspike/modules/jpa/api/pom.xml>
to org.apache.deltaspike.modules/deltaspike-jpa-module-api/0.7-SNAPSHOT/deltaspike-jpa-module-api-0.7-SNAPSHOT.pom
[JENKINS] Archiving <https://builds.apache.org/job/DeltaSpike%20Weld%201.1.8/ws/deltaspike/modules/jpa/api/target/deltaspike-jpa-module-api-0.7-SNAPSHOT.jar>
to org.apache.deltaspike.modules/deltaspike-jpa-module-api/0.7-SNAPSHOT/deltaspike-jpa-module-api-0.7-SNAPSHOT.jar
[JENKINS] Archiving <https://builds.apache.org/job/DeltaSpike%20Weld%201.1.8/ws/deltaspike/modules/jpa/api/target/deltaspike-jpa-module-api-0.7-SNAPSHOT-tests.jar>
to org.apache.deltaspike.modules/deltaspike-jpa-module-api/0.7-SNAPSHOT/deltaspike-jpa-module-api-0.7-SNAPSHOT-tests.jar
[JENKINS] Archiving <https://builds.apache.org/job/DeltaSpike%20Weld%201.1.8/ws/deltaspike/modules/jpa/api/target/deltaspike-jpa-module-api-0.7-SNAPSHOT-sources.jar>
to org.apache.deltaspike.modules/deltaspike-jpa-module-api/0.7-SNAPSHOT/deltaspike-jpa-module-api-0.7-SNAPSHOT-sources.jar
[JENKINS] Archiving <https://builds.apache.org/job/DeltaSpike%20Weld%201.1.8/ws/deltaspike/cdictrl/tck/pom.xml>
to org.apache.deltaspike.test/deltaspike-cdictrl-tck/0.7-SNAPSHOT/deltaspike-cdictrl-tck-0.7-SNAPSHOT.pom
[JENKINS] Archiving <https://builds.apache.org/job/DeltaSpike%20Weld%201.1.8/ws/deltaspike/cdictrl/tck/target/deltaspike-cdictrl-tck-0.7-SNAPSHOT.jar>
to org.apache.deltaspike.test/deltaspike-cdictrl-tck/0.7-SNAPSHOT/deltaspike-cdictrl-tck-0.7-SNAPSHOT.jar
[JENKINS] Archiving <https://builds.apache.org/job/DeltaSpike%20Weld%201.1.8/ws/deltaspike/cdictrl/tck/target/deltaspike-cdictrl-tck-0.7-SNAPSHOT-sources.jar>
to org.apache.deltaspike.test/deltaspike-cdictrl-tck/0.7-SNAPSHOT/deltaspike-cdictrl-tck-0.7-SNAPSHOT-sources.jar
[JENKINS] Archiving <https://builds.apache.org/job/DeltaSpike%20Weld%201.1.8/ws/deltaspike/modules/bean-validation/pom.xml>
to org.apache.deltaspike.modules/bean-validation-module-project/0.7-SNAPSHOT/bean-validation-module-project-0.7-SNAPSHOT.pom
[JENKINS] Archiving <https://builds.apache.org/job/DeltaSpike%20Weld%201.1.8/ws/deltaspike/modules/bean-validation/target/bean-validation-module-project-0.7-SNAPSHOT-tests.jar>
to org.apache.deltaspike.modules/bean-validation-module-project/0.7-SNAPSHOT/bean-validation-module-project-0.7-SNAPSHOT-tests.jar
[JENKINS] Archiving <https://builds.apache.org/job/DeltaSpike%20Weld%201.1.8/ws/deltaspike/parent/code/pom.xml>
to org.apache.deltaspike/parent-code/0.7-SNAPSHOT/parent-code-0.7-SNAPSHOT.pom
[JENKINS] Archiving <https://builds.apache.org/job/DeltaSpike%20Weld%201.1.8/ws/deltaspike/parent/code/target/parent-code-0.7-SNAPSHOT-tests.jar>
to org.apache.deltaspike/parent-code/0.7-SNAPSHOT/parent-code-0.7-SNAPSHOT-tests.jar
[JENKINS] Archiving <https://builds.apache.org/job/DeltaSpike%20Weld%201.1.8/ws/deltaspike/modules/jpa/impl/pom.xml>
to org.apache.deltaspike.modules/deltaspike-jpa-module-impl/0.7-SNAPSHOT/deltaspike-jpa-module-impl-0.7-SNAPSHOT.pom
[JENKINS] Archiving <https://builds.apache.org/job/DeltaSpike%20Weld%201.1.8/ws/deltaspike/modules/jpa/impl/target/deltaspike-jpa-module-impl-0.7-SNAPSHOT.jar>
to org.apache.deltaspike.modules/deltaspike-jpa-module-impl/0.7-SNAPSHOT/deltaspike-jpa-module-impl-0.7-SNAPSHOT.jar
[JENKINS] Archiving <https://builds.apache.org/job/DeltaSpike%20Weld%201.1.8/ws/deltaspike/modules/jpa/impl/target/deltaspike-jpa-module-impl-0.7-SNAPSHOT-tests.jar>
to org.apache.deltaspike.modules/deltaspike-jpa-module-impl/0.7-SNAPSHOT/deltaspike-jpa-module-impl-0.7-SNAPSHOT-tests.jar
[JENKINS] Archiving <https://builds.apache.org/job/DeltaSpike%20Weld%201.1.8/ws/deltaspike/modules/jpa/impl/target/deltaspike-jpa-module-impl-0.7-SNAPSHOT-sources.jar>
to org.apache.deltaspike.modules/deltaspike-jpa-module-impl/0.7-SNAPSHOT/deltaspike-jpa-module-impl-0.7-SNAPSHOT-sources.jar
[JENKINS] Archiving <https://builds.apache.org/job/DeltaSpike%20Weld%201.1.8/ws/deltaspike/modules/partial-bean/impl/pom.xml>
to org.apache.deltaspike.modules/deltaspike-partial-bean-module-impl/0.7-SNAPSHOT/deltaspike-partial-bean-module-impl-0.7-SNAPSHOT.pom
[JENKINS] Archiving <https://builds.apache.org/job/DeltaSpike%20Weld%201.1.8/ws/deltaspike/modules/partial-bean/impl/target/deltaspike-partial-bean-module-impl-0.7-SNAPSHOT.jar>
to org.apache.deltaspike.modules/deltaspike-partial-bean-module-impl/0.7-SNAPSHOT/deltaspike-partial-bean-module-impl-0.7-SNAPSHOT.jar
[JENKINS] Archiving <https://builds.apache.org/job/DeltaSpike%20Weld%201.1.8/ws/deltaspike/modules/partial-bean/impl/target/deltaspike-partial-bean-module-impl-0.7-SNAPSHOT-tests.jar>
to org.apache.deltaspike.modules/deltaspike-partial-bean-module-impl/0.7-SNAPSHOT/deltaspike-partial-bean-module-impl-0.7-SNAPSHOT-tests.jar
[JENKINS] Archiving <https://builds.apache.org/job/DeltaSpike%20Weld%201.1.8/ws/deltaspike/modules/partial-bean/impl/target/deltaspike-partial-bean-module-impl-0.7-SNAPSHOT-sources.jar>
to org.apache.deltaspike.modules/deltaspike-partial-bean-module-impl/0.7-SNAPSHOT/deltaspike-partial-bean-module-impl-0.7-SNAPSHOT-sources.jar
[JENKINS] Archiving <https://builds.apache.org/job/DeltaSpike%20Weld%201.1.8/ws/deltaspike/modules/scheduler/api/pom.xml>
to org.apache.deltaspike.modules/deltaspike-scheduler-module-api/0.7-SNAPSHOT/deltaspike-scheduler-module-api-0.7-SNAPSHOT.pom
[JENKINS] Archiving <https://builds.apache.org/job/DeltaSpike%20Weld%201.1.8/ws/deltaspike/modules/scheduler/api/target/deltaspike-scheduler-module-api-0.7-SNAPSHOT.jar>
to org.apache.deltaspike.modules/deltaspike-scheduler-module-api/0.7-SNAPSHOT/deltaspike-scheduler-module-api-0.7-SNAPSHOT.jar
[JENKINS] Archiving <https://builds.apache.org/job/DeltaSpike%20Weld%201.1.8/ws/deltaspike/modules/scheduler/api/target/deltaspike-scheduler-module-api-0.7-SNAPSHOT-tests.jar>
to org.apache.deltaspike.modules/deltaspike-scheduler-module-api/0.7-SNAPSHOT/deltaspike-scheduler-module-api-0.7-SNAPSHOT-tests.jar
[JENKINS] Archiving <https://builds.apache.org/job/DeltaSpike%20Weld%201.1.8/ws/deltaspike/modules/scheduler/api/target/deltaspike-scheduler-module-api-0.7-SNAPSHOT-sources.jar>
to org.apache.deltaspike.modules/deltaspike-scheduler-module-api/0.7-SNAPSHOT/deltaspike-scheduler-module-api-0.7-SNAPSHOT-sources.jar
[JENKINS] Archiving <https://builds.apache.org/job/DeltaSpike%20Weld%201.1.8/ws/deltaspike/modules/test-control/pom.xml>
to org.apache.deltaspike.modules/test-control-module-project/0.7-SNAPSHOT/test-control-module-project-0.7-SNAPSHOT.pom
[JENKINS] Archiving <https://builds.apache.org/job/DeltaSpike%20Weld%201.1.8/ws/deltaspike/modules/test-control/target/test-control-module-project-0.7-SNAPSHOT-tests.jar>
to org.apache.deltaspike.modules/test-control-module-project/0.7-SNAPSHOT/test-control-module-project-0.7-SNAPSHOT-tests.jar
[JENKINS] Archiving <https://builds.apache.org/job/DeltaSpike%20Weld%201.1.8/ws/deltaspike/modules/jsf/impl/pom.xml>
to org.apache.deltaspike.modules/deltaspike-jsf-module-impl/0.7-SNAPSHOT/deltaspike-jsf-module-impl-0.7-SNAPSHOT.pom
[JENKINS] Archiving <https://builds.apache.org/job/DeltaSpike%20Weld%201.1.8/ws/deltaspike/modules/jsf/impl/target/deltaspike-jsf-module-impl-0.7-SNAPSHOT.jar>
to org.apache.deltaspike.modules/deltaspike-jsf-module-impl/0.7-SNAPSHOT/deltaspike-jsf-module-impl-0.7-SNAPSHOT.jar
[JENKINS] Archiving <https://builds.apache.org/job/DeltaSpike%20Weld%201.1.8/ws/deltaspike/modules/jsf/impl/target/deltaspike-jsf-module-impl-0.7-SNAPSHOT-tests.jar>
to org.apache.deltaspike.modules/deltaspike-jsf-module-impl/0.7-SNAPSHOT/deltaspike-jsf-module-impl-0.7-SNAPSHOT-tests.jar
[JENKINS] Archiving <https://builds.apache.org/job/DeltaSpike%20Weld%201.1.8/ws/deltaspike/modules/jsf/impl/target/deltaspike-jsf-module-impl-0.7-SNAPSHOT-sources.jar>
to org.apache.deltaspike.modules/deltaspike-jsf-module-impl/0.7-SNAPSHOT/deltaspike-jsf-module-impl-0.7-SNAPSHOT-sources.jar
[JENKINS] Archiving <https://builds.apache.org/job/DeltaSpike%20Weld%201.1.8/ws/deltaspike/modules/scheduler/impl/pom.xml>
to org.apache.deltaspike.modules/deltaspike-scheduler-module-impl/0.7-SNAPSHOT/deltaspike-scheduler-module-impl-0.7-SNAPSHOT.pom
[JENKINS] Archiving <https://builds.apache.org/job/DeltaSpike%20Weld%201.1.8/ws/deltaspike/modules/scheduler/impl/target/deltaspike-scheduler-module-impl-0.7-SNAPSHOT.jar>
to org.apache.deltaspike.modules/deltaspike-scheduler-module-impl/0.7-SNAPSHOT/deltaspike-scheduler-module-impl-0.7-SNAPSHOT.jar
[JENKINS] Archiving <https://builds.apache.org/job/DeltaSpike%20Weld%201.1.8/ws/deltaspike/modules/scheduler/impl/target/deltaspike-scheduler-module-impl-0.7-SNAPSHOT-tests.jar>
to org.apache.deltaspike.modules/deltaspike-scheduler-module-impl/0.7-SNAPSHOT/deltaspike-scheduler-module-impl-0.7-SNAPSHOT-tests.jar
[JENKINS] Archiving <https://builds.apache.org/job/DeltaSpike%20Weld%201.1.8/ws/deltaspike/modules/scheduler/impl/target/deltaspike-scheduler-module-impl-0.7-SNAPSHOT-sources.jar>
to org.apache.deltaspike.modules/deltaspike-scheduler-module-impl/0.7-SNAPSHOT/deltaspike-scheduler-module-impl-0.7-SNAPSHOT-sources.jar
[JENKINS] Archiving <https://builds.apache.org/job/DeltaSpike%20Weld%201.1.8/ws/deltaspike/examples/jsf-playground/pom.xml>
to org.apache.deltaspike.examples/deltaspike-jsf-playground/0.7-SNAPSHOT/deltaspike-jsf-playground-0.7-SNAPSHOT.pom
[JENKINS] Archiving <https://builds.apache.org/job/DeltaSpike%20Weld%201.1.8/ws/deltaspike/examples/jsf-playground/target/ds.war>
to org.apache.deltaspike.examples/deltaspike-jsf-playground/0.7-SNAPSHOT/deltaspike-jsf-playground-0.7-SNAPSHOT.war
[JENKINS] Archiving <https://builds.apache.org/job/DeltaSpike%20Weld%201.1.8/ws/deltaspike/examples/jsf-playground/target/ds-sources.jar>
to org.apache.deltaspike.examples/deltaspike-jsf-playground/0.7-SNAPSHOT/deltaspike-jsf-playground-0.7-SNAPSHOT-sources.jar
[JENKINS] Archiving <https://builds.apache.org/job/DeltaSpike%20Weld%201.1.8/ws/deltaspike/modules/test-control/impl/pom.xml>
to org.apache.deltaspike.modules/deltaspike-test-control-module-impl/0.7-SNAPSHOT/deltaspike-test-control-module-impl-0.7-SNAPSHOT.pom
[JENKINS] Archiving <https://builds.apache.org/job/DeltaSpike%20Weld%201.1.8/ws/deltaspike/modules/test-control/impl/target/deltaspike-test-control-module-impl-0.7-SNAPSHOT.jar>
to org.apache.deltaspike.modules/deltaspike-test-control-module-impl/0.7-SNAPSHOT/deltaspike-test-control-module-impl-0.7-SNAPSHOT.jar
[JENKINS] Archiving <https://builds.apache.org/job/DeltaSpike%20Weld%201.1.8/ws/deltaspike/modules/test-control/impl/target/deltaspike-test-control-module-impl-0.7-SNAPSHOT-tests.jar>
to org.apache.deltaspike.modules/deltaspike-test-control-module-impl/0.7-SNAPSHOT/deltaspike-test-control-module-impl-0.7-SNAPSHOT-tests.jar
[JENKINS] Archiving <https://builds.apache.org/job/DeltaSpike%20Weld%201.1.8/ws/deltaspike/modules/test-control/impl/target/deltaspike-test-control-module-impl-0.7-SNAPSHOT-sources.jar>
to org.apache.deltaspike.modules/deltaspike-test-control-module-impl/0.7-SNAPSHOT/deltaspike-test-control-module-impl-0.7-SNAPSHOT-sources.jar
[JENKINS] Archiving <https://builds.apache.org/job/DeltaSpike%20Weld%201.1.8/ws/deltaspike/checkstyle-rules/pom.xml>
to org.apache.deltaspike/checkstyle-rules/0.7-SNAPSHOT/checkstyle-rules-0.7-SNAPSHOT.pom
[JENKINS] Archiving <https://builds.apache.org/job/DeltaSpike%20Weld%201.1.8/ws/deltaspike/checkstyle-rules/target/checkstyle-rules-0.7-SNAPSHOT.jar>
to org.apache.deltaspike/checkstyle-rules/0.7-SNAPSHOT/checkstyle-rules-0.7-SNAPSHOT.jar
[JENKINS] Archiving <https://builds.apache.org/job/DeltaSpike%20Weld%201.1.8/ws/deltaspike/modules/data/impl/pom.xml>
to org.apache.deltaspike.modules/deltaspike-data-module-impl/0.7-SNAPSHOT/deltaspike-data-module-impl-0.7-SNAPSHOT.pom
[JENKINS] Archiving <https://builds.apache.org/job/DeltaSpike%20Weld%201.1.8/ws/deltaspike/modules/data/impl/target/deltaspike-data-module-impl-0.7-SNAPSHOT.jar>
to org.apache.deltaspike.modules/deltaspike-data-module-impl/0.7-SNAPSHOT/deltaspike-data-module-impl-0.7-SNAPSHOT.jar
[JENKINS] Archiving <https://builds.apache.org/job/DeltaSpike%20Weld%201.1.8/ws/deltaspike/modules/data/impl/target/deltaspike-data-module-impl-0.7-SNAPSHOT-tests.jar>
to org.apache.deltaspike.modules/deltaspike-data-module-impl/0.7-SNAPSHOT/deltaspike-data-module-impl-0.7-SNAPSHOT-tests.jar
[JENKINS] Archiving <https://builds.apache.org/job/DeltaSpike%20Weld%201.1.8/ws/deltaspike/modules/data/impl/target/deltaspike-data-module-impl-0.7-SNAPSHOT-sources.jar>
to org.apache.deltaspike.modules/deltaspike-data-module-impl/0.7-SNAPSHOT/deltaspike-data-module-impl-0.7-SNAPSHOT-sources.jar
[JENKINS] Archiving <https://builds.apache.org/job/DeltaSpike%20Weld%201.1.8/ws/deltaspike/modules/jsf/pom.xml>
to org.apache.deltaspike.modules/jsf-module-project/0.7-SNAPSHOT/jsf-module-project-0.7-SNAPSHOT.pom
[JENKINS] Archiving <https://builds.apache.org/job/DeltaSpike%20Weld%201.1.8/ws/deltaspike/modules/jsf/target/jsf-module-project-0.7-SNAPSHOT-tests.jar>
to org.apache.deltaspike.modules/jsf-module-project/0.7-SNAPSHOT/jsf-module-project-0.7-SNAPSHOT-tests.jar
[JENKINS] Archiving <https://builds.apache.org/job/DeltaSpike%20Weld%201.1.8/ws/deltaspike/modules/bean-validation/impl/pom.xml>
to org.apache.deltaspike.modules/deltaspike-bean-validation-module-impl/0.7-SNAPSHOT/deltaspike-bean-validation-module-impl-0.7-SNAPSHOT.pom
[JENKINS] Archiving <https://builds.apache.org/job/DeltaSpike%20Weld%201.1.8/ws/deltaspike/modules/bean-validation/impl/target/deltaspike-bean-validation-module-impl-0.7-SNAPSHOT.jar>
to org.apache.deltaspike.modules/deltaspike-bean-validation-module-impl/0.7-SNAPSHOT/deltaspike-bean-validation-module-impl-0.7-SNAPSHOT.jar
[JENKINS] Archiving <https://builds.apache.org/job/DeltaSpike%20Weld%201.1.8/ws/deltaspike/modules/bean-validation/impl/target/deltaspike-bean-validation-module-impl-0.7-SNAPSHOT-tests.jar>
to org.apache.deltaspike.modules/deltaspike-bean-validation-module-impl/0.7-SNAPSHOT/deltaspike-bean-validation-module-impl-0.7-SNAPSHOT-tests.jar
[JENKINS] Archiving <https://builds.apache.org/job/DeltaSpike%20Weld%201.1.8/ws/deltaspike/modules/bean-validation/impl/target/deltaspike-bean-validation-module-impl-0.7-SNAPSHOT-sources.jar>
to org.apache.deltaspike.modules/deltaspike-bean-validation-module-impl/0.7-SNAPSHOT/deltaspike-bean-validation-module-impl-0.7-SNAPSHOT-sources.jar
[JENKINS] Archiving <https://builds.apache.org/job/DeltaSpike%20Weld%201.1.8/ws/deltaspike/modules/servlet/api/pom.xml>
to org.apache.deltaspike.modules/deltaspike-servlet-module-api/0.7-SNAPSHOT/deltaspike-servlet-module-api-0.7-SNAPSHOT.pom
[JENKINS] Archiving <https://builds.apache.org/job/DeltaSpike%20Weld%201.1.8/ws/deltaspike/modules/servlet/api/target/deltaspike-servlet-module-api-0.7-SNAPSHOT.jar>
to org.apache.deltaspike.modules/deltaspike-servlet-module-api/0.7-SNAPSHOT/deltaspike-servlet-module-api-0.7-SNAPSHOT.jar
[JENKINS] Archiving <https://builds.apache.org/job/DeltaSpike%20Weld%201.1.8/ws/deltaspike/modules/servlet/api/target/deltaspike-servlet-module-api-0.7-SNAPSHOT-tests.jar>
to org.apache.deltaspike.modules/deltaspike-servlet-module-api/0.7-SNAPSHOT/deltaspike-servlet-module-api-0.7-SNAPSHOT-tests.jar
[JENKINS] Archiving <https://builds.apache.org/job/DeltaSpike%20Weld%201.1.8/ws/deltaspike/modules/servlet/api/target/deltaspike-servlet-module-api-0.7-SNAPSHOT-sources.jar>
to org.apache.deltaspike.modules/deltaspike-servlet-module-api/0.7-SNAPSHOT/deltaspike-servlet-module-api-0.7-SNAPSHOT-sources.jar
[JENKINS] Archiving <https://builds.apache.org/job/DeltaSpike%20Weld%201.1.8/ws/deltaspike/cdictrl/pom.xml>
to org.apache.deltaspike.cdictrl/cdictrl-project/0.7-SNAPSHOT/cdictrl-project-0.7-SNAPSHOT.pom
[JENKINS] Archiving <https://builds.apache.org/job/DeltaSpike%20Weld%201.1.8/ws/deltaspike/core/api/pom.xml>
to org.apache.deltaspike.core/deltaspike-core-api/0.7-SNAPSHOT/deltaspike-core-api-0.7-SNAPSHOT.pom
[JENKINS] Archiving <https://builds.apache.org/job/DeltaSpike%20Weld%201.1.8/ws/deltaspike/core/api/target/deltaspike-core-api-0.7-SNAPSHOT.jar>
to org.apache.deltaspike.core/deltaspike-core-api/0.7-SNAPSHOT/deltaspike-core-api-0.7-SNAPSHOT.jar
[JENKINS] Archiving <https://builds.apache.org/job/DeltaSpike%20Weld%201.1.8/ws/deltaspike/core/api/target/deltaspike-core-api-0.7-SNAPSHOT-tests.jar>
to org.apache.deltaspike.core/deltaspike-core-api/0.7-SNAPSHOT/deltaspike-core-api-0.7-SNAPSHOT-tests.jar
[JENKINS] Archiving <https://builds.apache.org/job/DeltaSpike%20Weld%201.1.8/ws/deltaspike/core/api/target/deltaspike-core-api-0.7-SNAPSHOT-sources.jar>
to org.apache.deltaspike.core/deltaspike-core-api/0.7-SNAPSHOT/deltaspike-core-api-0.7-SNAPSHOT-sources.jar
[JENKINS] Archiving <https://builds.apache.org/job/DeltaSpike%20Weld%201.1.8/ws/deltaspike/modules/partial-bean/api/pom.xml>
to org.apache.deltaspike.modules/deltaspike-partial-bean-module-api/0.7-SNAPSHOT/deltaspike-partial-bean-module-api-0.7-SNAPSHOT.pom
[JENKINS] Archiving <https://builds.apache.org/job/DeltaSpike%20Weld%201.1.8/ws/deltaspike/modules/partial-bean/api/target/deltaspike-partial-bean-module-api-0.7-SNAPSHOT.jar>
to org.apache.deltaspike.modules/deltaspike-partial-bean-module-api/0.7-SNAPSHOT/deltaspike-partial-bean-module-api-0.7-SNAPSHOT.jar
[JENKINS] Archiving <https://builds.apache.org/job/DeltaSpike%20Weld%201.1.8/ws/deltaspike/modules/partial-bean/api/target/deltaspike-partial-bean-module-api-0.7-SNAPSHOT-tests.jar>
to org.apache.deltaspike.modules/deltaspike-partial-bean-module-api/0.7-SNAPSHOT/deltaspike-partial-bean-module-api-0.7-SNAPSHOT-tests.jar
[JENKINS] Archiving <https://builds.apache.org/job/DeltaSpike%20Weld%201.1.8/ws/deltaspike/modules/partial-bean/api/target/deltaspike-partial-bean-module-api-0.7-SNAPSHOT-sources.jar>
to org.apache.deltaspike.modules/deltaspike-partial-bean-module-api/0.7-SNAPSHOT/deltaspike-partial-bean-module-api-0.7-SNAPSHOT-sources.jar
[JENKINS] Archiving <https://builds.apache.org/job/DeltaSpike%20Weld%201.1.8/ws/deltaspike/modules/bean-validation/api/pom.xml>
to org.apache.deltaspike.modules/deltaspike-bean-validation-module-api/0.7-SNAPSHOT/deltaspike-bean-validation-module-api-0.7-SNAPSHOT.pom
[JENKINS] Archiving <https://builds.apache.org/job/DeltaSpike%20Weld%201.1.8/ws/deltaspike/modules/bean-validation/api/target/deltaspike-bean-validation-module-api-0.7-SNAPSHOT.jar>
to org.apache.deltaspike.modules/deltaspike-bean-validation-module-api/0.7-SNAPSHOT/deltaspike-bean-validation-module-api-0.7-SNAPSHOT.jar
[JENKINS] Archiving <https://builds.apache.org/job/DeltaSpike%20Weld%201.1.8/ws/deltaspike/modules/bean-validation/api/target/deltaspike-bean-validation-module-api-0.7-SNAPSHOT-tests.jar>
to org.apache.deltaspike.modules/deltaspike-bean-validation-module-api/0.7-SNAPSHOT/deltaspike-bean-validation-module-api-0.7-SNAPSHOT-tests.jar
[JENKINS] Archiving <https://builds.apache.org/job/DeltaSpike%20Weld%201.1.8/ws/deltaspike/modules/bean-validation/api/target/deltaspike-bean-validation-module-api-0.7-SNAPSHOT-sources.jar>
to org.apache.deltaspike.modules/deltaspike-bean-validation-module-api/0.7-SNAPSHOT/deltaspike-bean-validation-module-api-0.7-SNAPSHOT-sources.jar
[JENKINS] Archiving <https://builds.apache.org/job/DeltaSpike%20Weld%201.1.8/ws/deltaspike/cdictrl/api/pom.xml>
to org.apache.deltaspike.cdictrl/deltaspike-cdictrl-api/0.7-SNAPSHOT/deltaspike-cdictrl-api-0.7-SNAPSHOT.pom
[JENKINS] Archiving <https://builds.apache.org/job/DeltaSpike%20Weld%201.1.8/ws/deltaspike/cdictrl/api/target/deltaspike-cdictrl-api-0.7-SNAPSHOT.jar>
to org.apache.deltaspike.cdictrl/deltaspike-cdictrl-api/0.7-SNAPSHOT/deltaspike-cdictrl-api-0.7-SNAPSHOT.jar
[JENKINS] Archiving <https://builds.apache.org/job/DeltaSpike%20Weld%201.1.8/ws/deltaspike/cdictrl/api/target/deltaspike-cdictrl-api-0.7-SNAPSHOT-sources.jar>
to org.apache.deltaspike.cdictrl/deltaspike-cdictrl-api/0.7-SNAPSHOT/deltaspike-cdictrl-api-0.7-SNAPSHOT-sources.jar
Build timed out (after 180 minutes). Marking the build as aborted.
ERROR: Failed to parse POMs
java.io.IOException: java.io.IOException: Failed to extract <https://builds.apache.org/job/DeltaSpike%20Weld%201.1.8/ws/deltaspike/cdictrl/api/transfer>
of 3 files
	at hudson.FilePath.readFromTar(FilePath.java:2101)
	at hudson.FilePath.copyRecursiveTo(FilePath.java:2013)
	at jenkins.model.StandardArtifactManager.archive(StandardArtifactManager.java:61)
	at hudson.maven.MavenBuild$ProxyImpl.performArchiving(MavenBuild.java:474)
	at hudson.maven.MavenModuleSetBuild$MavenModuleSetBuildExecution.doRun(MavenModuleSetBuild.java:845)
	at hudson.model.AbstractBuild$AbstractBuildExecution.run(AbstractBuild.java:518)
	at hudson.model.Run.execute(Run.java:1706)
	at hudson.maven.MavenModuleSetBuild.run(MavenModuleSetBuild.java:529)
	at hudson.model.ResourceController.execute(ResourceController.java:88)
	at hudson.model.Executor.run(Executor.java:231)
Caused by: java.io.IOException
	at hudson.remoting.FastPipedInputStream.read(FastPipedInputStream.java:177)
	at hudson.util.HeadBufferingStream.read(HeadBufferingStream.java:61)
	at com.jcraft.jzlib.InflaterInputStream.fill(InflaterInputStream.java:175)
	at com.jcraft.jzlib.InflaterInputStream.read(InflaterInputStream.java:106)
	at org.apache.tools.tar.TarBuffer.readBlock(TarBuffer.java:257)
	at org.apache.tools.tar.TarBuffer.readRecord(TarBuffer.java:223)
	at hudson.org.apache.tools.tar.TarInputStream.read(TarInputStream.java:345)
	at java.io.FilterInputStream.read(FilterInputStream.java:107)
	at org.apache.commons.io.IOUtils.copyLarge(IOUtils.java:1792)
	at org.apache.commons.io.IOUtils.copyLarge(IOUtils.java:1769)
	at org.apache.commons.io.IOUtils.copy(IOUtils.java:1744)
	at hudson.util.IOUtils.copy(IOUtils.java:40)
	at hudson.FilePath.readFromTar(FilePath.java:2091)
	... 9 more

	at hudson.FilePath.copyRecursiveTo(FilePath.java:2020)
	at jenkins.model.StandardArtifactManager.archive(StandardArtifactManager.java:61)
	at hudson.maven.MavenBuild$ProxyImpl.performArchiving(MavenBuild.java:474)
	at hudson.maven.MavenModuleSetBuild$MavenModuleSetBuildExecution.doRun(MavenModuleSetBuild.java:845)
	at hudson.model.AbstractBuild$AbstractBuildExecution.run(AbstractBuild.java:518)
	at hudson.model.Run.execute(Run.java:1706)
	at hudson.maven.MavenModuleSetBuild.run(MavenModuleSetBuild.java:529)
	at hudson.model.ResourceController.execute(ResourceController.java:88)
	at hudson.model.Executor.run(Executor.java:231)
Caused by: java.util.concurrent.ExecutionException: hudson.remoting.RequestAbortedException:
java.io.IOException: Unexpected reader termination
	at hudson.remoting.Request$1.get(Request.java:278)
	at hudson.remoting.Request$1.get(Request.java:210)
	at hudson.remoting.FutureAdapter.get(FutureAdapter.java:59)
	at hudson.FilePath.copyRecursiveTo(FilePath.java:2016)
	... 8 more
Caused by: hudson.remoting.RequestAbortedException: java.io.IOException: Unexpected reader
termination
	at hudson.remoting.Request.abort(Request.java:299)
	at hudson.remoting.Channel.terminate(Channel.java:802)
	at hudson.remoting.SynchronousCommandTransport$ReaderThread.run(SynchronousCommandTransport.java:76)
Caused by: java.io.IOException: Unexpected reader termination
	... 1 more
Caused by: java.lang.OutOfMemoryError: Java heap space
	at java.util.Arrays.copyOf(Arrays.java:3230)
	at java.io.ByteArrayOutputStream.grow(ByteArrayOutputStream.java:113)
	at java.io.ByteArrayOutputStream.ensureCapacity(ByteArrayOutputStream.java:93)
	at java.io.ByteArrayOutputStream.write(ByteArrayOutputStream.java:140)
	at hudson.remoting.FlightRecorderInputStream.read(FlightRecorderInputStream.java:87)
	at hudson.remoting.ChunkedInputStream.read(ChunkedInputStream.java:46)
	at hudson.remoting.ChunkedInputStream.readUntilBreak(ChunkedInputStream.java:88)
	at hudson.remoting.ChunkedCommandTransport.readBlock(ChunkedCommandTransport.java:33)
	at hudson.remoting.AbstractSynchronousByteArrayCommandTransport.read(AbstractSynchronousByteArrayCommandTransport.java:34)
	at hudson.remoting.SynchronousCommandTransport$ReaderThread.run(SynchronousCommandTransport.java:48)
FATAL: channel is already closed
hudson.remoting.ChannelClosedException: channel is already closed
	at hudson.remoting.Channel.send(Channel.java:541)
	at hudson.remoting.Request.call(Request.java:129)
	at hudson.remoting.Channel.call(Channel.java:739)
	at hudson.Launcher$RemoteLauncher.kill(Launcher.java:913)
	at hudson.model.AbstractBuild$AbstractBuildExecution.run(AbstractBuild.java:541)
	at hudson.model.Run.execute(Run.java:1706)
	at hudson.maven.MavenModuleSetBuild.run(MavenModuleSetBuild.java:529)
	at hudson.model.ResourceController.execute(ResourceController.java:88)
	at hudson.model.Executor.run(Executor.java:231)
Caused by: java.io.IOException: Unexpected reader termination
	at hudson.remoting.SynchronousCommandTransport$ReaderThread.run(SynchronousCommandTransport.java:76)
Caused by: java.lang.OutOfMemoryError: Java heap space
	at java.util.Arrays.copyOf(Arrays.java:3230)
	at java.io.ByteArrayOutputStream.grow(ByteArrayOutputStream.java:113)
	at java.io.ByteArrayOutputStream.ensureCapacity(ByteArrayOutputStream.java:93)
	at java.io.ByteArrayOutputStream.write(ByteArrayOutputStream.java:140)
	at hudson.remoting.FlightRecorderInputStream.read(FlightRecorderInputStream.java:87)
	at hudson.remoting.ChunkedInputStream.read(ChunkedInputStream.java:46)
	at hudson.remoting.ChunkedInputStream.readUntilBreak(ChunkedInputStream.java:88)
	at hudson.remoting.ChunkedCommandTransport.readBlock(ChunkedCommandTransport.java:33)
	at hudson.remoting.AbstractSynchronousByteArrayCommandTransport.read(AbstractSynchronousByteArrayCommandTransport.java:34)
	at hudson.remoting.SynchronousCommandTransport$ReaderThread.run(SynchronousCommandTransport.java:48)

Mime
View raw message