deltaspike-commits mailing list archives

Site index · List index
Message view « Date » · « Thread »
Top « Date » · « Thread »
From Apache Jenkins Server <jenk...@builds.apache.org>
Subject Build failed in Jenkins: DeltaSpike Deploy #474
Date Sun, 20 Apr 2014 14:53:10 GMT
See <https://builds.apache.org/job/DeltaSpike%20Deploy/474/>

------------------------------------------
[...truncated 7113 lines...]
[INFO] Executed tasks
[WARNING] Failed to getClass for org.apache.maven.plugin.source.SourceJarMojo
[INFO] 
[INFO] --- maven-source-plugin:2.1.2:jar (attach-sources) @ deltaspike-data-module-impl ---
[INFO] META-INF already added, skipping
[INFO] META-INF/DISCLAIMER already added, skipping
[INFO] META-INF/LICENSE already added, skipping
[INFO] META-INF/NOTICE already added, skipping
[INFO] META-INF/DEPENDENCIES already added, skipping
[INFO] META-INF already added, skipping
[INFO] META-INF already added, skipping
[INFO] META-INF/DISCLAIMER already added, skipping
[INFO] META-INF/LICENSE already added, skipping
[INFO] META-INF/NOTICE already added, skipping
[INFO] META-INF/DEPENDENCIES already added, skipping
[INFO] META-INF already added, skipping
[INFO] META-INF/DISCLAIMER already added, skipping
[INFO] META-INF/LICENSE already added, skipping
[INFO] META-INF/NOTICE already added, skipping
[INFO] META-INF/DEPENDENCIES already added, skipping
[INFO] Building jar: <https://builds.apache.org/job/DeltaSpike%20Deploy/ws/deltaspike/modules/data/impl/target/deltaspike-data-module-impl-0.7-SNAPSHOT-sources.jar>
[INFO] META-INF already added, skipping
[INFO] META-INF/DISCLAIMER already added, skipping
[INFO] META-INF/LICENSE already added, skipping
[INFO] META-INF/NOTICE already added, skipping
[INFO] META-INF/DEPENDENCIES already added, skipping
[INFO] META-INF already added, skipping
[INFO] META-INF already added, skipping
[INFO] META-INF/DISCLAIMER already added, skipping
[INFO] META-INF/LICENSE already added, skipping
[INFO] META-INF/NOTICE already added, skipping
[INFO] META-INF/DEPENDENCIES already added, skipping
[INFO] META-INF already added, skipping
[INFO] META-INF/DISCLAIMER already added, skipping
[INFO] META-INF/LICENSE already added, skipping
[INFO] META-INF/NOTICE already added, skipping
[INFO] META-INF/DEPENDENCIES already added, skipping
[INFO] 
[INFO] --- maven-checkstyle-plugin:2.9.1:check (verify-style) @ deltaspike-data-module-impl
---
[INFO] Starting audit...
Audit done.

[INFO] 
[INFO] --- maven-install-plugin:2.3.1:install (default-install) @ deltaspike-data-module-impl
---
[INFO] Installing <https://builds.apache.org/job/DeltaSpike%20Deploy/ws/deltaspike/modules/data/impl/target/deltaspike-data-module-impl-0.7-SNAPSHOT.jar>
to /home/jenkins/jenkins-slave/maven-repositories/0/org/apache/deltaspike/modules/deltaspike-data-module-impl/0.7-SNAPSHOT/deltaspike-data-module-impl-0.7-SNAPSHOT.jar
[INFO] Installing <https://builds.apache.org/job/DeltaSpike%20Deploy/ws/deltaspike/modules/data/impl/pom.xml>
to /home/jenkins/jenkins-slave/maven-repositories/0/org/apache/deltaspike/modules/deltaspike-data-module-impl/0.7-SNAPSHOT/deltaspike-data-module-impl-0.7-SNAPSHOT.pom
[INFO] Installing <https://builds.apache.org/job/DeltaSpike%20Deploy/ws/deltaspike/modules/data/impl/target/deltaspike-data-module-impl-0.7-SNAPSHOT-tests.jar>
to /home/jenkins/jenkins-slave/maven-repositories/0/org/apache/deltaspike/modules/deltaspike-data-module-impl/0.7-SNAPSHOT/deltaspike-data-module-impl-0.7-SNAPSHOT-tests.jar
[INFO] Installing <https://builds.apache.org/job/DeltaSpike%20Deploy/ws/deltaspike/modules/data/impl/target/deltaspike-data-module-impl-0.7-SNAPSHOT-sources.jar>
to /home/jenkins/jenkins-slave/maven-repositories/0/org/apache/deltaspike/modules/deltaspike-data-module-impl/0.7-SNAPSHOT/deltaspike-data-module-impl-0.7-SNAPSHOT-sources.jar
[INFO] 
[INFO] --- maven-bundle-plugin:2.3.7:install (default-install) @ deltaspike-data-module-impl
---
[INFO] Installing org/apache/deltaspike/modules/deltaspike-data-module-impl/0.7-SNAPSHOT/deltaspike-data-module-impl-0.7-SNAPSHOT.jar
[INFO] Writing OBR metadata
[INFO] 
[INFO] --- maven-deploy-plugin:2.7:deploy (default-deploy) @ deltaspike-data-module-impl ---
Downloading: https://repository.apache.org/content/repositories/snapshots/org/apache/deltaspike/modules/deltaspike-data-module-impl/0.7-SNAPSHOT/maven-metadata.xml
[WARNING] Could not transfer metadata org.apache.deltaspike.modules:deltaspike-data-module-impl:0.7-SNAPSHOT/maven-metadata.xml
from/to apache.snapshots.https (https://repository.apache.org/content/repositories/snapshots):
Failed to transfer file: https://repository.apache.org/content/repositories/snapshots/org/apache/deltaspike/modules/deltaspike-data-module-impl/0.7-SNAPSHOT/maven-metadata.xml.
Return code is: 502, ReasonPhrase:Proxy Error.
[INFO] ------------------------------------------------------------------------
[INFO] Reactor Summary:
[INFO] 
[INFO] Apache DeltaSpike ................................. SUCCESS [2:20.634s]
[INFO] Apache DeltaSpike CheckStyle-rules ................ SUCCESS [24.047s]
[INFO] Apache DeltaSpike Parent .......................... SUCCESS [25.334s]
[INFO] Apache DeltaSpike Test-Utils ...................... SUCCESS [26.772s]
[INFO] Apache DeltaSpike Code Parent ..................... SUCCESS [15.694s]
[INFO] Apache DeltaSpike Core ............................ SUCCESS [16.154s]
[INFO] Apache DeltaSpike Core-API ........................ SUCCESS [51.159s]
[INFO] Apache DeltaSpike Core-Implementation ............. SUCCESS [1:09.638s]
[INFO] Apache DeltaSpike ContainerControl parent ......... SUCCESS [11.401s]
[INFO] Apache DeltaSpike CDI ContainerControl API ........ SUCCESS [21.241s]
[INFO] Apache DeltaSpike CDI ContainerControl TCK ........ SUCCESS [3:00.010s]
[INFO] Apache DeltaSpike CDI OWB-ContainerControl ........ SUCCESS [20.351s]
[INFO] Apache DeltaSpike CDI Weld-ContainerControl ....... SUCCESS [18.442s]
[INFO] Apache DeltaSpike CDI OpenEJB-ContainerControl .... SUCCESS [1:06.759s]
[INFO] Apache DeltaSpike Modules ......................... SUCCESS [33.688s]
[INFO] Apache DeltaSpike Security-Module ................. SUCCESS [18.520s]
[INFO] Apache DeltaSpike Security-Module API ............. SUCCESS [17.439s]
[INFO] Apache DeltaSpike Security-Module Impl ............ SUCCESS [27.010s]
[INFO] Apache DeltaSpike JPA-Module ...................... SUCCESS [11.550s]
[INFO] Apache DeltaSpike JPA-Module API .................. SUCCESS [33.192s]
[INFO] Apache DeltaSpike JPA-Module Impl ................. SUCCESS [44.084s]
[INFO] Apache DeltaSpike Servlet-Module .................. SUCCESS [19.541s]
[INFO] Apache DeltaSpike Servlet-Module API .............. SUCCESS [16.403s]
[INFO] Apache DeltaSpike Servlet-Module Impl ............. SUCCESS [26.961s]
[INFO] Apache DeltaSpike JSF-Module ...................... SUCCESS [12.979s]
[INFO] Apache DeltaSpike JSF-Module API .................. SUCCESS [24.975s]
[INFO] Apache DeltaSpike JSF-Module Impl ................. SUCCESS [2:53.845s]
[INFO] Apache DeltaSpike Partial-Bean-Module ............. SUCCESS [1:21.685s]
[INFO] Apache DeltaSpike Partial-Bean-Module API ......... SUCCESS [1:16.099s]
[INFO] Apache DeltaSpike Partial-Bean-Module Impl ........ SUCCESS [47.438s]
[INFO] Apache DeltaSpike BeanValidation-Module ........... SUCCESS [28.734s]
[INFO] Apache DeltaSpike BeanValidation-Module API ....... SUCCESS [31.477s]
[INFO] Apache DeltaSpike BeanValidation-Module Impl ...... SUCCESS [21.051s]
[INFO] Apache DeltaSpike Data-Module ..................... SUCCESS [34.511s]
[INFO] Apache DeltaSpike Data-Module API ................. SUCCESS [25.998s]
[INFO] Apache DeltaSpike Data-Module Impl ................ FAILURE [1:36.019s]
[INFO] Apache DeltaSpike Scheduler-Module ................ SKIPPED
[INFO] Apache DeltaSpike Scheduler-Module API ............ SKIPPED
[INFO] Apache DeltaSpike Scheduler-Module Impl ........... SKIPPED
[INFO] Apache DeltaSpike Test-Control-Module ............. SKIPPED
[INFO] Apache DeltaSpike Test-Control-Module API ......... SKIPPED
[INFO] Apache DeltaSpike Test-Control-Module Impl ........ SKIPPED
[INFO] Apache DeltaSpike Examples ........................ SKIPPED
[INFO] Apache DeltaSpike Java-SE Examples ................ SKIPPED
[INFO] Apache DeltaSpike JSF Examples .................... SKIPPED
[INFO] Apache DeltaSpike JSF Playground .................. SKIPPED
[INFO] Apache DeltaSpike Distribution .................... SKIPPED
[INFO] Apache DeltaSpike Distribution Bill of Materials .. SKIPPED
[INFO] Apache DeltaSpike Full Distribution ............... SKIPPED
[INFO] ------------------------------------------------------------------------
[INFO] BUILD FAILURE
[INFO] ------------------------------------------------------------------------
[INFO] Total time: 28:15.654s
[INFO] Finished at: Sun Apr 20 14:50:48 UTC 2014
[INFO] Final Memory: 73M/440M
[INFO] ------------------------------------------------------------------------
Waiting for Jenkins to finish collecting data
[ERROR] Failed to execute goal org.apache.maven.plugins:maven-deploy-plugin:2.7:deploy (default-deploy)
on project deltaspike-data-module-impl: Failed to retrieve remote metadata org.apache.deltaspike.modules:deltaspike-data-module-impl:0.7-SNAPSHOT/maven-metadata.xml:
Could not transfer metadata org.apache.deltaspike.modules:deltaspike-data-module-impl:0.7-SNAPSHOT/maven-metadata.xml
from/to apache.snapshots.https (https://repository.apache.org/content/repositories/snapshots):
Failed to transfer file: https://repository.apache.org/content/repositories/snapshots/org/apache/deltaspike/modules/deltaspike-data-module-impl/0.7-SNAPSHOT/maven-metadata.xml.
Return code is: 502, ReasonPhrase:Proxy Error. -> [Help 1]
[ERROR] 
[ERROR] To see the full stack trace of the errors, re-run Maven with the -e switch.
[ERROR] Re-run Maven using the -X switch to enable full debug logging.
[ERROR] 
[ERROR] For more information about the errors and possible solutions, please read the following
articles:
[ERROR] [Help 1] http://cwiki.apache.org/confluence/display/MAVEN/MojoExecutionException
[ERROR] 
[JENKINS] Archiving <https://builds.apache.org/job/DeltaSpike%20Deploy/ws/deltaspike/cdictrl/tck/pom.xml>
to org.apache.deltaspike.test/deltaspike-cdictrl-tck/0.7-SNAPSHOT/deltaspike-cdictrl-tck-0.7-SNAPSHOT.pom
[JENKINS] Archiving <https://builds.apache.org/job/DeltaSpike%20Deploy/ws/deltaspike/cdictrl/tck/target/deltaspike-cdictrl-tck-0.7-SNAPSHOT.jar>
to org.apache.deltaspike.test/deltaspike-cdictrl-tck/0.7-20140420.143249-53/deltaspike-cdictrl-tck-0.7-20140420.143249-53.jar
[JENKINS] Archiving <https://builds.apache.org/job/DeltaSpike%20Deploy/ws/deltaspike/cdictrl/tck/target/deltaspike-cdictrl-tck-0.7-SNAPSHOT-sources.jar>
to org.apache.deltaspike.test/deltaspike-cdictrl-tck/0.7-20140420.143249-53/deltaspike-cdictrl-tck-0.7-20140420.143249-53-sources.jar
[ERROR] After correcting the problems, you can resume the build with the command
[ERROR]   mvn <goals> -rf :deltaspike-data-module-impl
[JENKINS] Archiving <https://builds.apache.org/job/DeltaSpike%20Deploy/ws/deltaspike/dist/pom.xml>
to org.apache.deltaspike.distribution/distributions-project/0.6-SNAPSHOT/distributions-project-0.6-SNAPSHOT.pom
[JENKINS] Archiving <https://builds.apache.org/job/DeltaSpike%20Deploy/ws/deltaspike/modules/jsf/impl/pom.xml>
to org.apache.deltaspike.modules/deltaspike-jsf-module-impl/0.7-SNAPSHOT/deltaspike-jsf-module-impl-0.7-SNAPSHOT.pom
[JENKINS] Archiving <https://builds.apache.org/job/DeltaSpike%20Deploy/ws/deltaspike/modules/jsf/impl/target/deltaspike-jsf-module-impl-0.7-SNAPSHOT.jar>
to org.apache.deltaspike.modules/deltaspike-jsf-module-impl/0.7-20140420.144247-53/deltaspike-jsf-module-impl-0.7-20140420.144247-53.jar
[JENKINS] Archiving <https://builds.apache.org/job/DeltaSpike%20Deploy/ws/deltaspike/modules/jsf/impl/target/deltaspike-jsf-module-impl-0.7-SNAPSHOT-tests.jar>
to org.apache.deltaspike.modules/deltaspike-jsf-module-impl/0.7-20140420.144247-53/deltaspike-jsf-module-impl-0.7-20140420.144247-53-tests.jar
[JENKINS] Archiving <https://builds.apache.org/job/DeltaSpike%20Deploy/ws/deltaspike/modules/jsf/impl/target/deltaspike-jsf-module-impl-0.7-SNAPSHOT-sources.jar>
to org.apache.deltaspike.modules/deltaspike-jsf-module-impl/0.7-20140420.144247-53/deltaspike-jsf-module-impl-0.7-20140420.144247-53-sources.jar
[JENKINS] Archiving <https://builds.apache.org/job/DeltaSpike%20Deploy/ws/deltaspike/modules/data/impl/pom.xml>
to org.apache.deltaspike.modules/deltaspike-data-module-impl/0.7-SNAPSHOT/deltaspike-data-module-impl-0.7-SNAPSHOT.pom
[JENKINS] Archiving <https://builds.apache.org/job/DeltaSpike%20Deploy/ws/deltaspike/modules/data/impl/target/deltaspike-data-module-impl-0.7-SNAPSHOT.jar>
to org.apache.deltaspike.modules/deltaspike-data-module-impl/0.7-SNAPSHOT/deltaspike-data-module-impl-0.7-SNAPSHOT.jar
[JENKINS] Archiving <https://builds.apache.org/job/DeltaSpike%20Deploy/ws/deltaspike/modules/data/impl/target/deltaspike-data-module-impl-0.7-SNAPSHOT-tests.jar>
to org.apache.deltaspike.modules/deltaspike-data-module-impl/0.7-SNAPSHOT/deltaspike-data-module-impl-0.7-SNAPSHOT-tests.jar
[JENKINS] Archiving <https://builds.apache.org/job/DeltaSpike%20Deploy/ws/deltaspike/modules/data/impl/target/deltaspike-data-module-impl-0.7-SNAPSHOT-sources.jar>
to org.apache.deltaspike.modules/deltaspike-data-module-impl/0.7-SNAPSHOT/deltaspike-data-module-impl-0.7-SNAPSHOT-sources.jar
[JENKINS] Archiving <https://builds.apache.org/job/DeltaSpike%20Deploy/ws/deltaspike/modules/jsf/pom.xml>
to org.apache.deltaspike.modules/jsf-module-project/0.7-SNAPSHOT/jsf-module-project-0.7-SNAPSHOT.pom
[JENKINS] Archiving <https://builds.apache.org/job/DeltaSpike%20Deploy/ws/deltaspike/modules/jsf/target/jsf-module-project-0.7-SNAPSHOT-tests.jar>
to org.apache.deltaspike.modules/jsf-module-project/0.7-20140420.143926-53/jsf-module-project-0.7-20140420.143926-53-tests.jar
[JENKINS] Archiving <https://builds.apache.org/job/DeltaSpike%20Deploy/ws/deltaspike/modules/bean-validation/impl/pom.xml>
to org.apache.deltaspike.modules/deltaspike-bean-validation-module-impl/0.7-SNAPSHOT/deltaspike-bean-validation-module-impl-0.7-SNAPSHOT.pom
[JENKINS] Archiving <https://builds.apache.org/job/DeltaSpike%20Deploy/ws/deltaspike/modules/bean-validation/impl/target/deltaspike-bean-validation-module-impl-0.7-SNAPSHOT.jar>
to org.apache.deltaspike.modules/deltaspike-bean-validation-module-impl/0.7-20140420.144757-53/deltaspike-bean-validation-module-impl-0.7-20140420.144757-53.jar
[JENKINS] Archiving <https://builds.apache.org/job/DeltaSpike%20Deploy/ws/deltaspike/modules/bean-validation/impl/target/deltaspike-bean-validation-module-impl-0.7-SNAPSHOT-tests.jar>
to org.apache.deltaspike.modules/deltaspike-bean-validation-module-impl/0.7-20140420.144757-53/deltaspike-bean-validation-module-impl-0.7-20140420.144757-53-tests.jar
[JENKINS] Archiving <https://builds.apache.org/job/DeltaSpike%20Deploy/ws/deltaspike/modules/bean-validation/impl/target/deltaspike-bean-validation-module-impl-0.7-SNAPSHOT-sources.jar>
to org.apache.deltaspike.modules/deltaspike-bean-validation-module-impl/0.7-20140420.144757-53/deltaspike-bean-validation-module-impl-0.7-20140420.144757-53-sources.jar
[JENKINS] Archiving <https://builds.apache.org/job/DeltaSpike%20Deploy/ws/deltaspike/cdictrl/pom.xml>
to org.apache.deltaspike.cdictrl/cdictrl-project/0.7-SNAPSHOT/cdictrl-project-0.7-SNAPSHOT.pom
[JENKINS] Archiving <https://builds.apache.org/job/DeltaSpike%20Deploy/ws/deltaspike/modules/partial-bean/api/pom.xml>
to org.apache.deltaspike.modules/deltaspike-partial-bean-module-api/0.7-SNAPSHOT/deltaspike-partial-bean-module-api-0.7-SNAPSHOT.pom
[JENKINS] Archiving <https://builds.apache.org/job/DeltaSpike%20Deploy/ws/deltaspike/modules/partial-bean/api/target/deltaspike-partial-bean-module-api-0.7-SNAPSHOT.jar>
to org.apache.deltaspike.modules/deltaspike-partial-bean-module-api/0.7-20140420.144530-53/deltaspike-partial-bean-module-api-0.7-20140420.144530-53.jar
[JENKINS] Archiving <https://builds.apache.org/job/DeltaSpike%20Deploy/ws/deltaspike/modules/partial-bean/api/target/deltaspike-partial-bean-module-api-0.7-SNAPSHOT-tests.jar>
to org.apache.deltaspike.modules/deltaspike-partial-bean-module-api/0.7-20140420.144530-53/deltaspike-partial-bean-module-api-0.7-20140420.144530-53-tests.jar
[JENKINS] Archiving <https://builds.apache.org/job/DeltaSpike%20Deploy/ws/deltaspike/modules/partial-bean/api/target/deltaspike-partial-bean-module-api-0.7-SNAPSHOT-sources.jar>
to org.apache.deltaspike.modules/deltaspike-partial-bean-module-api/0.7-20140420.144530-53/deltaspike-partial-bean-module-api-0.7-20140420.144530-53-sources.jar
[JENKINS] Archiving <https://builds.apache.org/job/DeltaSpike%20Deploy/ws/deltaspike/cdictrl/api/pom.xml>
to org.apache.deltaspike.cdictrl/deltaspike-cdictrl-api/0.7-SNAPSHOT/deltaspike-cdictrl-api-0.7-SNAPSHOT.pom
[JENKINS] Archiving <https://builds.apache.org/job/DeltaSpike%20Deploy/ws/deltaspike/cdictrl/api/target/deltaspike-cdictrl-api-0.7-SNAPSHOT.jar>
to org.apache.deltaspike.cdictrl/deltaspike-cdictrl-api/0.7-20140420.142947-53/deltaspike-cdictrl-api-0.7-20140420.142947-53.jar
[JENKINS] Archiving <https://builds.apache.org/job/DeltaSpike%20Deploy/ws/deltaspike/cdictrl/api/target/deltaspike-cdictrl-api-0.7-SNAPSHOT-sources.jar>
to org.apache.deltaspike.cdictrl/deltaspike-cdictrl-api/0.7-20140420.142947-53/deltaspike-cdictrl-api-0.7-20140420.142947-53-sources.jar
[JENKINS] Archiving <https://builds.apache.org/job/DeltaSpike%20Deploy/ws/deltaspike/modules/security/api/pom.xml>
to org.apache.deltaspike.modules/deltaspike-security-module-api/0.7-SNAPSHOT/deltaspike-security-module-api-0.7-SNAPSHOT.pom
[JENKINS] Archiving <https://builds.apache.org/job/DeltaSpike%20Deploy/ws/deltaspike/modules/security/api/target/deltaspike-security-module-api-0.7-SNAPSHOT.jar>
to org.apache.deltaspike.modules/deltaspike-security-module-api/0.7-20140420.143555-53/deltaspike-security-module-api-0.7-20140420.143555-53.jar
[JENKINS] Archiving <https://builds.apache.org/job/DeltaSpike%20Deploy/ws/deltaspike/modules/security/api/target/deltaspike-security-module-api-0.7-SNAPSHOT-tests.jar>
to org.apache.deltaspike.modules/deltaspike-security-module-api/0.7-20140420.143555-53/deltaspike-security-module-api-0.7-20140420.143555-53-tests.jar
[JENKINS] Archiving <https://builds.apache.org/job/DeltaSpike%20Deploy/ws/deltaspike/modules/security/api/target/deltaspike-security-module-api-0.7-SNAPSHOT-sources.jar>
to org.apache.deltaspike.modules/deltaspike-security-module-api/0.7-20140420.143555-53/deltaspike-security-module-api-0.7-20140420.143555-53-sources.jar
[JENKINS] Archiving <https://builds.apache.org/job/DeltaSpike%20Deploy/ws/deltaspike/modules/data/api/pom.xml>
to org.apache.deltaspike.modules/deltaspike-data-module-api/0.7-SNAPSHOT/deltaspike-data-module-api-0.7-SNAPSHOT.pom
[JENKINS] Archiving <https://builds.apache.org/job/DeltaSpike%20Deploy/ws/deltaspike/modules/data/api/target/deltaspike-data-module-api-0.7-SNAPSHOT.jar>
to org.apache.deltaspike.modules/deltaspike-data-module-api/0.7-20140420.144859-53/deltaspike-data-module-api-0.7-20140420.144859-53.jar
[JENKINS] Archiving <https://builds.apache.org/job/DeltaSpike%20Deploy/ws/deltaspike/modules/data/api/target/deltaspike-data-module-api-0.7-SNAPSHOT-tests.jar>
to org.apache.deltaspike.modules/deltaspike-data-module-api/0.7-20140420.144859-53/deltaspike-data-module-api-0.7-20140420.144859-53-tests.jar
[JENKINS] Archiving <https://builds.apache.org/job/DeltaSpike%20Deploy/ws/deltaspike/modules/data/api/target/deltaspike-data-module-api-0.7-SNAPSHOT-sources.jar>
to org.apache.deltaspike.modules/deltaspike-data-module-api/0.7-20140420.144859-53/deltaspike-data-module-api-0.7-20140420.144859-53-sources.jar
[JENKINS] Archiving <https://builds.apache.org/job/DeltaSpike%20Deploy/ws/deltaspike/examples/jse-examples/pom.xml>
to org.apache.deltaspike.examples/deltaspike-jse-example/0.7-SNAPSHOT/deltaspike-jse-example-0.7-SNAPSHOT.pom
[JENKINS] Archiving <https://builds.apache.org/job/DeltaSpike%20Deploy/ws/deltaspike/examples/pom.xml>
to org.apache.deltaspike.examples/examples-project/0.7-SNAPSHOT/examples-project-0.7-SNAPSHOT.pom
[JENKINS] Archiving <https://builds.apache.org/job/DeltaSpike%20Deploy/ws/deltaspike/modules/jpa/pom.xml>
to org.apache.deltaspike.modules/jpa-module-project/0.7-SNAPSHOT/jpa-module-project-0.7-SNAPSHOT.pom
[JENKINS] Archiving <https://builds.apache.org/job/DeltaSpike%20Deploy/ws/deltaspike/modules/jpa/target/jpa-module-project-0.7-SNAPSHOT-tests.jar>
to org.apache.deltaspike.modules/jpa-module-project/0.7-20140420.143641-53/jpa-module-project-0.7-20140420.143641-53-tests.jar
[JENKINS] Archiving <https://builds.apache.org/job/DeltaSpike%20Deploy/ws/deltaspike/modules/servlet/pom.xml>
to org.apache.deltaspike.modules/servlet-module-project/0.7-SNAPSHOT/servlet-module-project-0.7-SNAPSHOT.pom
[JENKINS] Archiving <https://builds.apache.org/job/DeltaSpike%20Deploy/ws/deltaspike/modules/servlet/target/servlet-module-project-0.7-SNAPSHOT-tests.jar>
to org.apache.deltaspike.modules/servlet-module-project/0.7-20140420.143824-53/servlet-module-project-0.7-20140420.143824-53-tests.jar
[JENKINS] Archiving <https://builds.apache.org/job/DeltaSpike%20Deploy/ws/deltaspike/pom.xml>
to org.apache.deltaspike/deltaspike-project/0.7-SNAPSHOT/deltaspike-project-0.7-SNAPSHOT.pom
[JENKINS] Archiving <https://builds.apache.org/job/DeltaSpike%20Deploy/ws/deltaspike/core/impl/pom.xml>
to org.apache.deltaspike.core/deltaspike-core-impl/0.7-SNAPSHOT/deltaspike-core-impl-0.7-SNAPSHOT.pom
[JENKINS] Archiving <https://builds.apache.org/job/DeltaSpike%20Deploy/ws/deltaspike/core/impl/target/deltaspike-core-impl-0.7-SNAPSHOT.jar>
to org.apache.deltaspike.core/deltaspike-core-impl/0.7-20140420.142910-53/deltaspike-core-impl-0.7-20140420.142910-53.jar
[JENKINS] Archiving <https://builds.apache.org/job/DeltaSpike%20Deploy/ws/deltaspike/core/impl/target/deltaspike-core-impl-0.7-SNAPSHOT-tests.jar>
to org.apache.deltaspike.core/deltaspike-core-impl/0.7-20140420.142910-53/deltaspike-core-impl-0.7-20140420.142910-53-tests.jar
[JENKINS] Archiving <https://builds.apache.org/job/DeltaSpike%20Deploy/ws/deltaspike/core/impl/target/deltaspike-core-impl-0.7-SNAPSHOT-sources.jar>
to org.apache.deltaspike.core/deltaspike-core-impl/0.7-20140420.142910-53/deltaspike-core-impl-0.7-20140420.142910-53-sources.jar
[JENKINS] Archiving <https://builds.apache.org/job/DeltaSpike%20Deploy/ws/deltaspike/modules/partial-bean/pom.xml>
to org.apache.deltaspike.modules/partial-bean-module-project/0.7-SNAPSHOT/partial-bean-module-project-0.7-SNAPSHOT.pom
[JENKINS] Archiving <https://builds.apache.org/job/DeltaSpike%20Deploy/ws/deltaspike/modules/partial-bean/target/partial-bean-module-project-0.7-SNAPSHOT-tests.jar>
to org.apache.deltaspike.modules/partial-bean-module-project/0.7-20140420.144308-53/partial-bean-module-project-0.7-20140420.144308-53-tests.jar
[JENKINS] Archiving <https://builds.apache.org/job/DeltaSpike%20Deploy/ws/deltaspike/cdictrl/impl-weld/pom.xml>
to org.apache.deltaspike.cdictrl/deltaspike-cdictrl-weld/0.7-SNAPSHOT/deltaspike-cdictrl-weld-0.7-SNAPSHOT.pom
[JENKINS] Archiving <https://builds.apache.org/job/DeltaSpike%20Deploy/ws/deltaspike/cdictrl/impl-weld/target/deltaspike-cdictrl-weld-0.7-SNAPSHOT.jar>
to org.apache.deltaspike.cdictrl/deltaspike-cdictrl-weld/0.7-20140420.143333-53/deltaspike-cdictrl-weld-0.7-20140420.143333-53.jar
[JENKINS] Archiving <https://builds.apache.org/job/DeltaSpike%20Deploy/ws/deltaspike/cdictrl/impl-weld/target/deltaspike-cdictrl-weld-0.7-SNAPSHOT-sources.jar>
to org.apache.deltaspike.cdictrl/deltaspike-cdictrl-weld/0.7-20140420.143333-53/deltaspike-cdictrl-weld-0.7-20140420.143333-53-sources.jar
[JENKINS] Archiving <https://builds.apache.org/job/DeltaSpike%20Deploy/ws/deltaspike/cdictrl/impl-owb/pom.xml>
to org.apache.deltaspike.cdictrl/deltaspike-cdictrl-owb/0.7-SNAPSHOT/deltaspike-cdictrl-owb-0.7-SNAPSHOT.pom
[JENKINS] Archiving <https://builds.apache.org/job/DeltaSpike%20Deploy/ws/deltaspike/cdictrl/impl-owb/target/deltaspike-cdictrl-owb-0.7-SNAPSHOT.jar>
to org.apache.deltaspike.cdictrl/deltaspike-cdictrl-owb/0.7-20140420.143312-53/deltaspike-cdictrl-owb-0.7-20140420.143312-53.jar
[JENKINS] Archiving <https://builds.apache.org/job/DeltaSpike%20Deploy/ws/deltaspike/cdictrl/impl-owb/target/deltaspike-cdictrl-owb-0.7-SNAPSHOT-sources.jar>
to org.apache.deltaspike.cdictrl/deltaspike-cdictrl-owb/0.7-20140420.143312-53/deltaspike-cdictrl-owb-0.7-20140420.143312-53-sources.jar
[JENKINS] Archiving <https://builds.apache.org/job/DeltaSpike%20Deploy/ws/deltaspike/parent/pom.xml>
to org.apache.deltaspike/parent/0.7-SNAPSHOT/parent-0.7-SNAPSHOT.pom
[JENKINS] Archiving <https://builds.apache.org/job/DeltaSpike%20Deploy/ws/deltaspike/modules/security/impl/pom.xml>
to org.apache.deltaspike.modules/deltaspike-security-module-impl/0.7-SNAPSHOT/deltaspike-security-module-impl-0.7-SNAPSHOT.pom
[JENKINS] Archiving <https://builds.apache.org/job/DeltaSpike%20Deploy/ws/deltaspike/modules/security/impl/target/deltaspike-security-module-impl-0.7-SNAPSHOT.jar>
to org.apache.deltaspike.modules/deltaspike-security-module-impl/0.7-20140420.143626-53/deltaspike-security-module-impl-0.7-20140420.143626-53.jar
[JENKINS] Archiving <https://builds.apache.org/job/DeltaSpike%20Deploy/ws/deltaspike/modules/security/impl/target/deltaspike-security-module-impl-0.7-SNAPSHOT-tests.jar>
to org.apache.deltaspike.modules/deltaspike-security-module-impl/0.7-20140420.143626-53/deltaspike-security-module-impl-0.7-20140420.143626-53-tests.jar
[JENKINS] Archiving <https://builds.apache.org/job/DeltaSpike%20Deploy/ws/deltaspike/modules/security/impl/target/deltaspike-security-module-impl-0.7-SNAPSHOT-sources.jar>
to org.apache.deltaspike.modules/deltaspike-security-module-impl/0.7-20140420.143626-53/deltaspike-security-module-impl-0.7-20140420.143626-53-sources.jar
[JENKINS] Archiving <https://builds.apache.org/job/DeltaSpike%20Deploy/ws/deltaspike/modules/jpa/api/pom.xml>
to org.apache.deltaspike.modules/deltaspike-jpa-module-api/0.7-SNAPSHOT/deltaspike-jpa-module-api-0.7-SNAPSHOT.pom
[JENKINS] Archiving <https://builds.apache.org/job/DeltaSpike%20Deploy/ws/deltaspike/modules/jpa/api/target/deltaspike-jpa-module-api-0.7-SNAPSHOT.jar>
to org.apache.deltaspike.modules/deltaspike-jpa-module-api/0.7-20140420.143701-53/deltaspike-jpa-module-api-0.7-20140420.143701-53.jar
[JENKINS] Archiving <https://builds.apache.org/job/DeltaSpike%20Deploy/ws/deltaspike/modules/jpa/api/target/deltaspike-jpa-module-api-0.7-SNAPSHOT-tests.jar>
to org.apache.deltaspike.modules/deltaspike-jpa-module-api/0.7-20140420.143701-53/deltaspike-jpa-module-api-0.7-20140420.143701-53-tests.jar
[JENKINS] Archiving <https://builds.apache.org/job/DeltaSpike%20Deploy/ws/deltaspike/modules/jpa/api/target/deltaspike-jpa-module-api-0.7-SNAPSHOT-sources.jar>
to org.apache.deltaspike.modules/deltaspike-jpa-module-api/0.7-20140420.143701-53/deltaspike-jpa-module-api-0.7-20140420.143701-53-sources.jar
[JENKINS] Archiving <https://builds.apache.org/job/DeltaSpike%20Deploy/ws/deltaspike/dist/bom/pom.xml>
to org.apache.deltaspike.distribution/distributions-bom/0.6-SNAPSHOT/distributions-bom-0.6-SNAPSHOT.pom
[JENKINS] Archiving <https://builds.apache.org/job/DeltaSpike%20Deploy/ws/deltaspike/modules/bean-validation/pom.xml>
to org.apache.deltaspike.modules/bean-validation-module-project/0.7-SNAPSHOT/bean-validation-module-project-0.7-SNAPSHOT.pom
[JENKINS] Archiving <https://builds.apache.org/job/DeltaSpike%20Deploy/ws/deltaspike/modules/bean-validation/target/bean-validation-module-project-0.7-SNAPSHOT-tests.jar>
to org.apache.deltaspike.modules/bean-validation-module-project/0.7-20140420.144645-53/bean-validation-module-project-0.7-20140420.144645-53-tests.jar
[JENKINS] Archiving <https://builds.apache.org/job/DeltaSpike%20Deploy/ws/deltaspike/parent/code/pom.xml>
to org.apache.deltaspike/parent-code/0.7-SNAPSHOT/parent-code-0.7-SNAPSHOT.pom
[JENKINS] Archiving <https://builds.apache.org/job/DeltaSpike%20Deploy/ws/deltaspike/parent/code/target/parent-code-0.7-SNAPSHOT-tests.jar>
to org.apache.deltaspike/parent-code/0.7-20140420.142651-53/parent-code-0.7-20140420.142651-53-tests.jar
[JENKINS] Archiving <https://builds.apache.org/job/DeltaSpike%20Deploy/ws/deltaspike/modules/jpa/impl/pom.xml>
to org.apache.deltaspike.modules/deltaspike-jpa-module-impl/0.7-SNAPSHOT/deltaspike-jpa-module-impl-0.7-SNAPSHOT.pom
[JENKINS] Archiving <https://builds.apache.org/job/DeltaSpike%20Deploy/ws/deltaspike/modules/jpa/impl/target/deltaspike-jpa-module-impl-0.7-SNAPSHOT.jar>
to org.apache.deltaspike.modules/deltaspike-jpa-module-impl/0.7-20140420.143759-53/deltaspike-jpa-module-impl-0.7-20140420.143759-53.jar
[JENKINS] Archiving <https://builds.apache.org/job/DeltaSpike%20Deploy/ws/deltaspike/modules/jpa/impl/target/deltaspike-jpa-module-impl-0.7-SNAPSHOT-tests.jar>
to org.apache.deltaspike.modules/deltaspike-jpa-module-impl/0.7-20140420.143759-53/deltaspike-jpa-module-impl-0.7-20140420.143759-53-tests.jar
[JENKINS] Archiving <https://builds.apache.org/job/DeltaSpike%20Deploy/ws/deltaspike/modules/jpa/impl/target/deltaspike-jpa-module-impl-0.7-SNAPSHOT-sources.jar>
to org.apache.deltaspike.modules/deltaspike-jpa-module-impl/0.7-20140420.143759-53/deltaspike-jpa-module-impl-0.7-20140420.143759-53-sources.jar
[JENKINS] Archiving <https://builds.apache.org/job/DeltaSpike%20Deploy/ws/deltaspike/modules/partial-bean/impl/pom.xml>
to org.apache.deltaspike.modules/deltaspike-partial-bean-module-impl/0.7-SNAPSHOT/deltaspike-partial-bean-module-impl-0.7-SNAPSHOT.pom
[JENKINS] Archiving <https://builds.apache.org/job/DeltaSpike%20Deploy/ws/deltaspike/modules/partial-bean/impl/target/deltaspike-partial-bean-module-impl-0.7-SNAPSHOT.jar>
to org.apache.deltaspike.modules/deltaspike-partial-bean-module-impl/0.7-20140420.144624-53/deltaspike-partial-bean-module-impl-0.7-20140420.144624-53.jar
[JENKINS] Archiving <https://builds.apache.org/job/DeltaSpike%20Deploy/ws/deltaspike/modules/partial-bean/impl/target/deltaspike-partial-bean-module-impl-0.7-SNAPSHOT-tests.jar>
to org.apache.deltaspike.modules/deltaspike-partial-bean-module-impl/0.7-20140420.144624-53/deltaspike-partial-bean-module-impl-0.7-20140420.144624-53-tests.jar
[JENKINS] Archiving <https://builds.apache.org/job/DeltaSpike%20Deploy/ws/deltaspike/modules/partial-bean/impl/target/deltaspike-partial-bean-module-impl-0.7-SNAPSHOT-sources.jar>
to org.apache.deltaspike.modules/deltaspike-partial-bean-module-impl/0.7-20140420.144624-53/deltaspike-partial-bean-module-impl-0.7-20140420.144624-53-sources.jar
[JENKINS] Archiving <https://builds.apache.org/job/DeltaSpike%20Deploy/ws/deltaspike/modules/scheduler/api/pom.xml>
to org.apache.deltaspike.modules/deltaspike-scheduler-module-api/0.7-SNAPSHOT/deltaspike-scheduler-module-api-0.7-SNAPSHOT.pom
[JENKINS] Archiving <https://builds.apache.org/job/DeltaSpike%20Deploy/ws/deltaspike/modules/test-control/pom.xml>
to org.apache.deltaspike.modules/test-control-module-project/0.7-SNAPSHOT/test-control-module-project-0.7-SNAPSHOT.pom
[JENKINS] Archiving <https://builds.apache.org/job/DeltaSpike%20Deploy/ws/deltaspike/modules/scheduler/impl/pom.xml>
to org.apache.deltaspike.modules/deltaspike-scheduler-module-impl/0.7-SNAPSHOT/deltaspike-scheduler-module-impl-0.7-SNAPSHOT.pom
[JENKINS] Archiving <https://builds.apache.org/job/DeltaSpike%20Deploy/ws/deltaspike/examples/jsf-playground/pom.xml>
to org.apache.deltaspike.examples/deltaspike-jsf-playground/0.7-SNAPSHOT/deltaspike-jsf-playground-0.7-SNAPSHOT.pom
[JENKINS] Archiving <https://builds.apache.org/job/DeltaSpike%20Deploy/ws/deltaspike/modules/test-control/impl/pom.xml>
to org.apache.deltaspike.modules/deltaspike-test-control-module-impl/0.7-SNAPSHOT/deltaspike-test-control-module-impl-0.7-SNAPSHOT.pom
[JENKINS] Archiving <https://builds.apache.org/job/DeltaSpike%20Deploy/ws/deltaspike/checkstyle-rules/pom.xml>
to org.apache.deltaspike/checkstyle-rules/0.7-SNAPSHOT/checkstyle-rules-0.7-SNAPSHOT.pom
[JENKINS] Archiving <https://builds.apache.org/job/DeltaSpike%20Deploy/ws/deltaspike/checkstyle-rules/target/checkstyle-rules-0.7-SNAPSHOT.jar>
to org.apache.deltaspike/checkstyle-rules/0.7-20140420.142539-53/checkstyle-rules-0.7-20140420.142539-53.jar
[JENKINS] Archiving <https://builds.apache.org/job/DeltaSpike%20Deploy/ws/deltaspike/checkstyle-rules/target/checkstyle-rules-0.7-SNAPSHOT-sources.jar>
to org.apache.deltaspike/checkstyle-rules/0.7-20140420.142539-53/checkstyle-rules-0.7-20140420.142539-53-sources.jar
[JENKINS] Archiving <https://builds.apache.org/job/DeltaSpike%20Deploy/ws/deltaspike/modules/servlet/api/pom.xml>
to org.apache.deltaspike.modules/deltaspike-servlet-module-api/0.7-SNAPSHOT/deltaspike-servlet-module-api-0.7-SNAPSHOT.pom
[JENKINS] Archiving <https://builds.apache.org/job/DeltaSpike%20Deploy/ws/deltaspike/modules/servlet/api/target/deltaspike-servlet-module-api-0.7-SNAPSHOT.jar>
to org.apache.deltaspike.modules/deltaspike-servlet-module-api/0.7-20140420.143841-53/deltaspike-servlet-module-api-0.7-20140420.143841-53.jar
[JENKINS] Archiving <https://builds.apache.org/job/DeltaSpike%20Deploy/ws/deltaspike/modules/servlet/api/target/deltaspike-servlet-module-api-0.7-SNAPSHOT-tests.jar>
to org.apache.deltaspike.modules/deltaspike-servlet-module-api/0.7-20140420.143841-53/deltaspike-servlet-module-api-0.7-20140420.143841-53-tests.jar
[JENKINS] Archiving <https://builds.apache.org/job/DeltaSpike%20Deploy/ws/deltaspike/modules/servlet/api/target/deltaspike-servlet-module-api-0.7-SNAPSHOT-sources.jar>
to org.apache.deltaspike.modules/deltaspike-servlet-module-api/0.7-20140420.143841-53/deltaspike-servlet-module-api-0.7-20140420.143841-53-sources.jar
[JENKINS] Archiving <https://builds.apache.org/job/DeltaSpike%20Deploy/ws/deltaspike/core/api/pom.xml>
to org.apache.deltaspike.core/deltaspike-core-api/0.7-SNAPSHOT/deltaspike-core-api-0.7-SNAPSHOT.pom
[JENKINS] Archiving <https://builds.apache.org/job/DeltaSpike%20Deploy/ws/deltaspike/core/api/target/deltaspike-core-api-0.7-SNAPSHOT.jar>
to org.apache.deltaspike.core/deltaspike-core-api/0.7-20140420.142758-53/deltaspike-core-api-0.7-20140420.142758-53.jar
[JENKINS] Archiving <https://builds.apache.org/job/DeltaSpike%20Deploy/ws/deltaspike/core/api/target/deltaspike-core-api-0.7-SNAPSHOT-tests.jar>
to org.apache.deltaspike.core/deltaspike-core-api/0.7-20140420.142758-53/deltaspike-core-api-0.7-20140420.142758-53-tests.jar
[JENKINS] Archiving <https://builds.apache.org/job/DeltaSpike%20Deploy/ws/deltaspike/core/api/target/deltaspike-core-api-0.7-SNAPSHOT-sources.jar>
to org.apache.deltaspike.core/deltaspike-core-api/0.7-20140420.142758-53/deltaspike-core-api-0.7-20140420.142758-53-sources.jar
[JENKINS] Archiving <https://builds.apache.org/job/DeltaSpike%20Deploy/ws/deltaspike/modules/bean-validation/api/pom.xml>
to org.apache.deltaspike.modules/deltaspike-bean-validation-module-api/0.7-SNAPSHOT/deltaspike-bean-validation-module-api-0.7-SNAPSHOT.pom
[JENKINS] Archiving <https://builds.apache.org/job/DeltaSpike%20Deploy/ws/deltaspike/modules/bean-validation/api/target/deltaspike-bean-validation-module-api-0.7-SNAPSHOT.jar>
to org.apache.deltaspike.modules/deltaspike-bean-validation-module-api/0.7-20140420.144733-53/deltaspike-bean-validation-module-api-0.7-20140420.144733-53.jar
[JENKINS] Archiving <https://builds.apache.org/job/DeltaSpike%20Deploy/ws/deltaspike/modules/bean-validation/api/target/deltaspike-bean-validation-module-api-0.7-SNAPSHOT-tests.jar>
to org.apache.deltaspike.modules/deltaspike-bean-validation-module-api/0.7-20140420.144733-53/deltaspike-bean-validation-module-api-0.7-20140420.144733-53-tests.jar
[JENKINS] Archiving <https://builds.apache.org/job/DeltaSpike%20Deploy/ws/deltaspike/modules/bean-validation/api/target/deltaspike-bean-validation-module-api-0.7-SNAPSHOT-sources.jar>
to org.apache.deltaspike.modules/deltaspike-bean-validation-module-api/0.7-20140420.144733-53/deltaspike-bean-validation-module-api-0.7-20140420.144733-53-sources.jar
[JENKINS] Archiving <https://builds.apache.org/job/DeltaSpike%20Deploy/ws/deltaspike/modules/pom.xml>
to org.apache.deltaspike.modules/modules-project/0.7-SNAPSHOT/modules-project-0.7-SNAPSHOT.pom
[JENKINS] Archiving <https://builds.apache.org/job/DeltaSpike%20Deploy/ws/deltaspike/modules/target/modules-project-0.7-SNAPSHOT-tests.jar>
to org.apache.deltaspike.modules/modules-project/0.7-20140420.143517-53/modules-project-0.7-20140420.143517-53-tests.jar
[JENKINS] Archiving <https://builds.apache.org/job/DeltaSpike%20Deploy/ws/deltaspike/modules/scheduler/pom.xml>
to org.apache.deltaspike.modules/scheduler-module-project/0.7-SNAPSHOT/scheduler-module-project-0.7-SNAPSHOT.pom
[JENKINS] Archiving <https://builds.apache.org/job/DeltaSpike%20Deploy/ws/deltaspike/test-utils/pom.xml>
to org.apache.deltaspike.test/test-utils/0.7-SNAPSHOT/test-utils-0.7-SNAPSHOT.pom
[JENKINS] Archiving <https://builds.apache.org/job/DeltaSpike%20Deploy/ws/deltaspike/test-utils/target/test-utils-0.7-SNAPSHOT.jar>
to org.apache.deltaspike.test/test-utils/0.7-20140420.142631-53/test-utils-0.7-20140420.142631-53.jar
[JENKINS] Archiving <https://builds.apache.org/job/DeltaSpike%20Deploy/ws/deltaspike/test-utils/target/test-utils-0.7-SNAPSHOT-sources.jar>
to org.apache.deltaspike.test/test-utils/0.7-20140420.142631-53/test-utils-0.7-20140420.142631-53-sources.jar
[JENKINS] Archiving <https://builds.apache.org/job/DeltaSpike%20Deploy/ws/deltaspike/modules/security/pom.xml>
to org.apache.deltaspike.modules/security-module-project/0.7-SNAPSHOT/security-module-project-0.7-SNAPSHOT.pom
[JENKINS] Archiving <https://builds.apache.org/job/DeltaSpike%20Deploy/ws/deltaspike/modules/security/target/security-module-project-0.7-SNAPSHOT-tests.jar>
to org.apache.deltaspike.modules/security-module-project/0.7-20140420.143539-53/security-module-project-0.7-20140420.143539-53-tests.jar
[JENKINS] Archiving <https://builds.apache.org/job/DeltaSpike%20Deploy/ws/deltaspike/modules/jsf/api/pom.xml>
to org.apache.deltaspike.modules/deltaspike-jsf-module-api/0.7-SNAPSHOT/deltaspike-jsf-module-api-0.7-SNAPSHOT.pom
[JENKINS] Archiving <https://builds.apache.org/job/DeltaSpike%20Deploy/ws/deltaspike/modules/jsf/api/target/deltaspike-jsf-module-api-0.7-SNAPSHOT.jar>
to org.apache.deltaspike.modules/deltaspike-jsf-module-api/0.7-20140420.143945-53/deltaspike-jsf-module-api-0.7-20140420.143945-53.jar
[JENKINS] Archiving <https://builds.apache.org/job/DeltaSpike%20Deploy/ws/deltaspike/modules/jsf/api/target/deltaspike-jsf-module-api-0.7-SNAPSHOT-tests.jar>
to org.apache.deltaspike.modules/deltaspike-jsf-module-api/0.7-20140420.143945-53/deltaspike-jsf-module-api-0.7-20140420.143945-53-tests.jar
[JENKINS] Archiving <https://builds.apache.org/job/DeltaSpike%20Deploy/ws/deltaspike/modules/jsf/api/target/deltaspike-jsf-module-api-0.7-SNAPSHOT-sources.jar>
to org.apache.deltaspike.modules/deltaspike-jsf-module-api/0.7-20140420.143945-53/deltaspike-jsf-module-api-0.7-20140420.143945-53-sources.jar
[JENKINS] Archiving <https://builds.apache.org/job/DeltaSpike%20Deploy/ws/deltaspike/modules/data/pom.xml>
to org.apache.deltaspike.modules/data-module-project/0.7-SNAPSHOT/data-module-project-0.7-SNAPSHOT.pom
[JENKINS] Archiving <https://builds.apache.org/job/DeltaSpike%20Deploy/ws/deltaspike/modules/data/target/data-module-project-0.7-SNAPSHOT-tests.jar>
to org.apache.deltaspike.modules/data-module-project/0.7-20140420.144835-53/data-module-project-0.7-20140420.144835-53-tests.jar
[JENKINS] Archiving <https://builds.apache.org/job/DeltaSpike%20Deploy/ws/deltaspike/modules/servlet/impl/pom.xml>
to org.apache.deltaspike.modules/deltaspike-servlet-module-impl/0.7-SNAPSHOT/deltaspike-servlet-module-impl-0.7-SNAPSHOT.pom
[JENKINS] Archiving <https://builds.apache.org/job/DeltaSpike%20Deploy/ws/deltaspike/modules/servlet/impl/target/deltaspike-servlet-module-impl-0.7-SNAPSHOT.jar>
to org.apache.deltaspike.modules/deltaspike-servlet-module-impl/0.7-20140420.143905-53/deltaspike-servlet-module-impl-0.7-20140420.143905-53.jar
[JENKINS] Archiving <https://builds.apache.org/job/DeltaSpike%20Deploy/ws/deltaspike/modules/servlet/impl/target/deltaspike-servlet-module-impl-0.7-SNAPSHOT-tests.jar>
to org.apache.deltaspike.modules/deltaspike-servlet-module-impl/0.7-20140420.143905-53/deltaspike-servlet-module-impl-0.7-20140420.143905-53-tests.jar
[JENKINS] Archiving <https://builds.apache.org/job/DeltaSpike%20Deploy/ws/deltaspike/modules/servlet/impl/target/deltaspike-servlet-module-impl-0.7-SNAPSHOT-sources.jar>
to org.apache.deltaspike.modules/deltaspike-servlet-module-impl/0.7-20140420.143905-53/deltaspike-servlet-module-impl-0.7-20140420.143905-53-sources.jar
[JENKINS] Archiving <https://builds.apache.org/job/DeltaSpike%20Deploy/ws/deltaspike/modules/test-control/api/pom.xml>
to org.apache.deltaspike.modules/deltaspike-test-control-module-api/0.7-SNAPSHOT/deltaspike-test-control-module-api-0.7-SNAPSHOT.pom
[JENKINS] Archiving <https://builds.apache.org/job/DeltaSpike%20Deploy/ws/deltaspike/cdictrl/impl-openejb/pom.xml>
to org.apache.deltaspike.cdictrl/deltaspike-cdictrl-openejb/0.7-SNAPSHOT/deltaspike-cdictrl-openejb-0.7-SNAPSHOT.pom
[JENKINS] Archiving <https://builds.apache.org/job/DeltaSpike%20Deploy/ws/deltaspike/cdictrl/impl-openejb/target/deltaspike-cdictrl-openejb-0.7-SNAPSHOT.jar>
to org.apache.deltaspike.cdictrl/deltaspike-cdictrl-openejb/0.7-20140420.143422-53/deltaspike-cdictrl-openejb-0.7-20140420.143422-53.jar
[JENKINS] Archiving <https://builds.apache.org/job/DeltaSpike%20Deploy/ws/deltaspike/cdictrl/impl-openejb/target/deltaspike-cdictrl-openejb-0.7-SNAPSHOT-sources.jar>
to org.apache.deltaspike.cdictrl/deltaspike-cdictrl-openejb/0.7-20140420.143422-53/deltaspike-cdictrl-openejb-0.7-20140420.143422-53-sources.jar
[JENKINS] Archiving <https://builds.apache.org/job/DeltaSpike%20Deploy/ws/deltaspike/examples/jsf-examples/pom.xml>
to org.apache.deltaspike.examples/deltaspike-jsf-example/0.7-SNAPSHOT/deltaspike-jsf-example-0.7-SNAPSHOT.pom
[JENKINS] Archiving <https://builds.apache.org/job/DeltaSpike%20Deploy/ws/deltaspike/core/pom.xml>
to org.apache.deltaspike.core/core-project/0.7-SNAPSHOT/core-project-0.7-SNAPSHOT.pom
[JENKINS] Archiving <https://builds.apache.org/job/DeltaSpike%20Deploy/ws/deltaspike/core/target/core-project-0.7-SNAPSHOT-tests.jar>
to org.apache.deltaspike.core/core-project/0.7-20140420.142706-53/core-project-0.7-20140420.142706-53-tests.jar
[JENKINS] Archiving <https://builds.apache.org/job/DeltaSpike%20Deploy/ws/deltaspike/dist/full/pom.xml>
to org.apache.deltaspike.distribution/distribution-full/0.6-SNAPSHOT/distribution-full-0.6-SNAPSHOT.pom
Sending e-mails to: commits@deltaspike.apache.org
channel stopped

Mime
View raw message