deltaspike-commits mailing list archives

Site index · List index
Message view « Date » · « Thread »
Top « Date » · « Thread »
From Apache Jenkins Server <jenk...@builds.apache.org>
Subject Build failed in Jenkins: DeltaSpike Weld 2.1.1 #67
Date Wed, 16 Apr 2014 14:39:01 GMT
See <https://builds.apache.org/job/DeltaSpike%20Weld%202.1.1/67/changes>

Changes:

[tandraschko] DELTASPIKE-573 f:viewAction is executed twice with LAZY window handling mode
+ playground example

[tandraschko] DELTASPIKE-569 Improve DeltaSpikeResourceHandler handling

[tommy] DELTASPIKE-569 Improve DeltaSpikeResourceHandler handling

[tommy] Revert "DELTASPIKE-569 Improve DeltaSpikeResourceHandler handling"

[tandraschko] DELTASPIKE-569 Improve DeltaSpikeResourceHandler handling

[tandraschko] DELTASPIKE-574 Versioning for DeltaSpike JSF resources

------------------------------------------
[...truncated 3864 lines...]
[INFO] 
[INFO] --- maven-source-plugin:2.1.2:jar (attach-sources) @ deltaspike-jsf-module-api ---
[INFO] META-INF already added, skipping
[INFO] META-INF/DEPENDENCIES already added, skipping
[INFO] META-INF/DISCLAIMER already added, skipping
[INFO] META-INF/NOTICE already added, skipping
[INFO] META-INF/LICENSE already added, skipping
[INFO] META-INF already added, skipping
[INFO] META-INF already added, skipping
[INFO] META-INF/DEPENDENCIES already added, skipping
[INFO] META-INF/DISCLAIMER already added, skipping
[INFO] META-INF/NOTICE already added, skipping
[INFO] META-INF/LICENSE already added, skipping
[INFO] META-INF already added, skipping
[INFO] META-INF/DEPENDENCIES already added, skipping
[INFO] META-INF/DISCLAIMER already added, skipping
[INFO] META-INF/NOTICE already added, skipping
[INFO] META-INF/LICENSE already added, skipping
[INFO] Building jar: <https://builds.apache.org/job/DeltaSpike%20Weld%202.1.1/ws/deltaspike/modules/jsf/api/target/deltaspike-jsf-module-api-0.7-SNAPSHOT-sources.jar>
[INFO] META-INF already added, skipping
[INFO] META-INF/DEPENDENCIES already added, skipping
[INFO] META-INF/DISCLAIMER already added, skipping
[INFO] META-INF/NOTICE already added, skipping
[INFO] META-INF/LICENSE already added, skipping
[INFO] META-INF already added, skipping
[INFO] META-INF already added, skipping
[INFO] META-INF/DEPENDENCIES already added, skipping
[INFO] META-INF/DISCLAIMER already added, skipping
[INFO] META-INF/NOTICE already added, skipping
[INFO] META-INF/LICENSE already added, skipping
[INFO] META-INF already added, skipping
[INFO] META-INF/DEPENDENCIES already added, skipping
[INFO] META-INF/DISCLAIMER already added, skipping
[INFO] META-INF/NOTICE already added, skipping
[INFO] META-INF/LICENSE already added, skipping
[INFO] 
[INFO] --- maven-checkstyle-plugin:2.9.1:check (verify-style) @ deltaspike-jsf-module-api
---
[INFO] Starting audit...
Audit done.

[INFO] 
[INFO] --- maven-install-plugin:2.3.1:install (default-install) @ deltaspike-jsf-module-api
---
[INFO] Installing <https://builds.apache.org/job/DeltaSpike%20Weld%202.1.1/ws/deltaspike/modules/jsf/api/target/deltaspike-jsf-module-api-0.7-SNAPSHOT.jar>
to /home/jenkins/jenkins-slave/maven-repositories/1/org/apache/deltaspike/modules/deltaspike-jsf-module-api/0.7-SNAPSHOT/deltaspike-jsf-module-api-0.7-SNAPSHOT.jar
[INFO] Installing <https://builds.apache.org/job/DeltaSpike%20Weld%202.1.1/ws/deltaspike/modules/jsf/api/pom.xml>
to /home/jenkins/jenkins-slave/maven-repositories/1/org/apache/deltaspike/modules/deltaspike-jsf-module-api/0.7-SNAPSHOT/deltaspike-jsf-module-api-0.7-SNAPSHOT.pom
[INFO] Installing <https://builds.apache.org/job/DeltaSpike%20Weld%202.1.1/ws/deltaspike/modules/jsf/api/target/deltaspike-jsf-module-api-0.7-SNAPSHOT-tests.jar>
to /home/jenkins/jenkins-slave/maven-repositories/1/org/apache/deltaspike/modules/deltaspike-jsf-module-api/0.7-SNAPSHOT/deltaspike-jsf-module-api-0.7-SNAPSHOT-tests.jar
[INFO] Installing <https://builds.apache.org/job/DeltaSpike%20Weld%202.1.1/ws/deltaspike/modules/jsf/api/target/deltaspike-jsf-module-api-0.7-SNAPSHOT-sources.jar>
to /home/jenkins/jenkins-slave/maven-repositories/1/org/apache/deltaspike/modules/deltaspike-jsf-module-api/0.7-SNAPSHOT/deltaspike-jsf-module-api-0.7-SNAPSHOT-sources.jar
[INFO]                                                                         
[INFO] ------------------------------------------------------------------------
[INFO] Building Apache DeltaSpike JSF-Module Impl 0.7-SNAPSHOT
[INFO] ------------------------------------------------------------------------
[INFO] 
[INFO] --- maven-clean-plugin:2.5:clean (default-clean) @ deltaspike-jsf-module-impl ---
[INFO] Deleting <https://builds.apache.org/job/DeltaSpike%20Weld%202.1.1/ws/deltaspike/modules/jsf/impl/target>
[INFO] 
[INFO] --- maven-bundle-plugin:2.3.7:cleanVersions (versions) @ deltaspike-jsf-module-impl
---
[INFO] 
[INFO] --- maven-antrun-plugin:1.6:run (javadoc.resources) @ deltaspike-jsf-module-impl ---
[WARNING] Parameter tasks is deprecated, use target instead
[INFO] Executing tasks

main:
[INFO] Executed tasks
[INFO] 
[INFO] --- maven-remote-resources-plugin:1.3:process (process-remote-resources) @ deltaspike-jsf-module-impl
---
[INFO] 
[INFO] --- maven-remote-resources-plugin:1.3:process (default) @ deltaspike-jsf-module-impl
---
[INFO] 
[INFO] --- maven-resources-plugin:2.6:resources (default-resources) @ deltaspike-jsf-module-impl
---
[INFO] Using 'UTF-8' encoding to copy filtered resources.
[INFO] Copying 7 resources
[INFO] Copying 4 resources
[INFO] Copying 4 resources
[INFO] 
[INFO] --- maven-resources-plugin:2.6:copy-resources (default) @ deltaspike-jsf-module-impl
---
[INFO] Using 'UTF-8' encoding to copy filtered resources.
[INFO] Copying 1 resource
[INFO] 
[INFO] --- maven-compiler-plugin:2.5:compile (default-compile) @ deltaspike-jsf-module-impl
---
[INFO] Compiling 78 source files to <https://builds.apache.org/job/DeltaSpike%20Weld%202.1.1/ws/deltaspike/modules/jsf/impl/target/classes>
[INFO] -------------------------------------------------------------
[ERROR] COMPILATION ERROR : 
[INFO] -------------------------------------------------------------
[ERROR] <https://builds.apache.org/job/DeltaSpike%20Weld%202.1.1/ws/deltaspike/modules/jsf/impl/src/main/java/org/apache/deltaspike/jsf/impl/resource/DeltaSpikeResourceHandler.java>:[59,27]
error: cannot find symbol
[INFO] 1 error
[INFO] -------------------------------------------------------------
[INFO] ------------------------------------------------------------------------
[INFO] Reactor Summary:
[INFO] 
[INFO] Apache DeltaSpike ................................. SUCCESS [7.537s]
[INFO] Apache DeltaSpike CheckStyle-rules ................ SUCCESS [4.370s]
[INFO] Apache DeltaSpike Parent .......................... SUCCESS [5.510s]
[INFO] Apache DeltaSpike Test-Utils ...................... SUCCESS [6.890s]
[INFO] Apache DeltaSpike Code Parent ..................... SUCCESS [4.064s]
[INFO] Apache DeltaSpike Core ............................ SUCCESS [3.193s]
[INFO] Apache DeltaSpike Core-API ........................ SUCCESS [10.350s]
[INFO] Apache DeltaSpike Core-Implementation ............. SUCCESS [23.521s]
[INFO] Apache DeltaSpike ContainerControl parent ......... SUCCESS [4.686s]
[INFO] Apache DeltaSpike CDI ContainerControl API ........ SUCCESS [5.806s]
[INFO] Apache DeltaSpike CDI ContainerControl TCK ........ SUCCESS [4.820s]
[INFO] Apache DeltaSpike CDI OWB-ContainerControl ........ SUCCESS [6.573s]
[INFO] Apache DeltaSpike CDI Weld-ContainerControl ....... SUCCESS [6.869s]
[INFO] Apache DeltaSpike CDI OpenEJB-ContainerControl .... SUCCESS [9.973s]
[INFO] Apache DeltaSpike Modules ......................... SUCCESS [4.521s]
[INFO] Apache DeltaSpike Security-Module ................. SUCCESS [5.139s]
[INFO] Apache DeltaSpike Security-Module API ............. SUCCESS [5.356s]
[INFO] Apache DeltaSpike Security-Module Impl ............ SUCCESS [10.167s]
[INFO] Apache DeltaSpike JPA-Module ...................... SUCCESS [3.486s]
[INFO] Apache DeltaSpike JPA-Module API .................. SUCCESS [4.610s]
[INFO] Apache DeltaSpike JPA-Module Impl ................. SUCCESS [17.867s]
[INFO] Apache DeltaSpike Servlet-Module .................. SUCCESS [3.424s]
[INFO] Apache DeltaSpike Servlet-Module API .............. SUCCESS [5.902s]
[INFO] Apache DeltaSpike Servlet-Module Impl ............. SUCCESS [5.457s]
[INFO] Apache DeltaSpike JSF-Module ...................... SUCCESS [2.961s]
[INFO] Apache DeltaSpike JSF-Module API .................. SUCCESS [4.550s]
[INFO] Apache DeltaSpike JSF-Module Impl ................. FAILURE [4.890s]
[INFO] Apache DeltaSpike Partial-Bean-Module ............. SKIPPED
[INFO] Apache DeltaSpike Partial-Bean-Module API ......... SKIPPED
[INFO] Apache DeltaSpike Partial-Bean-Module Impl ........ SKIPPED
[INFO] Apache DeltaSpike BeanValidation-Module ........... SKIPPED
[INFO] Apache DeltaSpike BeanValidation-Module API ....... SKIPPED
[INFO] Apache DeltaSpike BeanValidation-Module Impl ...... SKIPPED
[INFO] Apache DeltaSpike Data-Module ..................... SKIPPED
[INFO] Apache DeltaSpike Data-Module API ................. SKIPPED
[INFO] Apache DeltaSpike Data-Module Impl ................ SKIPPED
[INFO] Apache DeltaSpike Scheduler-Module ................ SKIPPED
[INFO] Apache DeltaSpike Scheduler-Module API ............ SKIPPED
[INFO] Apache DeltaSpike Scheduler-Module Impl ........... SKIPPED
[INFO] Apache DeltaSpike Test-Control-Module ............. SKIPPED
[INFO] Apache DeltaSpike Test-Control-Module API ......... SKIPPED
[INFO] Apache DeltaSpike Test-Control-Module Impl ........ SKIPPED
[INFO] Apache DeltaSpike Examples ........................ SKIPPED
[INFO] Apache DeltaSpike Java-SE Examples ................ SKIPPED
[INFO] Apache DeltaSpike JSF Examples .................... SKIPPED
[INFO] Apache DeltaSpike JSF Playground .................. SKIPPED
[INFO] ------------------------------------------------------------------------
[INFO] BUILD FAILURE
[INFO] ------------------------------------------------------------------------
[INFO] Total time: 3:50.816s
[INFO] Finished at: Wed Apr 16 14:34:18 UTC 2014
[INFO] Final Memory: 68M/247M
[INFO] ------------------------------------------------------------------------
Waiting for Jenkins to finish collecting data
[ERROR] Failed to execute goal org.apache.maven.plugins:maven-compiler-plugin:2.5:compile
(default-compile) on project deltaspike-jsf-module-impl: Compilation failure
[ERROR] <https://builds.apache.org/job/DeltaSpike%20Weld%202.1.1/ws/deltaspike/modules/jsf/impl/src/main/java/org/apache/deltaspike/jsf/impl/resource/DeltaSpikeResourceHandler.java>:[59,27]
error: cannot find symbol
[ERROR] -> [Help 1]
[ERROR] 
[ERROR] To see the full stack trace of the errors, re-run Maven with the -e switch.
[JENKINS] Archiving <https://builds.apache.org/job/DeltaSpike%20Weld%202.1.1/ws/deltaspike/modules/security/impl/pom.xml>
to org.apache.deltaspike.modules/deltaspike-security-module-impl/0.7-SNAPSHOT/deltaspike-security-module-impl-0.7-SNAPSHOT.pom
[JENKINS] Archiving <https://builds.apache.org/job/DeltaSpike%20Weld%202.1.1/ws/deltaspike/modules/security/impl/target/deltaspike-security-module-impl-0.7-SNAPSHOT.jar>
to org.apache.deltaspike.modules/deltaspike-security-module-impl/0.7-SNAPSHOT/deltaspike-security-module-impl-0.7-SNAPSHOT.jar
[JENKINS] Archiving <https://builds.apache.org/job/DeltaSpike%20Weld%202.1.1/ws/deltaspike/modules/security/impl/target/deltaspike-security-module-impl-0.7-SNAPSHOT-tests.jar>
to org.apache.deltaspike.modules/deltaspike-security-module-impl/0.7-SNAPSHOT/deltaspike-security-module-impl-0.7-SNAPSHOT-tests.jar
[JENKINS] Archiving <https://builds.apache.org/job/DeltaSpike%20Weld%202.1.1/ws/deltaspike/modules/security/impl/target/deltaspike-security-module-impl-0.7-SNAPSHOT-sources.jar>
to org.apache.deltaspike.modules/deltaspike-security-module-impl/0.7-SNAPSHOT/deltaspike-security-module-impl-0.7-SNAPSHOT-sources.jar
[ERROR] Re-run Maven using the -X switch to enable full debug logging.
[ERROR] 
[ERROR] For more information about the errors and possible solutions, please read the following
articles:
[ERROR] [Help 1] http://cwiki.apache.org/confluence/display/MAVEN/MojoFailureException
[ERROR] 
[ERROR] After correcting the problems, you can resume the build with the command
[ERROR]   mvn <goals> -rf :deltaspike-jsf-module-impl
[JENKINS] Archiving <https://builds.apache.org/job/DeltaSpike%20Weld%202.1.1/ws/deltaspike/modules/jpa/api/pom.xml>
to org.apache.deltaspike.modules/deltaspike-jpa-module-api/0.7-SNAPSHOT/deltaspike-jpa-module-api-0.7-SNAPSHOT.pom
[JENKINS] Archiving <https://builds.apache.org/job/DeltaSpike%20Weld%202.1.1/ws/deltaspike/modules/jpa/api/target/deltaspike-jpa-module-api-0.7-SNAPSHOT.jar>
to org.apache.deltaspike.modules/deltaspike-jpa-module-api/0.7-SNAPSHOT/deltaspike-jpa-module-api-0.7-SNAPSHOT.jar
[JENKINS] Archiving <https://builds.apache.org/job/DeltaSpike%20Weld%202.1.1/ws/deltaspike/modules/jpa/api/target/deltaspike-jpa-module-api-0.7-SNAPSHOT-tests.jar>
to org.apache.deltaspike.modules/deltaspike-jpa-module-api/0.7-SNAPSHOT/deltaspike-jpa-module-api-0.7-SNAPSHOT-tests.jar
[JENKINS] Archiving <https://builds.apache.org/job/DeltaSpike%20Weld%202.1.1/ws/deltaspike/modules/jpa/api/target/deltaspike-jpa-module-api-0.7-SNAPSHOT-sources.jar>
to org.apache.deltaspike.modules/deltaspike-jpa-module-api/0.7-SNAPSHOT/deltaspike-jpa-module-api-0.7-SNAPSHOT-sources.jar
[JENKINS] Archiving <https://builds.apache.org/job/DeltaSpike%20Weld%202.1.1/ws/deltaspike/cdictrl/tck/pom.xml>
to org.apache.deltaspike.test/deltaspike-cdictrl-tck/0.7-SNAPSHOT/deltaspike-cdictrl-tck-0.7-SNAPSHOT.pom
[JENKINS] Archiving <https://builds.apache.org/job/DeltaSpike%20Weld%202.1.1/ws/deltaspike/cdictrl/tck/target/deltaspike-cdictrl-tck-0.7-SNAPSHOT.jar>
to org.apache.deltaspike.test/deltaspike-cdictrl-tck/0.7-SNAPSHOT/deltaspike-cdictrl-tck-0.7-SNAPSHOT.jar
[JENKINS] Archiving <https://builds.apache.org/job/DeltaSpike%20Weld%202.1.1/ws/deltaspike/cdictrl/tck/target/deltaspike-cdictrl-tck-0.7-SNAPSHOT-sources.jar>
to org.apache.deltaspike.test/deltaspike-cdictrl-tck/0.7-SNAPSHOT/deltaspike-cdictrl-tck-0.7-SNAPSHOT-sources.jar
[JENKINS] Archiving <https://builds.apache.org/job/DeltaSpike%20Weld%202.1.1/ws/deltaspike/modules/bean-validation/pom.xml>
to org.apache.deltaspike.modules/bean-validation-module-project/0.7-SNAPSHOT/bean-validation-module-project-0.7-SNAPSHOT.pom
[JENKINS] Archiving <https://builds.apache.org/job/DeltaSpike%20Weld%202.1.1/ws/deltaspike/parent/code/pom.xml>
to org.apache.deltaspike/parent-code/0.7-SNAPSHOT/parent-code-0.7-SNAPSHOT.pom
[JENKINS] Archiving <https://builds.apache.org/job/DeltaSpike%20Weld%202.1.1/ws/deltaspike/parent/code/target/parent-code-0.7-SNAPSHOT-tests.jar>
to org.apache.deltaspike/parent-code/0.7-SNAPSHOT/parent-code-0.7-SNAPSHOT-tests.jar
[JENKINS] Archiving <https://builds.apache.org/job/DeltaSpike%20Weld%202.1.1/ws/deltaspike/modules/jpa/impl/pom.xml>
to org.apache.deltaspike.modules/deltaspike-jpa-module-impl/0.7-SNAPSHOT/deltaspike-jpa-module-impl-0.7-SNAPSHOT.pom
[JENKINS] Archiving <https://builds.apache.org/job/DeltaSpike%20Weld%202.1.1/ws/deltaspike/modules/jpa/impl/target/deltaspike-jpa-module-impl-0.7-SNAPSHOT.jar>
to org.apache.deltaspike.modules/deltaspike-jpa-module-impl/0.7-SNAPSHOT/deltaspike-jpa-module-impl-0.7-SNAPSHOT.jar
[JENKINS] Archiving <https://builds.apache.org/job/DeltaSpike%20Weld%202.1.1/ws/deltaspike/modules/jpa/impl/target/deltaspike-jpa-module-impl-0.7-SNAPSHOT-tests.jar>
to org.apache.deltaspike.modules/deltaspike-jpa-module-impl/0.7-SNAPSHOT/deltaspike-jpa-module-impl-0.7-SNAPSHOT-tests.jar
[JENKINS] Archiving <https://builds.apache.org/job/DeltaSpike%20Weld%202.1.1/ws/deltaspike/modules/jpa/impl/target/deltaspike-jpa-module-impl-0.7-SNAPSHOT-sources.jar>
to org.apache.deltaspike.modules/deltaspike-jpa-module-impl/0.7-SNAPSHOT/deltaspike-jpa-module-impl-0.7-SNAPSHOT-sources.jar
[JENKINS] Archiving <https://builds.apache.org/job/DeltaSpike%20Weld%202.1.1/ws/deltaspike/modules/partial-bean/impl/pom.xml>
to org.apache.deltaspike.modules/deltaspike-partial-bean-module-impl/0.7-SNAPSHOT/deltaspike-partial-bean-module-impl-0.7-SNAPSHOT.pom
[JENKINS] Archiving <https://builds.apache.org/job/DeltaSpike%20Weld%202.1.1/ws/deltaspike/modules/scheduler/api/pom.xml>
to org.apache.deltaspike.modules/deltaspike-scheduler-module-api/0.7-SNAPSHOT/deltaspike-scheduler-module-api-0.7-SNAPSHOT.pom
[JENKINS] Archiving <https://builds.apache.org/job/DeltaSpike%20Weld%202.1.1/ws/deltaspike/modules/test-control/pom.xml>
to org.apache.deltaspike.modules/test-control-module-project/0.7-SNAPSHOT/test-control-module-project-0.7-SNAPSHOT.pom
[JENKINS] Archiving <https://builds.apache.org/job/DeltaSpike%20Weld%202.1.1/ws/deltaspike/modules/jsf/impl/pom.xml>
to org.apache.deltaspike.modules/deltaspike-jsf-module-impl/0.7-SNAPSHOT/deltaspike-jsf-module-impl-0.7-SNAPSHOT.pom
[JENKINS] Archiving <https://builds.apache.org/job/DeltaSpike%20Weld%202.1.1/ws/deltaspike/modules/scheduler/impl/pom.xml>
to org.apache.deltaspike.modules/deltaspike-scheduler-module-impl/0.7-SNAPSHOT/deltaspike-scheduler-module-impl-0.7-SNAPSHOT.pom
[JENKINS] Archiving <https://builds.apache.org/job/DeltaSpike%20Weld%202.1.1/ws/deltaspike/examples/jsf-playground/pom.xml>
to org.apache.deltaspike.examples/deltaspike-jsf-playground/0.7-SNAPSHOT/deltaspike-jsf-playground-0.7-SNAPSHOT.pom
[JENKINS] Archiving <https://builds.apache.org/job/DeltaSpike%20Weld%202.1.1/ws/deltaspike/modules/test-control/impl/pom.xml>
to org.apache.deltaspike.modules/deltaspike-test-control-module-impl/0.7-SNAPSHOT/deltaspike-test-control-module-impl-0.7-SNAPSHOT.pom
[JENKINS] Archiving <https://builds.apache.org/job/DeltaSpike%20Weld%202.1.1/ws/deltaspike/checkstyle-rules/pom.xml>
to org.apache.deltaspike/checkstyle-rules/0.7-SNAPSHOT/checkstyle-rules-0.7-SNAPSHOT.pom
[JENKINS] Archiving <https://builds.apache.org/job/DeltaSpike%20Weld%202.1.1/ws/deltaspike/checkstyle-rules/target/checkstyle-rules-0.7-SNAPSHOT.jar>
to org.apache.deltaspike/checkstyle-rules/0.7-SNAPSHOT/checkstyle-rules-0.7-SNAPSHOT.jar
[JENKINS] Archiving <https://builds.apache.org/job/DeltaSpike%20Weld%202.1.1/ws/deltaspike/modules/data/impl/pom.xml>
to org.apache.deltaspike.modules/deltaspike-data-module-impl/0.7-SNAPSHOT/deltaspike-data-module-impl-0.7-SNAPSHOT.pom
[JENKINS] Archiving <https://builds.apache.org/job/DeltaSpike%20Weld%202.1.1/ws/deltaspike/modules/jsf/pom.xml>
to org.apache.deltaspike.modules/jsf-module-project/0.7-SNAPSHOT/jsf-module-project-0.7-SNAPSHOT.pom
[JENKINS] Archiving <https://builds.apache.org/job/DeltaSpike%20Weld%202.1.1/ws/deltaspike/modules/jsf/target/jsf-module-project-0.7-SNAPSHOT-tests.jar>
to org.apache.deltaspike.modules/jsf-module-project/0.7-SNAPSHOT/jsf-module-project-0.7-SNAPSHOT-tests.jar
[JENKINS] Archiving <https://builds.apache.org/job/DeltaSpike%20Weld%202.1.1/ws/deltaspike/modules/bean-validation/impl/pom.xml>
to org.apache.deltaspike.modules/deltaspike-bean-validation-module-impl/0.7-SNAPSHOT/deltaspike-bean-validation-module-impl-0.7-SNAPSHOT.pom
[JENKINS] Archiving <https://builds.apache.org/job/DeltaSpike%20Weld%202.1.1/ws/deltaspike/modules/servlet/api/pom.xml>
to org.apache.deltaspike.modules/deltaspike-servlet-module-api/0.7-SNAPSHOT/deltaspike-servlet-module-api-0.7-SNAPSHOT.pom
[JENKINS] Archiving <https://builds.apache.org/job/DeltaSpike%20Weld%202.1.1/ws/deltaspike/modules/servlet/api/target/deltaspike-servlet-module-api-0.7-SNAPSHOT.jar>
to org.apache.deltaspike.modules/deltaspike-servlet-module-api/0.7-SNAPSHOT/deltaspike-servlet-module-api-0.7-SNAPSHOT.jar
[JENKINS] Archiving <https://builds.apache.org/job/DeltaSpike%20Weld%202.1.1/ws/deltaspike/modules/servlet/api/target/deltaspike-servlet-module-api-0.7-SNAPSHOT-tests.jar>
to org.apache.deltaspike.modules/deltaspike-servlet-module-api/0.7-SNAPSHOT/deltaspike-servlet-module-api-0.7-SNAPSHOT-tests.jar
[JENKINS] Archiving <https://builds.apache.org/job/DeltaSpike%20Weld%202.1.1/ws/deltaspike/modules/servlet/api/target/deltaspike-servlet-module-api-0.7-SNAPSHOT-sources.jar>
to org.apache.deltaspike.modules/deltaspike-servlet-module-api/0.7-SNAPSHOT/deltaspike-servlet-module-api-0.7-SNAPSHOT-sources.jar
[JENKINS] Archiving <https://builds.apache.org/job/DeltaSpike%20Weld%202.1.1/ws/deltaspike/cdictrl/pom.xml>
to org.apache.deltaspike.cdictrl/cdictrl-project/0.7-SNAPSHOT/cdictrl-project-0.7-SNAPSHOT.pom
[JENKINS] Archiving <https://builds.apache.org/job/DeltaSpike%20Weld%202.1.1/ws/deltaspike/core/api/pom.xml>
to org.apache.deltaspike.core/deltaspike-core-api/0.7-SNAPSHOT/deltaspike-core-api-0.7-SNAPSHOT.pom
[JENKINS] Archiving <https://builds.apache.org/job/DeltaSpike%20Weld%202.1.1/ws/deltaspike/core/api/target/deltaspike-core-api-0.7-SNAPSHOT.jar>
to org.apache.deltaspike.core/deltaspike-core-api/0.7-SNAPSHOT/deltaspike-core-api-0.7-SNAPSHOT.jar
[JENKINS] Archiving <https://builds.apache.org/job/DeltaSpike%20Weld%202.1.1/ws/deltaspike/core/api/target/deltaspike-core-api-0.7-SNAPSHOT-tests.jar>
to org.apache.deltaspike.core/deltaspike-core-api/0.7-SNAPSHOT/deltaspike-core-api-0.7-SNAPSHOT-tests.jar
[JENKINS] Archiving <https://builds.apache.org/job/DeltaSpike%20Weld%202.1.1/ws/deltaspike/core/api/target/deltaspike-core-api-0.7-SNAPSHOT-sources.jar>
to org.apache.deltaspike.core/deltaspike-core-api/0.7-SNAPSHOT/deltaspike-core-api-0.7-SNAPSHOT-sources.jar
[JENKINS] Archiving <https://builds.apache.org/job/DeltaSpike%20Weld%202.1.1/ws/deltaspike/modules/partial-bean/api/pom.xml>
to org.apache.deltaspike.modules/deltaspike-partial-bean-module-api/0.7-SNAPSHOT/deltaspike-partial-bean-module-api-0.7-SNAPSHOT.pom
[JENKINS] Archiving <https://builds.apache.org/job/DeltaSpike%20Weld%202.1.1/ws/deltaspike/modules/bean-validation/api/pom.xml>
to org.apache.deltaspike.modules/deltaspike-bean-validation-module-api/0.7-SNAPSHOT/deltaspike-bean-validation-module-api-0.7-SNAPSHOT.pom
[JENKINS] Archiving <https://builds.apache.org/job/DeltaSpike%20Weld%202.1.1/ws/deltaspike/cdictrl/api/pom.xml>
to org.apache.deltaspike.cdictrl/deltaspike-cdictrl-api/0.7-SNAPSHOT/deltaspike-cdictrl-api-0.7-SNAPSHOT.pom
[JENKINS] Archiving <https://builds.apache.org/job/DeltaSpike%20Weld%202.1.1/ws/deltaspike/cdictrl/api/target/deltaspike-cdictrl-api-0.7-SNAPSHOT.jar>
to org.apache.deltaspike.cdictrl/deltaspike-cdictrl-api/0.7-SNAPSHOT/deltaspike-cdictrl-api-0.7-SNAPSHOT.jar
[JENKINS] Archiving <https://builds.apache.org/job/DeltaSpike%20Weld%202.1.1/ws/deltaspike/cdictrl/api/target/deltaspike-cdictrl-api-0.7-SNAPSHOT-sources.jar>
to org.apache.deltaspike.cdictrl/deltaspike-cdictrl-api/0.7-SNAPSHOT/deltaspike-cdictrl-api-0.7-SNAPSHOT-sources.jar
[JENKINS] Archiving <https://builds.apache.org/job/DeltaSpike%20Weld%202.1.1/ws/deltaspike/modules/pom.xml>
to org.apache.deltaspike.modules/modules-project/0.7-SNAPSHOT/modules-project-0.7-SNAPSHOT.pom
[JENKINS] Archiving <https://builds.apache.org/job/DeltaSpike%20Weld%202.1.1/ws/deltaspike/modules/target/modules-project-0.7-SNAPSHOT-tests.jar>
to org.apache.deltaspike.modules/modules-project/0.7-SNAPSHOT/modules-project-0.7-SNAPSHOT-tests.jar
[JENKINS] Archiving <https://builds.apache.org/job/DeltaSpike%20Weld%202.1.1/ws/deltaspike/modules/scheduler/pom.xml>
to org.apache.deltaspike.modules/scheduler-module-project/0.7-SNAPSHOT/scheduler-module-project-0.7-SNAPSHOT.pom
[JENKINS] Archiving <https://builds.apache.org/job/DeltaSpike%20Weld%202.1.1/ws/deltaspike/test-utils/pom.xml>
to org.apache.deltaspike.test/test-utils/0.7-SNAPSHOT/test-utils-0.7-SNAPSHOT.pom
[JENKINS] Archiving <https://builds.apache.org/job/DeltaSpike%20Weld%202.1.1/ws/deltaspike/test-utils/target/test-utils-0.7-SNAPSHOT.jar>
to org.apache.deltaspike.test/test-utils/0.7-SNAPSHOT/test-utils-0.7-SNAPSHOT.jar
[JENKINS] Archiving <https://builds.apache.org/job/DeltaSpike%20Weld%202.1.1/ws/deltaspike/test-utils/target/test-utils-0.7-SNAPSHOT-sources.jar>
to org.apache.deltaspike.test/test-utils/0.7-SNAPSHOT/test-utils-0.7-SNAPSHOT-sources.jar
[JENKINS] Archiving <https://builds.apache.org/job/DeltaSpike%20Weld%202.1.1/ws/deltaspike/modules/security/api/pom.xml>
to org.apache.deltaspike.modules/deltaspike-security-module-api/0.7-SNAPSHOT/deltaspike-security-module-api-0.7-SNAPSHOT.pom
[JENKINS] Archiving <https://builds.apache.org/job/DeltaSpike%20Weld%202.1.1/ws/deltaspike/modules/security/api/target/deltaspike-security-module-api-0.7-SNAPSHOT.jar>
to org.apache.deltaspike.modules/deltaspike-security-module-api/0.7-SNAPSHOT/deltaspike-security-module-api-0.7-SNAPSHOT.jar
[JENKINS] Archiving <https://builds.apache.org/job/DeltaSpike%20Weld%202.1.1/ws/deltaspike/modules/security/api/target/deltaspike-security-module-api-0.7-SNAPSHOT-tests.jar>
to org.apache.deltaspike.modules/deltaspike-security-module-api/0.7-SNAPSHOT/deltaspike-security-module-api-0.7-SNAPSHOT-tests.jar
[JENKINS] Archiving <https://builds.apache.org/job/DeltaSpike%20Weld%202.1.1/ws/deltaspike/modules/security/api/target/deltaspike-security-module-api-0.7-SNAPSHOT-sources.jar>
to org.apache.deltaspike.modules/deltaspike-security-module-api/0.7-SNAPSHOT/deltaspike-security-module-api-0.7-SNAPSHOT-sources.jar
[JENKINS] Archiving <https://builds.apache.org/job/DeltaSpike%20Weld%202.1.1/ws/deltaspike/modules/data/api/pom.xml>
to org.apache.deltaspike.modules/deltaspike-data-module-api/0.7-SNAPSHOT/deltaspike-data-module-api-0.7-SNAPSHOT.pom
[JENKINS] Archiving <https://builds.apache.org/job/DeltaSpike%20Weld%202.1.1/ws/deltaspike/modules/security/pom.xml>
to org.apache.deltaspike.modules/security-module-project/0.7-SNAPSHOT/security-module-project-0.7-SNAPSHOT.pom
[JENKINS] Archiving <https://builds.apache.org/job/DeltaSpike%20Weld%202.1.1/ws/deltaspike/modules/security/target/security-module-project-0.7-SNAPSHOT-tests.jar>
to org.apache.deltaspike.modules/security-module-project/0.7-SNAPSHOT/security-module-project-0.7-SNAPSHOT-tests.jar
[JENKINS] Archiving <https://builds.apache.org/job/DeltaSpike%20Weld%202.1.1/ws/deltaspike/modules/jsf/api/pom.xml>
to org.apache.deltaspike.modules/deltaspike-jsf-module-api/0.7-SNAPSHOT/deltaspike-jsf-module-api-0.7-SNAPSHOT.pom
[JENKINS] Archiving <https://builds.apache.org/job/DeltaSpike%20Weld%202.1.1/ws/deltaspike/modules/jsf/api/target/deltaspike-jsf-module-api-0.7-SNAPSHOT.jar>
to org.apache.deltaspike.modules/deltaspike-jsf-module-api/0.7-SNAPSHOT/deltaspike-jsf-module-api-0.7-SNAPSHOT.jar
[JENKINS] Archiving <https://builds.apache.org/job/DeltaSpike%20Weld%202.1.1/ws/deltaspike/modules/jsf/api/target/deltaspike-jsf-module-api-0.7-SNAPSHOT-tests.jar>
to org.apache.deltaspike.modules/deltaspike-jsf-module-api/0.7-SNAPSHOT/deltaspike-jsf-module-api-0.7-SNAPSHOT-tests.jar
[JENKINS] Archiving <https://builds.apache.org/job/DeltaSpike%20Weld%202.1.1/ws/deltaspike/modules/jsf/api/target/deltaspike-jsf-module-api-0.7-SNAPSHOT-sources.jar>
to org.apache.deltaspike.modules/deltaspike-jsf-module-api/0.7-SNAPSHOT/deltaspike-jsf-module-api-0.7-SNAPSHOT-sources.jar
[JENKINS] Archiving <https://builds.apache.org/job/DeltaSpike%20Weld%202.1.1/ws/deltaspike/examples/jse-examples/pom.xml>
to org.apache.deltaspike.examples/deltaspike-jse-example/0.7-SNAPSHOT/deltaspike-jse-example-0.7-SNAPSHOT.pom
[JENKINS] Archiving <https://builds.apache.org/job/DeltaSpike%20Weld%202.1.1/ws/deltaspike/modules/data/pom.xml>
to org.apache.deltaspike.modules/data-module-project/0.7-SNAPSHOT/data-module-project-0.7-SNAPSHOT.pom
[JENKINS] Archiving <https://builds.apache.org/job/DeltaSpike%20Weld%202.1.1/ws/deltaspike/modules/servlet/impl/pom.xml>
to org.apache.deltaspike.modules/deltaspike-servlet-module-impl/0.7-SNAPSHOT/deltaspike-servlet-module-impl-0.7-SNAPSHOT.pom
[JENKINS] Archiving <https://builds.apache.org/job/DeltaSpike%20Weld%202.1.1/ws/deltaspike/modules/servlet/impl/target/deltaspike-servlet-module-impl-0.7-SNAPSHOT.jar>
to org.apache.deltaspike.modules/deltaspike-servlet-module-impl/0.7-SNAPSHOT/deltaspike-servlet-module-impl-0.7-SNAPSHOT.jar
[JENKINS] Archiving <https://builds.apache.org/job/DeltaSpike%20Weld%202.1.1/ws/deltaspike/modules/servlet/impl/target/deltaspike-servlet-module-impl-0.7-SNAPSHOT-tests.jar>
to org.apache.deltaspike.modules/deltaspike-servlet-module-impl/0.7-SNAPSHOT/deltaspike-servlet-module-impl-0.7-SNAPSHOT-tests.jar
[JENKINS] Archiving <https://builds.apache.org/job/DeltaSpike%20Weld%202.1.1/ws/deltaspike/modules/servlet/impl/target/deltaspike-servlet-module-impl-0.7-SNAPSHOT-sources.jar>
to org.apache.deltaspike.modules/deltaspike-servlet-module-impl/0.7-SNAPSHOT/deltaspike-servlet-module-impl-0.7-SNAPSHOT-sources.jar
[JENKINS] Archiving <https://builds.apache.org/job/DeltaSpike%20Weld%202.1.1/ws/deltaspike/modules/test-control/api/pom.xml>
to org.apache.deltaspike.modules/deltaspike-test-control-module-api/0.7-SNAPSHOT/deltaspike-test-control-module-api-0.7-SNAPSHOT.pom
[JENKINS] Archiving <https://builds.apache.org/job/DeltaSpike%20Weld%202.1.1/ws/deltaspike/cdictrl/impl-openejb/pom.xml>
to org.apache.deltaspike.cdictrl/deltaspike-cdictrl-openejb/0.7-SNAPSHOT/deltaspike-cdictrl-openejb-0.7-SNAPSHOT.pom
[JENKINS] Archiving <https://builds.apache.org/job/DeltaSpike%20Weld%202.1.1/ws/deltaspike/cdictrl/impl-openejb/target/deltaspike-cdictrl-openejb-0.7-SNAPSHOT.jar>
to org.apache.deltaspike.cdictrl/deltaspike-cdictrl-openejb/0.7-SNAPSHOT/deltaspike-cdictrl-openejb-0.7-SNAPSHOT.jar
[JENKINS] Archiving <https://builds.apache.org/job/DeltaSpike%20Weld%202.1.1/ws/deltaspike/cdictrl/impl-openejb/target/deltaspike-cdictrl-openejb-0.7-SNAPSHOT-sources.jar>
to org.apache.deltaspike.cdictrl/deltaspike-cdictrl-openejb/0.7-SNAPSHOT/deltaspike-cdictrl-openejb-0.7-SNAPSHOT-sources.jar
[JENKINS] Archiving <https://builds.apache.org/job/DeltaSpike%20Weld%202.1.1/ws/deltaspike/examples/jsf-examples/pom.xml>
to org.apache.deltaspike.examples/deltaspike-jsf-example/0.7-SNAPSHOT/deltaspike-jsf-example-0.7-SNAPSHOT.pom
[JENKINS] Archiving <https://builds.apache.org/job/DeltaSpike%20Weld%202.1.1/ws/deltaspike/examples/pom.xml>
to org.apache.deltaspike.examples/examples-project/0.7-SNAPSHOT/examples-project-0.7-SNAPSHOT.pom
[JENKINS] Archiving <https://builds.apache.org/job/DeltaSpike%20Weld%202.1.1/ws/deltaspike/modules/jpa/pom.xml>
to org.apache.deltaspike.modules/jpa-module-project/0.7-SNAPSHOT/jpa-module-project-0.7-SNAPSHOT.pom
[JENKINS] Archiving <https://builds.apache.org/job/DeltaSpike%20Weld%202.1.1/ws/deltaspike/modules/jpa/target/jpa-module-project-0.7-SNAPSHOT-tests.jar>
to org.apache.deltaspike.modules/jpa-module-project/0.7-SNAPSHOT/jpa-module-project-0.7-SNAPSHOT-tests.jar
[JENKINS] Archiving <https://builds.apache.org/job/DeltaSpike%20Weld%202.1.1/ws/deltaspike/modules/servlet/pom.xml>
to org.apache.deltaspike.modules/servlet-module-project/0.7-SNAPSHOT/servlet-module-project-0.7-SNAPSHOT.pom
[JENKINS] Archiving <https://builds.apache.org/job/DeltaSpike%20Weld%202.1.1/ws/deltaspike/modules/servlet/target/servlet-module-project-0.7-SNAPSHOT-tests.jar>
to org.apache.deltaspike.modules/servlet-module-project/0.7-SNAPSHOT/servlet-module-project-0.7-SNAPSHOT-tests.jar
[JENKINS] Archiving <https://builds.apache.org/job/DeltaSpike%20Weld%202.1.1/ws/deltaspike/pom.xml>
to org.apache.deltaspike/deltaspike-project/0.7-SNAPSHOT/deltaspike-project-0.7-SNAPSHOT.pom
[JENKINS] Archiving <https://builds.apache.org/job/DeltaSpike%20Weld%202.1.1/ws/deltaspike/core/pom.xml>
to org.apache.deltaspike.core/core-project/0.7-SNAPSHOT/core-project-0.7-SNAPSHOT.pom
[JENKINS] Archiving <https://builds.apache.org/job/DeltaSpike%20Weld%202.1.1/ws/deltaspike/core/target/core-project-0.7-SNAPSHOT-tests.jar>
to org.apache.deltaspike.core/core-project/0.7-SNAPSHOT/core-project-0.7-SNAPSHOT-tests.jar
[JENKINS] Archiving <https://builds.apache.org/job/DeltaSpike%20Weld%202.1.1/ws/deltaspike/core/impl/pom.xml>
to org.apache.deltaspike.core/deltaspike-core-impl/0.7-SNAPSHOT/deltaspike-core-impl-0.7-SNAPSHOT.pom
[JENKINS] Archiving <https://builds.apache.org/job/DeltaSpike%20Weld%202.1.1/ws/deltaspike/core/impl/target/deltaspike-core-impl-0.7-SNAPSHOT.jar>
to org.apache.deltaspike.core/deltaspike-core-impl/0.7-SNAPSHOT/deltaspike-core-impl-0.7-SNAPSHOT.jar
[JENKINS] Archiving <https://builds.apache.org/job/DeltaSpike%20Weld%202.1.1/ws/deltaspike/core/impl/target/deltaspike-core-impl-0.7-SNAPSHOT-tests.jar>
to org.apache.deltaspike.core/deltaspike-core-impl/0.7-SNAPSHOT/deltaspike-core-impl-0.7-SNAPSHOT-tests.jar
[JENKINS] Archiving <https://builds.apache.org/job/DeltaSpike%20Weld%202.1.1/ws/deltaspike/core/impl/target/deltaspike-core-impl-0.7-SNAPSHOT-sources.jar>
to org.apache.deltaspike.core/deltaspike-core-impl/0.7-SNAPSHOT/deltaspike-core-impl-0.7-SNAPSHOT-sources.jar
[JENKINS] Archiving <https://builds.apache.org/job/DeltaSpike%20Weld%202.1.1/ws/deltaspike/modules/partial-bean/pom.xml>
to org.apache.deltaspike.modules/partial-bean-module-project/0.7-SNAPSHOT/partial-bean-module-project-0.7-SNAPSHOT.pom
[JENKINS] Archiving <https://builds.apache.org/job/DeltaSpike%20Weld%202.1.1/ws/deltaspike/cdictrl/impl-weld/pom.xml>
to org.apache.deltaspike.cdictrl/deltaspike-cdictrl-weld/0.7-SNAPSHOT/deltaspike-cdictrl-weld-0.7-SNAPSHOT.pom
[JENKINS] Archiving <https://builds.apache.org/job/DeltaSpike%20Weld%202.1.1/ws/deltaspike/cdictrl/impl-weld/target/deltaspike-cdictrl-weld-0.7-SNAPSHOT.jar>
to org.apache.deltaspike.cdictrl/deltaspike-cdictrl-weld/0.7-SNAPSHOT/deltaspike-cdictrl-weld-0.7-SNAPSHOT.jar
[JENKINS] Archiving <https://builds.apache.org/job/DeltaSpike%20Weld%202.1.1/ws/deltaspike/cdictrl/impl-weld/target/deltaspike-cdictrl-weld-0.7-SNAPSHOT-sources.jar>
to org.apache.deltaspike.cdictrl/deltaspike-cdictrl-weld/0.7-SNAPSHOT/deltaspike-cdictrl-weld-0.7-SNAPSHOT-sources.jar
[JENKINS] Archiving <https://builds.apache.org/job/DeltaSpike%20Weld%202.1.1/ws/deltaspike/cdictrl/impl-owb/pom.xml>
to org.apache.deltaspike.cdictrl/deltaspike-cdictrl-owb/0.7-SNAPSHOT/deltaspike-cdictrl-owb-0.7-SNAPSHOT.pom
[JENKINS] Archiving <https://builds.apache.org/job/DeltaSpike%20Weld%202.1.1/ws/deltaspike/cdictrl/impl-owb/target/deltaspike-cdictrl-owb-0.7-SNAPSHOT.jar>
to org.apache.deltaspike.cdictrl/deltaspike-cdictrl-owb/0.7-SNAPSHOT/deltaspike-cdictrl-owb-0.7-SNAPSHOT.jar
[JENKINS] Archiving <https://builds.apache.org/job/DeltaSpike%20Weld%202.1.1/ws/deltaspike/cdictrl/impl-owb/target/deltaspike-cdictrl-owb-0.7-SNAPSHOT-sources.jar>
to org.apache.deltaspike.cdictrl/deltaspike-cdictrl-owb/0.7-SNAPSHOT/deltaspike-cdictrl-owb-0.7-SNAPSHOT-sources.jar
[JENKINS] Archiving <https://builds.apache.org/job/DeltaSpike%20Weld%202.1.1/ws/deltaspike/parent/pom.xml>
to org.apache.deltaspike/parent/0.7-SNAPSHOT/parent-0.7-SNAPSHOT.pom
Sending e-mails to: commits@deltaspike.apache.org
channel stopped

Mime
View raw message