deltaspike-commits mailing list archives

Site index · List index
Message view « Date » · « Thread »
Top « Date » · « Thread »
From Apache Jenkins Server <jenk...@builds.apache.org>
Subject Build failed in Jenkins: DeltaSpike_AS7 » Apache DeltaSpike CDI OpenEJB-ContainerControl #99
Date Sat, 01 Mar 2014 00:15:46 GMT
See <https://builds.apache.org/job/DeltaSpike_AS7/org.apache.deltaspike.cdictrl$deltaspike-cdictrl-openejb/99/>

------------------------------------------
[INFO]                                                                         
[INFO] ------------------------------------------------------------------------
[INFO] Building Apache DeltaSpike CDI OpenEJB-ContainerControl 0.6-SNAPSHOT
[INFO] ------------------------------------------------------------------------
[INFO] 
[INFO] --- maven-clean-plugin:2.5:clean (default-clean) @ deltaspike-cdictrl-openejb ---
[INFO] Deleting <https://builds.apache.org/job/DeltaSpike_AS7/org.apache.deltaspike.cdictrl$deltaspike-cdictrl-openejb/ws/target>
[INFO] 
[INFO] --- maven-bundle-plugin:2.3.7:cleanVersions (versions) @ deltaspike-cdictrl-openejb
---
[INFO] 
[INFO] --- maven-antrun-plugin:1.6:run (javadoc.resources) @ deltaspike-cdictrl-openejb ---
[WARNING] Parameter tasks is deprecated, use target instead
[INFO] Executing tasks

main:
[INFO] Executed tasks
[INFO] 
[INFO] --- maven-dependency-plugin:2.4:unpack (unpack-context) @ deltaspike-cdictrl-openejb
---
[INFO] Configured Artifact: org.apache.deltaspike.cdictrl:deltaspike-cdictrl-owb:0.6-SNAPSHOT:jar
[INFO] Unpacking /home/jenkins/jenkins-slave/workspace/DeltaSpike_AS7/deltaspike/cdictrl/impl-owb/target/deltaspike-cdictrl-owb-0.6-SNAPSHOT.jar
to <https://builds.apache.org/job/DeltaSpike_AS7/org.apache.deltaspike.cdictrl$deltaspike-cdictrl-openejb/ws/target/classes>
with includes "" and excludes "**\/META-INF\/**,**\/OpenWebBeansContainerControl.class"
[INFO] 
[INFO] --- maven-remote-resources-plugin:1.3:process (process-remote-resources) @ deltaspike-cdictrl-openejb
---
[INFO] 
[INFO] --- maven-remote-resources-plugin:1.3:process (default) @ deltaspike-cdictrl-openejb
---
[INFO] 
[INFO] --- maven-resources-plugin:2.5:resources (default-resources) @ deltaspike-cdictrl-openejb
---
[debug] execute contextualize
[INFO] Using 'UTF-8' encoding to copy filtered resources.
[INFO] Copying 2 resources
[INFO] Copying 4 resources
[INFO] Copying 4 resources
[INFO] 
[INFO] --- maven-compiler-plugin:2.5:compile (default-compile) @ deltaspike-cdictrl-openejb
---
[INFO] Compiling 1 source file to <https://builds.apache.org/job/DeltaSpike_AS7/org.apache.deltaspike.cdictrl$deltaspike-cdictrl-openejb/ws/target/classes>
[INFO] 
[INFO] --- maven-resources-plugin:2.5:testResources (default-testResources) @ deltaspike-cdictrl-openejb
---
[debug] execute contextualize
[INFO] Using 'UTF-8' encoding to copy filtered resources.
[INFO] skip non existing resourceDirectory <https://builds.apache.org/job/DeltaSpike_AS7/org.apache.deltaspike.cdictrl$deltaspike-cdictrl-openejb/ws/src/test/resources>
[INFO] Copying 4 resources
[INFO] Copying 4 resources
[INFO] 
[INFO] --- maven-compiler-plugin:2.5:testCompile (default-testCompile) @ deltaspike-cdictrl-openejb
---
[INFO] Compiling 2 source files to <https://builds.apache.org/job/DeltaSpike_AS7/org.apache.deltaspike.cdictrl$deltaspike-cdictrl-openejb/ws/target/test-classes>
[INFO] 
[INFO] --- maven-dependency-plugin:2.4:unpack (unpack) @ deltaspike-cdictrl-openejb ---
[INFO] Configured Artifact: org.apache.deltaspike.test:deltaspike-cdictrl-tck:0.6-SNAPSHOT:jar
[INFO] Unpacking /home/jenkins/jenkins-slave/workspace/DeltaSpike_AS7/deltaspike/cdictrl/tck/target/deltaspike-cdictrl-tck-0.6-SNAPSHOT.jar
to <https://builds.apache.org/job/DeltaSpike_AS7/org.apache.deltaspike.cdictrl$deltaspike-cdictrl-openejb/ws/target/test-classes>
with includes "" and excludes ""
[INFO] 
[INFO] --- maven-surefire-plugin:2.11:test (default-test) @ deltaspike-cdictrl-openejb ---
[INFO] Surefire report directory: <https://builds.apache.org/job/DeltaSpike_AS7/org.apache.deltaspike.cdictrl$deltaspike-cdictrl-openejb/ws/target/surefire-reports>
[INFO] Using configured provider org.apache.maven.surefire.junitcore.JUnitCoreProvider

-------------------------------------------------------
 T E S T S
-------------------------------------------------------
Concurrency config is parallel='none', perCoreThreadCount=true, threadCount=2, useUnlimitedThreads=false
Running org.apache.deltaspike.cdise.tck.ContainerCtrlTckTest
Exception in thread "ThreadedStreamConsumer" org.apache.maven.surefire.util.NestedRuntimeException:
null; nested exception is org.apache.maven.surefire.report.ReporterException: Unable to create
file for report: <https://builds.apache.org/job/DeltaSpike_AS7/org.apache.deltaspike.cdictrl$deltaspike-cdictrl-openejb/ws/target/surefire-reports/org.apache.deltaspike.cdise.tck.ContainerCtrlTckTest.txt>
(No such file or directory); nested exception is java.io.FileNotFoundException: <https://builds.apache.org/job/DeltaSpike_AS7/org.apache.deltaspike.cdictrl$deltaspike-cdictrl-openejb/ws/target/surefire-reports/org.apache.deltaspike.cdise.tck.ContainerCtrlTckTest.txt>
(No such file or directory)
org.apache.maven.surefire.report.ReporterException: Unable to create file for report: <https://builds.apache.org/job/DeltaSpike_AS7/org.apache.deltaspike.cdictrl$deltaspike-cdictrl-openejb/ws/target/surefire-reports/org.apache.deltaspike.cdise.tck.ContainerCtrlTckTest.txt>
(No such file or directory); nested exception is java.io.FileNotFoundException: <https://builds.apache.org/job/DeltaSpike_AS7/org.apache.deltaspike.cdictrl$deltaspike-cdictrl-openejb/ws/target/surefire-reports/org.apache.deltaspike.cdise.tck.ContainerCtrlTckTest.txt>
(No such file or directory)
java.io.FileNotFoundException: <https://builds.apache.org/job/DeltaSpike_AS7/org.apache.deltaspike.cdictrl$deltaspike-cdictrl-openejb/ws/target/surefire-reports/org.apache.deltaspike.cdise.tck.ContainerCtrlTckTest.txt>
(No such file or directory)
	at java.io.FileOutputStream.open(Native Method)
	at java.io.FileOutputStream.<init>(FileOutputStream.java:194)
	at java.io.FileOutputStream.<init>(FileOutputStream.java:145)
	at java.io.FileWriter.<init>(FileWriter.java:73)
	at org.apache.maven.surefire.report.AbstractFileReporter.testSetStarting(AbstractFileReporter.java:74)
	at org.apache.maven.surefire.report.MulticastingReporter.testSetStarting(MulticastingReporter.java:44)
	at org.apache.maven.surefire.report.TestSetRunListener.testSetStarting(TestSetRunListener.java:110)
	at org.apache.maven.plugin.surefire.booterclient.output.ForkClient.consumeLine(ForkClient.java:94)
	at org.apache.maven.plugin.surefire.booterclient.output.ThreadedStreamConsumer$Pumper.run(ThreadedStreamConsumer.java:67)
	at java.lang.Thread.run(Thread.java:662)

Results :

Tests run: 0, Failures: 0, Errors: 0, Skipped: 0

[JENKINS] Recording test results
[INFO] 
[INFO] --- maven-jar-plugin:2.4:jar (default-jar) @ deltaspike-cdictrl-openejb ---

Mime
View raw message