deltaspike-commits mailing list archives

Site index · List index
Message view « Date » · « Thread »
Top « Date » · « Thread »
From Apache Jenkins Server <jenk...@builds.apache.org>
Subject Build failed in Jenkins: DeltaSpike OWB 1.2.3-SNAPSHOT #141
Date Sat, 08 Mar 2014 23:41:34 GMT
See <https://builds.apache.org/job/DeltaSpike%20OWB%201.2.3-SNAPSHOT/141/changes>

Changes:

[Thomas.Hug] DELTASPIKE-518 Refactored test for Arquillian

[tandraschko] DELTASPIKE-341 Bridge between JSF and DS Exception Handling

[tandraschko] DELTASPIKE-341 cache exception qualifier

[gpetracek] DELTASPIKE-515 MockedJsfTestContainerAdapter

[gpetracek] DELTASPIKE-524 preserve view-parameters

[gpetracek] DELTASPIKE-525 unification of @Initialized and @Destroyed

[gpetracek] DELTASPIKE-526 updated pom.xml files

[gpetracek] DELTASPIKE-527 @Named support for type-safe messages (first draft)

[tandraschko] DELTASPIKE-529 fixed initialization in non-EE environment

[gpetracek] DELTASPIKE-528 ContextController#stopApplicationScope fixed

[gpetracek] DELTASPIKE-530 deactivatable extensions

[Thomas.Hug] DELTASPIKE-420 Repository integration with TransactionStrategy

[tommy] DELTASPIKE-529 better lazy init

[tandraschko] DELTASPIKE-487 ViewAccessScoped prototype

[tommy] DELTASPIKE-487 removed unused logic

[tandraschko] DELTASPIKE-487 removed unused logic

[tandraschko] DELTASPIKE-487 removed unused logic (thanks netbeans)

[tandraschko] DELTASPIKE-487 removed unused logic (thanks netbeans for destroying my workspace)

[tandraschko] DELTASPIKE-487 added sample, simple unit test and bug fixes

[gpetracek] DELTASPIKE-487 tests and minor cleanup

[tandraschko] DELTASPIKE-487 fixed JSF forward + added unit test

[tandraschko] DELTASPIKE-487 moved navigation logic to own NavigationHandler

[tandraschko] DELTASPIKE-487 better deactivatable handling of the navigation handler

[tandraschko] DELTASPIKE-487 accessedBeans can be RequestScoped

[gpetracek] DELTASPIKE-399 simplified usage of ExternalResourceProvider

[gpetracek] DELTASPIKE-399 simplified usage of ExternalResourceProvider

[Thomas.Hug] DELTASPIKE-420 Refactored JPA-module hook for externally resolved EM

[Thomas.Hug] DELTASPIKE-420 Move EM holder into JPA module API

[Thomas.Hug] DELTASPIKE-420 Cleanup README, link to main documentation.

[gpetracek] DELTASPIKE-523 unified structure

[tandraschko] DELTASPIKE-532 DeltaSpikeFacesContextFactory construction issue in non EE

[tandraschko] DELTASPIKE-535 DeltaSpikeViewHandler construction issue in non EE

[tandraschko] DELTASPIKE-502 removed TODO - already done

[gpetracek] DELTASPIKE-492 fixed setup for unit-tests

[gpetracek] DELTASPIKE-531 @InjectableResource

[tandraschko] DELTASPIKE-533 Introduce a global deltaspike qualifier

[tandraschko] DELTASPIKE-534 Replace @Web with @DeltaSpike

[tandraschko] DELTASPIKE-533 Add @DeltaSpike

[gpetracek] DELTASPIKE-536 aligned creation of test-archives

[rmannibucau] DELTASPIKE-537 using an arquillian archive appender to enrich apps with test
utilities when needed instead of doing it manually and breaking app scanning

------------------------------------------
[...truncated 199 lines...]
[INFO] 
[INFO] --- maven-remote-resources-plugin:1.3:process (default) @ test-utils ---
[INFO] 
[INFO] --- maven-resources-plugin:2.5:resources (default-resources) @ test-utils ---
[debug] execute contextualize
[INFO] Using 'UTF-8' encoding to copy filtered resources.
[INFO] Copying 3 resources
[INFO] Copying 4 resources
[INFO] Copying 4 resources
[INFO] 
[INFO] --- maven-compiler-plugin:2.5:compile (default-compile) @ test-utils ---
[INFO] Compiling 11 source files to <https://builds.apache.org/job/DeltaSpike%20OWB%201.2.3-SNAPSHOT/ws/deltaspike/test-utils/target/classes>
[INFO] 
[INFO] --- maven-resources-plugin:2.5:testResources (default-testResources) @ test-utils ---
[debug] execute contextualize
[INFO] Using 'UTF-8' encoding to copy filtered resources.
[INFO] skip non existing resourceDirectory <https://builds.apache.org/job/DeltaSpike%20OWB%201.2.3-SNAPSHOT/ws/deltaspike/test-utils/src/test/resources>
[INFO] Copying 4 resources
[INFO] Copying 4 resources
[INFO] 
[INFO] --- maven-compiler-plugin:2.5:testCompile (default-testCompile) @ test-utils ---
[INFO] No sources to compile
[INFO] 
[INFO] --- maven-surefire-plugin:2.11:test (default-test) @ test-utils ---
[INFO] Surefire report directory: <https://builds.apache.org/job/DeltaSpike%20OWB%201.2.3-SNAPSHOT/ws/deltaspike/test-utils/target/surefire-reports>
[INFO] Using configured provider org.apache.maven.surefire.junitcore.JUnitCoreProvider

-------------------------------------------------------
 T E S T S
-------------------------------------------------------
Concurrency config is parallel='none', perCoreThreadCount=true, threadCount=2, useUnlimitedThreads=false

Results :

Tests run: 0, Failures: 0, Errors: 0, Skipped: 0

[JENKINS] Recording test results
[INFO] 
[INFO] --- maven-jar-plugin:2.4:jar (default-jar) @ test-utils ---
[INFO] Building jar: <https://builds.apache.org/job/DeltaSpike%20OWB%201.2.3-SNAPSHOT/ws/deltaspike/test-utils/target/test-utils-0.6-SNAPSHOT.jar>
[INFO] 
[INFO] --- maven-site-plugin:3.1:attach-descriptor (attach-descriptor) @ test-utils ---
[INFO] 
[INFO] --- maven-bundle-plugin:2.3.7:cleanVersions (versions) @ test-utils ---
[INFO] 
[INFO] --- maven-antrun-plugin:1.6:run (javadoc.resources) @ test-utils ---
[WARNING] Parameter tasks is deprecated, use target instead
[INFO] Executing tasks

main:
[INFO] Executed tasks
[WARNING] Failed to getClass for org.apache.maven.plugin.source.SourceJarMojo
[INFO] 
[INFO] --- maven-source-plugin:2.1.2:jar (attach-sources) @ test-utils ---
[INFO] META-INF already added, skipping
[INFO] META-INF/DISCLAIMER already added, skipping
[INFO] META-INF/LICENSE already added, skipping
[INFO] META-INF/NOTICE already added, skipping
[INFO] META-INF/DEPENDENCIES already added, skipping
[INFO] META-INF already added, skipping
[INFO] META-INF already added, skipping
[INFO] META-INF/DISCLAIMER already added, skipping
[INFO] META-INF/LICENSE already added, skipping
[INFO] META-INF/NOTICE already added, skipping
[INFO] META-INF/DEPENDENCIES already added, skipping
[INFO] META-INF already added, skipping
[INFO] META-INF/DISCLAIMER already added, skipping
[INFO] META-INF/LICENSE already added, skipping
[INFO] META-INF/NOTICE already added, skipping
[INFO] META-INF/DEPENDENCIES already added, skipping
[INFO] Building jar: <https://builds.apache.org/job/DeltaSpike%20OWB%201.2.3-SNAPSHOT/ws/deltaspike/test-utils/target/test-utils-0.6-SNAPSHOT-sources.jar>
[INFO] META-INF already added, skipping
[INFO] META-INF/DISCLAIMER already added, skipping
[INFO] META-INF/LICENSE already added, skipping
[INFO] META-INF/NOTICE already added, skipping
[INFO] META-INF/DEPENDENCIES already added, skipping
[INFO] META-INF already added, skipping
[INFO] META-INF already added, skipping
[INFO] META-INF/DISCLAIMER already added, skipping
[INFO] META-INF/LICENSE already added, skipping
[INFO] META-INF/NOTICE already added, skipping
[INFO] META-INF/DEPENDENCIES already added, skipping
[INFO] META-INF already added, skipping
[INFO] META-INF/DISCLAIMER already added, skipping
[INFO] META-INF/LICENSE already added, skipping
[INFO] META-INF/NOTICE already added, skipping
[INFO] META-INF/DEPENDENCIES already added, skipping
[INFO] 
[INFO] --- maven-checkstyle-plugin:2.9.1:check (verify-style) @ test-utils ---
[INFO] Starting audit...
Audit done.

[INFO] 
[INFO] --- maven-install-plugin:2.3.1:install (default-install) @ test-utils ---
[INFO] Installing <https://builds.apache.org/job/DeltaSpike%20OWB%201.2.3-SNAPSHOT/ws/deltaspike/test-utils/target/test-utils-0.6-SNAPSHOT.jar>
to /home/jenkins/jenkins-slave/maven-repositories/1/org/apache/deltaspike/test/test-utils/0.6-SNAPSHOT/test-utils-0.6-SNAPSHOT.jar
[INFO] Installing <https://builds.apache.org/job/DeltaSpike%20OWB%201.2.3-SNAPSHOT/ws/deltaspike/test-utils/pom.xml>
to /home/jenkins/jenkins-slave/maven-repositories/1/org/apache/deltaspike/test/test-utils/0.6-SNAPSHOT/test-utils-0.6-SNAPSHOT.pom
[INFO] Installing <https://builds.apache.org/job/DeltaSpike%20OWB%201.2.3-SNAPSHOT/ws/deltaspike/test-utils/target/test-utils-0.6-SNAPSHOT-sources.jar>
to /home/jenkins/jenkins-slave/maven-repositories/1/org/apache/deltaspike/test/test-utils/0.6-SNAPSHOT/test-utils-0.6-SNAPSHOT-sources.jar
[INFO]                                                                         
[INFO] ------------------------------------------------------------------------
[INFO] Building Apache DeltaSpike Code Parent 0.6-SNAPSHOT
[INFO] ------------------------------------------------------------------------
Downloading: http://repository.apache.org/snapshots/org/apache/openwebbeans/openwebbeans-impl/1.2.3-SNAPSHOT/maven-metadata.xml
Downloading: https://repository.apache.org/content/repositories/snapshots/org/apache/openwebbeans/openwebbeans-impl/1.2.3-SNAPSHOT/maven-metadata.xml
Downloading: https://repository.apache.org/content/repositories/releases/org/apache/openwebbeans/openwebbeans-impl/1.2.3-SNAPSHOT/maven-metadata.xml
Downloading: https://repository.apache.org/content/repositories/releases/org/apache/openwebbeans/openwebbeans-impl/1.2.3-SNAPSHOT/openwebbeans-impl-1.2.3-SNAPSHOT.pom
Downloading: https://repository.apache.org/content/repositories/snapshots/org/apache/openwebbeans/openwebbeans-impl/1.2.3-SNAPSHOT/openwebbeans-impl-1.2.3-SNAPSHOT.pom
Downloading: http://repository.apache.org/snapshots/org/apache/openwebbeans/openwebbeans-impl/1.2.3-SNAPSHOT/openwebbeans-impl-1.2.3-SNAPSHOT.pom
[WARNING] The POM for org.apache.openwebbeans:openwebbeans-impl:jar:1.2.3-SNAPSHOT is missing,
no dependency information available
Downloading: https://repository.apache.org/content/repositories/releases/org/apache/openwebbeans/openwebbeans-spi/1.2.3-SNAPSHOT/maven-metadata.xml
Downloading: http://repository.apache.org/snapshots/org/apache/openwebbeans/openwebbeans-spi/1.2.3-SNAPSHOT/maven-metadata.xml
Downloading: https://repository.apache.org/content/repositories/snapshots/org/apache/openwebbeans/openwebbeans-spi/1.2.3-SNAPSHOT/maven-metadata.xml
Downloading: https://repository.apache.org/content/repositories/releases/org/apache/openwebbeans/openwebbeans-spi/1.2.3-SNAPSHOT/openwebbeans-spi-1.2.3-SNAPSHOT.pom
Downloading: https://repository.apache.org/content/repositories/snapshots/org/apache/openwebbeans/openwebbeans-spi/1.2.3-SNAPSHOT/openwebbeans-spi-1.2.3-SNAPSHOT.pom
Downloading: http://repository.apache.org/snapshots/org/apache/openwebbeans/openwebbeans-spi/1.2.3-SNAPSHOT/openwebbeans-spi-1.2.3-SNAPSHOT.pom
[WARNING] The POM for org.apache.openwebbeans:openwebbeans-spi:jar:1.2.3-SNAPSHOT is missing,
no dependency information available
Downloading: https://repository.apache.org/content/repositories/releases/org/apache/openwebbeans/openwebbeans-resource/1.2.3-SNAPSHOT/maven-metadata.xml
Downloading: http://repository.apache.org/snapshots/org/apache/openwebbeans/openwebbeans-resource/1.2.3-SNAPSHOT/maven-metadata.xml
Downloading: https://repository.apache.org/content/repositories/snapshots/org/apache/openwebbeans/openwebbeans-resource/1.2.3-SNAPSHOT/maven-metadata.xml
Downloading: https://repository.apache.org/content/repositories/releases/org/apache/openwebbeans/openwebbeans-resource/1.2.3-SNAPSHOT/openwebbeans-resource-1.2.3-SNAPSHOT.pom
Downloading: https://repository.apache.org/content/repositories/snapshots/org/apache/openwebbeans/openwebbeans-resource/1.2.3-SNAPSHOT/openwebbeans-resource-1.2.3-SNAPSHOT.pom
Downloading: http://repository.apache.org/snapshots/org/apache/openwebbeans/openwebbeans-resource/1.2.3-SNAPSHOT/openwebbeans-resource-1.2.3-SNAPSHOT.pom
[WARNING] The POM for org.apache.openwebbeans:openwebbeans-resource:jar:1.2.3-SNAPSHOT is
missing, no dependency information available
Downloading: https://repository.apache.org/content/repositories/releases/org/apache/openwebbeans/openwebbeans-resource/1.2.3-SNAPSHOT/openwebbeans-resource-1.2.3-SNAPSHOT.jar
Downloading: https://repository.apache.org/content/repositories/releases/org/apache/openwebbeans/openwebbeans-impl/1.2.3-SNAPSHOT/openwebbeans-impl-1.2.3-SNAPSHOT.jar
Downloading: https://repository.apache.org/content/repositories/releases/org/apache/openwebbeans/openwebbeans-spi/1.2.3-SNAPSHOT/openwebbeans-spi-1.2.3-SNAPSHOT.jar
Downloading: https://repository.apache.org/content/repositories/snapshots/org/apache/openwebbeans/openwebbeans-spi/1.2.3-SNAPSHOT/openwebbeans-spi-1.2.3-SNAPSHOT.jar
Downloading: https://repository.apache.org/content/repositories/snapshots/org/apache/openwebbeans/openwebbeans-resource/1.2.3-SNAPSHOT/openwebbeans-resource-1.2.3-SNAPSHOT.jar
Downloading: https://repository.apache.org/content/repositories/snapshots/org/apache/openwebbeans/openwebbeans-impl/1.2.3-SNAPSHOT/openwebbeans-impl-1.2.3-SNAPSHOT.jar
Downloading: http://repository.apache.org/snapshots/org/apache/openwebbeans/openwebbeans-impl/1.2.3-SNAPSHOT/openwebbeans-impl-1.2.3-SNAPSHOT.jar
Downloading: http://repository.apache.org/snapshots/org/apache/openwebbeans/openwebbeans-spi/1.2.3-SNAPSHOT/openwebbeans-spi-1.2.3-SNAPSHOT.jar
Downloading: http://repository.apache.org/snapshots/org/apache/openwebbeans/openwebbeans-resource/1.2.3-SNAPSHOT/openwebbeans-resource-1.2.3-SNAPSHOT.jar
[INFO] ------------------------------------------------------------------------
[INFO] Reactor Summary:
[INFO] 
[INFO] Apache DeltaSpike ................................. SUCCESS [19.650s]
[INFO] Apache DeltaSpike CheckStyle-rules ................ SUCCESS [4.245s]
[INFO] Apache DeltaSpike Parent .......................... SUCCESS [7.090s]
[INFO] Apache DeltaSpike Test-Utils ...................... SUCCESS [7.243s]
[INFO] Apache DeltaSpike Code Parent ..................... FAILURE [3.856s]
[INFO] Apache DeltaSpike Core ............................ SKIPPED
[INFO] Apache DeltaSpike Core-API ........................ SKIPPED
[INFO] Apache DeltaSpike Core-Implementation ............. SKIPPED
[INFO] Apache DeltaSpike ContainerControl parent ......... SKIPPED
[INFO] Apache DeltaSpike CDI ContainerControl API ........ SKIPPED
[INFO] Apache DeltaSpike CDI ContainerControl TCK ........ SKIPPED
[INFO] Apache DeltaSpike CDI OWB-ContainerControl ........ SKIPPED
[INFO] Apache DeltaSpike CDI Weld-ContainerControl ....... SKIPPED
[INFO] Apache DeltaSpike CDI OpenEJB-ContainerControl .... SKIPPED
[INFO] Apache DeltaSpike Modules ......................... SKIPPED
[INFO] Apache DeltaSpike Security-Module ................. SKIPPED
[INFO] Apache DeltaSpike Security-Module API ............. SKIPPED
[INFO] Apache DeltaSpike Security-Module Impl ............ SKIPPED
[INFO] Apache DeltaSpike JPA-Module ...................... SKIPPED
[INFO] Apache DeltaSpike JPA-Module API .................. SKIPPED
[INFO] Apache DeltaSpike JPA-Module Impl ................. SKIPPED
[INFO] Apache DeltaSpike Servlet-Module .................. SKIPPED
[INFO] Apache DeltaSpike Servlet-Module API .............. SKIPPED
[INFO] Apache DeltaSpike Servlet-Module Impl ............. SKIPPED
[INFO] Apache DeltaSpike JSF-Module ...................... SKIPPED
[INFO] Apache DeltaSpike JSF-Module API .................. SKIPPED
[INFO] Apache DeltaSpike JSF-Module Impl ................. SKIPPED
[INFO] Apache DeltaSpike Partial-Bean-Module ............. SKIPPED
[INFO] Apache DeltaSpike Partial-Bean-Module API ......... SKIPPED
[INFO] Apache DeltaSpike Partial-Bean-Module Impl ........ SKIPPED
[INFO] Apache DeltaSpike BeanValidation-Module ........... SKIPPED
[INFO] Apache DeltaSpike BeanValidation-Module API ....... SKIPPED
[INFO] Apache DeltaSpike BeanValidation-Module Impl ...... SKIPPED
[INFO] Apache DeltaSpike Data-Module ..................... SKIPPED
[INFO] Apache DeltaSpike Data-Module API ................. SKIPPED
[INFO] Apache DeltaSpike Data-Module Impl ................ SKIPPED
[INFO] Apache DeltaSpike Scheduler-Module ................ SKIPPED
[INFO] Apache DeltaSpike Scheduler-Module API ............ SKIPPED
[INFO] Apache DeltaSpike Scheduler-Module Impl ........... SKIPPED
[INFO] Apache DeltaSpike Test-Control-Module ............. SKIPPED
[INFO] Apache DeltaSpike Test-Control-Module API ......... SKIPPED
[INFO] Apache DeltaSpike Test-Control-Module Impl ........ SKIPPED
[INFO] Apache DeltaSpike Examples ........................ SKIPPED
[INFO] Apache DeltaSpike Java-SE Examples ................ SKIPPED
[INFO] Apache DeltaSpike JSF Examples .................... SKIPPED
[INFO] Apache DeltaSpike JSF Playground .................. SKIPPED
[INFO] ------------------------------------------------------------------------
[INFO] BUILD FAILURE
[INFO] ------------------------------------------------------------------------
[INFO] Total time: 54.978s
[INFO] Finished at: Sat Mar 08 23:40:48 UTC 2014
[INFO] Final Memory: 36M/291M
[INFO] ------------------------------------------------------------------------
Waiting for Jenkins to finish collecting data[ERROR] Failed to execute goal on project parent-code:
Could not resolve dependencies for project org.apache.deltaspike:parent-code:pom:0.6-SNAPSHOT:
The following artifacts could not be resolved: org.apache.openwebbeans:openwebbeans-impl:jar:1.2.3-SNAPSHOT,
org.apache.openwebbeans:openwebbeans-spi:jar:1.2.3-SNAPSHOT, org.apache.openwebbeans:openwebbeans-resource:jar:1.2.3-SNAPSHOT:
Could not find artifact org.apache.openwebbeans:openwebbeans-impl:jar:1.2.3-SNAPSHOT in Apache
Repository (https://repository.apache.org/content/repositories/releases) -> [Help 1]
[ERROR] 
[ERROR] To see the full stack trace of the errors, re-run Maven with the -e switch.
[ERROR] Re-run Maven using the -X switch to enable full debug logging.
[ERROR] 
[ERROR] For more information about the errors and possible solutions, please read the following
articles:
[ERROR] [Help 1] http://cwiki.apache.org/confluence/display/MAVEN/DependencyResolutionException
[ERROR] 
[ERROR] After correcting the problems, you can resume the build with the command
[ERROR]   mvn <goals> -rf :parent-code

[JENKINS] Archiving <https://builds.apache.org/job/DeltaSpike%20OWB%201.2.3-SNAPSHOT/ws/deltaspike/modules/partial-bean/api/pom.xml>
to org.apache.deltaspike.modules/deltaspike-partial-bean-module-api/0.6-SNAPSHOT/deltaspike-partial-bean-module-api-0.6-SNAPSHOT.pom
[JENKINS] Archiving <https://builds.apache.org/job/DeltaSpike%20OWB%201.2.3-SNAPSHOT/ws/deltaspike/modules/scheduler/impl/pom.xml>
to org.apache.deltaspike.modules/deltaspike-scheduler-module-impl/0.6-SNAPSHOT/deltaspike-scheduler-module-impl-0.6-SNAPSHOT.pom
[JENKINS] Archiving <https://builds.apache.org/job/DeltaSpike%20OWB%201.2.3-SNAPSHOT/ws/deltaspike/parent/pom.xml>
to org.apache.deltaspike/parent/0.6-SNAPSHOT/parent-0.6-SNAPSHOT.pom
[JENKINS] Archiving <https://builds.apache.org/job/DeltaSpike%20OWB%201.2.3-SNAPSHOT/ws/deltaspike/examples/jse-examples/pom.xml>
to org.apache.deltaspike.examples/deltaspike-jse-example/0.6-SNAPSHOT/deltaspike-jse-example-0.6-SNAPSHOT.pom
[JENKINS] Archiving <https://builds.apache.org/job/DeltaSpike%20OWB%201.2.3-SNAPSHOT/ws/deltaspike/modules/bean-validation/api/pom.xml>
to org.apache.deltaspike.modules/deltaspike-bean-validation-module-api/0.6-SNAPSHOT/deltaspike-bean-validation-module-api-0.6-SNAPSHOT.pom
[JENKINS] Archiving <https://builds.apache.org/job/DeltaSpike%20OWB%201.2.3-SNAPSHOT/ws/deltaspike/core/pom.xml>
to org.apache.deltaspike.core/core-project/0.6-SNAPSHOT/core-project-0.6-SNAPSHOT.pom
[JENKINS] Archiving <https://builds.apache.org/job/DeltaSpike%20OWB%201.2.3-SNAPSHOT/ws/deltaspike/test-utils/pom.xml>
to org.apache.deltaspike.test/test-utils/0.6-SNAPSHOT/test-utils-0.6-SNAPSHOT.pom
[JENKINS] Archiving <https://builds.apache.org/job/DeltaSpike%20OWB%201.2.3-SNAPSHOT/ws/deltaspike/test-utils/target/test-utils-0.6-SNAPSHOT.jar>
to org.apache.deltaspike.test/test-utils/0.6-SNAPSHOT/test-utils-0.6-SNAPSHOT.jar
[JENKINS] Archiving <https://builds.apache.org/job/DeltaSpike%20OWB%201.2.3-SNAPSHOT/ws/deltaspike/test-utils/target/test-utils-0.6-SNAPSHOT-sources.jar>
to org.apache.deltaspike.test/test-utils/0.6-SNAPSHOT/test-utils-0.6-SNAPSHOT-sources.jar
[JENKINS] Archiving <https://builds.apache.org/job/DeltaSpike%20OWB%201.2.3-SNAPSHOT/ws/deltaspike/modules/data/impl/pom.xml>
to org.apache.deltaspike.modules/deltaspike-data-module-impl/0.6-SNAPSHOT/deltaspike-data-module-impl-0.6-SNAPSHOT.pom
[JENKINS] Archiving <https://builds.apache.org/job/DeltaSpike%20OWB%201.2.3-SNAPSHOT/ws/deltaspike/core/api/pom.xml>
to org.apache.deltaspike.core/deltaspike-core-api/0.6-SNAPSHOT/deltaspike-core-api-0.6-SNAPSHOT.pom
[JENKINS] Archiving <https://builds.apache.org/job/DeltaSpike%20OWB%201.2.3-SNAPSHOT/ws/deltaspike/modules/scheduler/pom.xml>
to org.apache.deltaspike.modules/scheduler-module-project/0.6-SNAPSHOT/scheduler-module-project-0.6-SNAPSHOT.pom
[JENKINS] Archiving <https://builds.apache.org/job/DeltaSpike%20OWB%201.2.3-SNAPSHOT/ws/deltaspike/modules/data/api/pom.xml>
to org.apache.deltaspike.modules/deltaspike-data-module-api/0.6-SNAPSHOT/deltaspike-data-module-api-0.6-SNAPSHOT.pom
[JENKINS] Archiving <https://builds.apache.org/job/DeltaSpike%20OWB%201.2.3-SNAPSHOT/ws/deltaspike/modules/security/impl/pom.xml>
to org.apache.deltaspike.modules/deltaspike-security-module-impl/0.6-SNAPSHOT/deltaspike-security-module-impl-0.6-SNAPSHOT.pom
[JENKINS] Archiving <https://builds.apache.org/job/DeltaSpike%20OWB%201.2.3-SNAPSHOT/ws/deltaspike/core/impl/pom.xml>
to org.apache.deltaspike.core/deltaspike-core-impl/0.6-SNAPSHOT/deltaspike-core-impl-0.6-SNAPSHOT.pom
[JENKINS] Archiving <https://builds.apache.org/job/DeltaSpike%20OWB%201.2.3-SNAPSHOT/ws/deltaspike/modules/test-control/pom.xml>
to org.apache.deltaspike.modules/test-control-module-project/0.6-SNAPSHOT/test-control-module-project-0.6-SNAPSHOT.pom
[JENKINS] Archiving <https://builds.apache.org/job/DeltaSpike%20OWB%201.2.3-SNAPSHOT/ws/deltaspike/modules/pom.xml>
to org.apache.deltaspike.modules/modules-project/0.6-SNAPSHOT/modules-project-0.6-SNAPSHOT.pom
[JENKINS] Archiving <https://builds.apache.org/job/DeltaSpike%20OWB%201.2.3-SNAPSHOT/ws/deltaspike/examples/jsf-examples/pom.xml>
to org.apache.deltaspike.examples/deltaspike-jsf-example/0.6-SNAPSHOT/deltaspike-jsf-example-0.6-SNAPSHOT.pom
[JENKINS] Archiving <https://builds.apache.org/job/DeltaSpike%20OWB%201.2.3-SNAPSHOT/ws/deltaspike/cdictrl/api/pom.xml>
to org.apache.deltaspike.cdictrl/deltaspike-cdictrl-api/0.6-SNAPSHOT/deltaspike-cdictrl-api-0.6-SNAPSHOT.pom
[JENKINS] Archiving <https://builds.apache.org/job/DeltaSpike%20OWB%201.2.3-SNAPSHOT/ws/deltaspike/checkstyle-rules/pom.xml>
to org.apache.deltaspike/checkstyle-rules/0.6-SNAPSHOT/checkstyle-rules-0.6-SNAPSHOT.pom
[JENKINS] Archiving <https://builds.apache.org/job/DeltaSpike%20OWB%201.2.3-SNAPSHOT/ws/deltaspike/checkstyle-rules/target/checkstyle-rules-0.6-SNAPSHOT.jar>
to org.apache.deltaspike/checkstyle-rules/0.6-SNAPSHOT/checkstyle-rules-0.6-SNAPSHOT.jar
[JENKINS] Archiving <https://builds.apache.org/job/DeltaSpike%20OWB%201.2.3-SNAPSHOT/ws/deltaspike/parent/code/pom.xml>
to org.apache.deltaspike/parent-code/0.6-SNAPSHOT/parent-code-0.6-SNAPSHOT.pom
[JENKINS] Archiving <https://builds.apache.org/job/DeltaSpike%20OWB%201.2.3-SNAPSHOT/ws/deltaspike/modules/partial-bean/pom.xml>
to org.apache.deltaspike.modules/partial-bean-module-project/0.6-SNAPSHOT/partial-bean-module-project-0.6-SNAPSHOT.pom
[JENKINS] Archiving <https://builds.apache.org/job/DeltaSpike%20OWB%201.2.3-SNAPSHOT/ws/deltaspike/modules/jsf/impl/pom.xml>
to org.apache.deltaspike.modules/deltaspike-jsf-module-impl/0.6-SNAPSHOT/deltaspike-jsf-module-impl-0.6-SNAPSHOT.pom
[JENKINS] Archiving <https://builds.apache.org/job/DeltaSpike%20OWB%201.2.3-SNAPSHOT/ws/deltaspike/examples/pom.xml>
to org.apache.deltaspike.examples/examples-project/0.6-SNAPSHOT/examples-project-0.6-SNAPSHOT.pom
[JENKINS] Archiving <https://builds.apache.org/job/DeltaSpike%20OWB%201.2.3-SNAPSHOT/ws/deltaspike/modules/jsf/pom.xml>
to org.apache.deltaspike.modules/jsf-module-project/0.6-SNAPSHOT/jsf-module-project-0.6-SNAPSHOT.pom
[JENKINS] Archiving <https://builds.apache.org/job/DeltaSpike%20OWB%201.2.3-SNAPSHOT/ws/deltaspike/cdictrl/impl-openejb/pom.xml>
to org.apache.deltaspike.cdictrl/deltaspike-cdictrl-openejb/0.6-SNAPSHOT/deltaspike-cdictrl-openejb-0.6-SNAPSHOT.pom
[JENKINS] Archiving <https://builds.apache.org/job/DeltaSpike%20OWB%201.2.3-SNAPSHOT/ws/deltaspike/cdictrl/tck/pom.xml>
to org.apache.deltaspike.test/deltaspike-cdictrl-tck/0.6-SNAPSHOT/deltaspike-cdictrl-tck-0.6-SNAPSHOT.pom
[JENKINS] Archiving <https://builds.apache.org/job/DeltaSpike%20OWB%201.2.3-SNAPSHOT/ws/deltaspike/modules/jsf/api/pom.xml>
to org.apache.deltaspike.modules/deltaspike-jsf-module-api/0.6-SNAPSHOT/deltaspike-jsf-module-api-0.6-SNAPSHOT.pom
[JENKINS] Archiving <https://builds.apache.org/job/DeltaSpike%20OWB%201.2.3-SNAPSHOT/ws/deltaspike/examples/jsf-playground/pom.xml>
to org.apache.deltaspike.examples/deltaspike-jsf-playground/0.6-SNAPSHOT/deltaspike-jsf-playground-0.6-SNAPSHOT.pom
[JENKINS] Archiving <https://builds.apache.org/job/DeltaSpike%20OWB%201.2.3-SNAPSHOT/ws/deltaspike/modules/security/pom.xml>
to org.apache.deltaspike.modules/security-module-project/0.6-SNAPSHOT/security-module-project-0.6-SNAPSHOT.pom
[JENKINS] Archiving <https://builds.apache.org/job/DeltaSpike%20OWB%201.2.3-SNAPSHOT/ws/deltaspike/modules/bean-validation/pom.xml>
to org.apache.deltaspike.modules/bean-validation-module-project/0.6-SNAPSHOT/bean-validation-module-project-0.6-SNAPSHOT.pom
[JENKINS] Archiving <https://builds.apache.org/job/DeltaSpike%20OWB%201.2.3-SNAPSHOT/ws/deltaspike/modules/partial-bean/impl/pom.xml>
to org.apache.deltaspike.modules/deltaspike-partial-bean-module-impl/0.6-SNAPSHOT/deltaspike-partial-bean-module-impl-0.6-SNAPSHOT.pom
[JENKINS] Archiving <https://builds.apache.org/job/DeltaSpike%20OWB%201.2.3-SNAPSHOT/ws/deltaspike/cdictrl/impl-weld/pom.xml>
to org.apache.deltaspike.cdictrl/deltaspike-cdictrl-weld/0.6-SNAPSHOT/deltaspike-cdictrl-weld-0.6-SNAPSHOT.pom
[JENKINS] Archiving <https://builds.apache.org/job/DeltaSpike%20OWB%201.2.3-SNAPSHOT/ws/deltaspike/modules/servlet/impl/pom.xml>
to org.apache.deltaspike.modules/deltaspike-servlet-module-impl/0.6-SNAPSHOT/deltaspike-servlet-module-impl-0.6-SNAPSHOT.pom
[JENKINS] Archiving <https://builds.apache.org/job/DeltaSpike%20OWB%201.2.3-SNAPSHOT/ws/deltaspike/modules/jpa/api/pom.xml>
to org.apache.deltaspike.modules/deltaspike-jpa-module-api/0.6-SNAPSHOT/deltaspike-jpa-module-api-0.6-SNAPSHOT.pom
[JENKINS] Archiving <https://builds.apache.org/job/DeltaSpike%20OWB%201.2.3-SNAPSHOT/ws/deltaspike/modules/bean-validation/impl/pom.xml>
to org.apache.deltaspike.modules/deltaspike-bean-validation-module-impl/0.6-SNAPSHOT/deltaspike-bean-validation-module-impl-0.6-SNAPSHOT.pom
[JENKINS] Archiving <https://builds.apache.org/job/DeltaSpike%20OWB%201.2.3-SNAPSHOT/ws/deltaspike/cdictrl/impl-owb/pom.xml>
to org.apache.deltaspike.cdictrl/deltaspike-cdictrl-owb/0.6-SNAPSHOT/deltaspike-cdictrl-owb-0.6-SNAPSHOT.pom
[JENKINS] Archiving <https://builds.apache.org/job/DeltaSpike%20OWB%201.2.3-SNAPSHOT/ws/deltaspike/modules/servlet/api/pom.xml>
to org.apache.deltaspike.modules/deltaspike-servlet-module-api/0.6-SNAPSHOT/deltaspike-servlet-module-api-0.6-SNAPSHOT.pom
[JENKINS] Archiving <https://builds.apache.org/job/DeltaSpike%20OWB%201.2.3-SNAPSHOT/ws/deltaspike/modules/jpa/pom.xml>
to org.apache.deltaspike.modules/jpa-module-project/0.6-SNAPSHOT/jpa-module-project-0.6-SNAPSHOT.pom
[JENKINS] Archiving <https://builds.apache.org/job/DeltaSpike%20OWB%201.2.3-SNAPSHOT/ws/deltaspike/modules/jpa/impl/pom.xml>
to org.apache.deltaspike.modules/deltaspike-jpa-module-impl/0.6-SNAPSHOT/deltaspike-jpa-module-impl-0.6-SNAPSHOT.pom
[JENKINS] Archiving <https://builds.apache.org/job/DeltaSpike%20OWB%201.2.3-SNAPSHOT/ws/deltaspike/modules/data/pom.xml>
to org.apache.deltaspike.modules/data-module-project/0.6-SNAPSHOT/data-module-project-0.6-SNAPSHOT.pom
[JENKINS] Archiving <https://builds.apache.org/job/DeltaSpike%20OWB%201.2.3-SNAPSHOT/ws/deltaspike/cdictrl/pom.xml>
to org.apache.deltaspike.cdictrl/cdictrl-project/0.6-SNAPSHOT/cdictrl-project-0.6-SNAPSHOT.pom
[JENKINS] Archiving <https://builds.apache.org/job/DeltaSpike%20OWB%201.2.3-SNAPSHOT/ws/deltaspike/modules/scheduler/api/pom.xml>
to org.apache.deltaspike.modules/deltaspike-scheduler-module-api/0.6-SNAPSHOT/deltaspike-scheduler-module-api-0.6-SNAPSHOT.pom
[JENKINS] Archiving <https://builds.apache.org/job/DeltaSpike%20OWB%201.2.3-SNAPSHOT/ws/deltaspike/modules/test-control/impl/pom.xml>
to org.apache.deltaspike.modules/deltaspike-test-control-module-impl/0.6-SNAPSHOT/deltaspike-test-control-module-impl-0.6-SNAPSHOT.pom
[JENKINS] Archiving <https://builds.apache.org/job/DeltaSpike%20OWB%201.2.3-SNAPSHOT/ws/deltaspike/modules/servlet/pom.xml>
to org.apache.deltaspike.modules/servlet-module-project/0.6-SNAPSHOT/servlet-module-project-0.6-SNAPSHOT.pom
[JENKINS] Archiving <https://builds.apache.org/job/DeltaSpike%20OWB%201.2.3-SNAPSHOT/ws/deltaspike/pom.xml>
to org.apache.deltaspike/deltaspike-project/0.6-SNAPSHOT/deltaspike-project-0.6-SNAPSHOT.pom
[JENKINS] Archiving <https://builds.apache.org/job/DeltaSpike%20OWB%201.2.3-SNAPSHOT/ws/deltaspike/modules/test-control/api/pom.xml>
to org.apache.deltaspike.modules/deltaspike-test-control-module-api/0.6-SNAPSHOT/deltaspike-test-control-module-api-0.6-SNAPSHOT.pom
[JENKINS] Archiving <https://builds.apache.org/job/DeltaSpike%20OWB%201.2.3-SNAPSHOT/ws/deltaspike/modules/security/api/pom.xml>
to org.apache.deltaspike.modules/deltaspike-security-module-api/0.6-SNAPSHOT/deltaspike-security-module-api-0.6-SNAPSHOT.pom
Sending e-mails to: deltaspike-commits@incubator.apache.org
channel stopped

Mime
View raw message