deltaspike-commits mailing list archives

Site index · List index
Message view « Date » · « Thread »
Top « Date » · « Thread »
From Apache Jenkins Server <jenk...@builds.apache.org>
Subject Build failed in Jenkins: DeltaSpike_GF4 #3
Date Wed, 05 Mar 2014 17:14:08 GMT
See <https://builds.apache.org/job/DeltaSpike_GF4/3/changes>

Changes:

[tandraschko] DELTASPIKE-341 Bridge between JSF and DS Exception Handling

[tandraschko] DELTASPIKE-341 cache exception qualifier

[gpetracek] DELTASPIKE-515 MockedJsfTestContainerAdapter

[gpetracek] DELTASPIKE-524 preserve view-parameters

[gpetracek] DELTASPIKE-525 unification of @Initialized and @Destroyed

[gpetracek] DELTASPIKE-526 updated pom.xml files

[gpetracek] DELTASPIKE-527 @Named support for type-safe messages (first draft)

[tandraschko] DELTASPIKE-529 fixed initialization in non-EE environment

[gpetracek] DELTASPIKE-528 ContextController#stopApplicationScope fixed

[gpetracek] DELTASPIKE-530 deactivatable extensions

[Thomas.Hug] DELTASPIKE-420 Repository integration with TransactionStrategy

[tommy] DELTASPIKE-529 better lazy init

[tandraschko] DELTASPIKE-487 ViewAccessScoped prototype

[tommy] DELTASPIKE-487 removed unused logic

[tandraschko] DELTASPIKE-487 removed unused logic

[tandraschko] DELTASPIKE-487 removed unused logic (thanks netbeans)

[tandraschko] DELTASPIKE-487 removed unused logic (thanks netbeans for destroying my workspace)

[tandraschko] DELTASPIKE-487 added sample, simple unit test and bug fixes

[gpetracek] DELTASPIKE-487 tests and minor cleanup

[tandraschko] DELTASPIKE-487 fixed JSF forward + added unit test

[tandraschko] DELTASPIKE-487 moved navigation logic to own NavigationHandler

[tandraschko] DELTASPIKE-487 better deactivatable handling of the navigation handler

[tandraschko] DELTASPIKE-487 accessedBeans can be RequestScoped

[gpetracek] DELTASPIKE-399 simplified usage of ExternalResourceProvider

[gpetracek] DELTASPIKE-399 simplified usage of ExternalResourceProvider

[Thomas.Hug] DELTASPIKE-420 Refactored JPA-module hook for externally resolved EM

[Thomas.Hug] DELTASPIKE-420 Move EM holder into JPA module API

[Thomas.Hug] DELTASPIKE-420 Cleanup README, link to main documentation.

[gpetracek] DELTASPIKE-523 unified structure

[tandraschko] DELTASPIKE-532 DeltaSpikeFacesContextFactory construction issue in non EE

[tandraschko] DELTASPIKE-535 DeltaSpikeViewHandler construction issue in non EE

[tandraschko] DELTASPIKE-502 removed TODO - already done

------------------------------------------
[...truncated 230 lines...]
[JENKINS] Recording test results
[INFO] 
[INFO] --- maven-jar-plugin:2.4:jar (default-jar) @ test-utils ---
[INFO] Building jar: <https://builds.apache.org/job/DeltaSpike_GF4/ws/deltaspike/test-utils/target/test-utils-0.6-SNAPSHOT.jar>
[INFO] 
[INFO] --- maven-site-plugin:3.1:attach-descriptor (attach-descriptor) @ test-utils ---
[INFO] 
[INFO] --- maven-bundle-plugin:2.3.7:cleanVersions (versions) @ test-utils ---
[INFO] 
[INFO] --- maven-antrun-plugin:1.6:run (javadoc.resources) @ test-utils ---
[WARNING] Parameter tasks is deprecated, use target instead
[INFO] Executing tasks

main:
[INFO] Executed tasks
[WARNING] Failed to getClass for org.apache.maven.plugin.source.SourceJarMojo
[INFO] 
[INFO] --- maven-source-plugin:2.1.2:jar (attach-sources) @ test-utils ---
[INFO] META-INF already added, skipping
[INFO] META-INF/NOTICE already added, skipping
[INFO] META-INF/LICENSE already added, skipping
[INFO] META-INF/DISCLAIMER already added, skipping
[INFO] META-INF/DEPENDENCIES already added, skipping
[INFO] META-INF already added, skipping
[INFO] META-INF already added, skipping
[INFO] META-INF/NOTICE already added, skipping
[INFO] META-INF/LICENSE already added, skipping
[INFO] META-INF/DISCLAIMER already added, skipping
[INFO] META-INF/DEPENDENCIES already added, skipping
[INFO] META-INF already added, skipping
[INFO] META-INF/NOTICE already added, skipping
[INFO] META-INF/LICENSE already added, skipping
[INFO] META-INF/DISCLAIMER already added, skipping
[INFO] META-INF/DEPENDENCIES already added, skipping
[INFO] Building jar: <https://builds.apache.org/job/DeltaSpike_GF4/ws/deltaspike/test-utils/target/test-utils-0.6-SNAPSHOT-sources.jar>
[INFO] META-INF already added, skipping
[INFO] META-INF/NOTICE already added, skipping
[INFO] META-INF/LICENSE already added, skipping
[INFO] META-INF/DISCLAIMER already added, skipping
[INFO] META-INF/DEPENDENCIES already added, skipping
[INFO] META-INF already added, skipping
[INFO] META-INF already added, skipping
[INFO] META-INF/NOTICE already added, skipping
[INFO] META-INF/LICENSE already added, skipping
[INFO] META-INF/DISCLAIMER already added, skipping
[INFO] META-INF/DEPENDENCIES already added, skipping
[INFO] META-INF already added, skipping
[INFO] META-INF/NOTICE already added, skipping
[INFO] META-INF/LICENSE already added, skipping
[INFO] META-INF/DISCLAIMER already added, skipping
[INFO] META-INF/DEPENDENCIES already added, skipping
[INFO] 
[INFO] --- maven-checkstyle-plugin:2.9.1:check (verify-style) @ test-utils ---
[INFO] Starting audit...
Audit done.

[INFO] 
[INFO] --- maven-install-plugin:2.3.1:install (default-install) @ test-utils ---
[INFO] Installing <https://builds.apache.org/job/DeltaSpike_GF4/ws/deltaspike/test-utils/target/test-utils-0.6-SNAPSHOT.jar>
to /home/jenkins/jenkins-slave/maven-repositories/1/org/apache/deltaspike/test/test-utils/0.6-SNAPSHOT/test-utils-0.6-SNAPSHOT.jar
[INFO] Installing <https://builds.apache.org/job/DeltaSpike_GF4/ws/deltaspike/test-utils/pom.xml>
to /home/jenkins/jenkins-slave/maven-repositories/1/org/apache/deltaspike/test/test-utils/0.6-SNAPSHOT/test-utils-0.6-SNAPSHOT.pom
[INFO] Installing <https://builds.apache.org/job/DeltaSpike_GF4/ws/deltaspike/test-utils/target/test-utils-0.6-SNAPSHOT-sources.jar>
to /home/jenkins/jenkins-slave/maven-repositories/1/org/apache/deltaspike/test/test-utils/0.6-SNAPSHOT/test-utils-0.6-SNAPSHOT-sources.jar
[INFO]                                                                         
[INFO] ------------------------------------------------------------------------
[INFO] Building Apache DeltaSpike Code Parent 0.6-SNAPSHOT
[INFO] ------------------------------------------------------------------------
Downloading: https://repository.apache.org/content/repositories/releases/org/jboss/arquillian/container/arquillian-glassfish-managed-3.1/1.0.0.CR4/arquillian-glassfish-managed-3.1-1.0.0.CR4.pom
Downloading: https://repository.apache.org/content/repositories/snapshots/org/jboss/arquillian/container/arquillian-glassfish-managed-3.1/1.0.0.CR4/arquillian-glassfish-managed-3.1-1.0.0.CR4.pom
Downloading: http://repo.maven.apache.org/maven2/org/jboss/arquillian/container/arquillian-glassfish-managed-3.1/1.0.0.CR4/arquillian-glassfish-managed-3.1-1.0.0.CR4.pom
Downloaded: http://repo.maven.apache.org/maven2/org/jboss/arquillian/container/arquillian-glassfish-managed-3.1/1.0.0.CR4/arquillian-glassfish-managed-3.1-1.0.0.CR4.pom
(5 KB at 44.2 KB/sec)
Downloading: https://repository.apache.org/content/repositories/releases/org/jboss/arquillian/container/arquillian-parent-glassfish/1.0.0.CR4/arquillian-parent-glassfish-1.0.0.CR4.pom
Downloading: https://repository.apache.org/content/repositories/snapshots/org/jboss/arquillian/container/arquillian-parent-glassfish/1.0.0.CR4/arquillian-parent-glassfish-1.0.0.CR4.pom
Downloading: http://repo.maven.apache.org/maven2/org/jboss/arquillian/container/arquillian-parent-glassfish/1.0.0.CR4/arquillian-parent-glassfish-1.0.0.CR4.pom
Downloaded: http://repo.maven.apache.org/maven2/org/jboss/arquillian/container/arquillian-parent-glassfish/1.0.0.CR4/arquillian-parent-glassfish-1.0.0.CR4.pom
(4 KB at 44.5 KB/sec)
Downloading: https://repository.apache.org/content/repositories/releases/org/jboss/arquillian/container/arquillian-glassfish-common/1.0.0.CR4/arquillian-glassfish-common-1.0.0.CR4.pom
Downloading: https://repository.apache.org/content/repositories/snapshots/org/jboss/arquillian/container/arquillian-glassfish-common/1.0.0.CR4/arquillian-glassfish-common-1.0.0.CR4.pom
Downloading: http://repo.maven.apache.org/maven2/org/jboss/arquillian/container/arquillian-glassfish-common/1.0.0.CR4/arquillian-glassfish-common-1.0.0.CR4.pom
Downloaded: http://repo.maven.apache.org/maven2/org/jboss/arquillian/container/arquillian-glassfish-common/1.0.0.CR4/arquillian-glassfish-common-1.0.0.CR4.pom
(2 KB at 16.2 KB/sec)
Downloading: https://repository.apache.org/content/repositories/releases/com/sun/jersey/jersey-bundle/1.10/jersey-bundle-1.10.pom
Downloading: https://repository.apache.org/content/repositories/snapshots/com/sun/jersey/jersey-bundle/1.10/jersey-bundle-1.10.pom
Downloading: http://repo.maven.apache.org/maven2/com/sun/jersey/jersey-bundle/1.10/jersey-bundle-1.10.pom
Downloaded: http://repo.maven.apache.org/maven2/com/sun/jersey/jersey-bundle/1.10/jersey-bundle-1.10.pom
(23 KB at 2229.4 KB/sec)
Downloading: https://repository.apache.org/content/repositories/releases/com/sun/jersey/contribs/jersey-multipart/1.10/jersey-multipart-1.10.pom
Downloading: https://repository.apache.org/content/repositories/snapshots/com/sun/jersey/contribs/jersey-multipart/1.10/jersey-multipart-1.10.pom
Downloading: http://repo.maven.apache.org/maven2/com/sun/jersey/contribs/jersey-multipart/1.10/jersey-multipart-1.10.pom
Downloaded: http://repo.maven.apache.org/maven2/com/sun/jersey/contribs/jersey-multipart/1.10/jersey-multipart-1.10.pom
(9 KB at 103.9 KB/sec)
Downloading: https://repository.apache.org/content/repositories/releases/org/jboss/arquillian/container/arquillian-glassfish-managed-3.1/1.0.0.CR4/arquillian-glassfish-managed-3.1-1.0.0.CR4.jar
Downloading: https://repository.apache.org/content/repositories/releases/org/jboss/arquillian/container/arquillian-glassfish-common/1.0.0.CR4/arquillian-glassfish-common-1.0.0.CR4.jar
Downloading: https://repository.apache.org/content/repositories/releases/com/sun/jersey/jersey-bundle/1.10/jersey-bundle-1.10.jar
Downloading: https://repository.apache.org/content/repositories/releases/com/sun/jersey/contribs/jersey-multipart/1.10/jersey-multipart-1.10.jar
Downloading: https://repository.apache.org/content/repositories/snapshots/org/jboss/arquillian/container/arquillian-glassfish-managed-3.1/1.0.0.CR4/arquillian-glassfish-managed-3.1-1.0.0.CR4.jar
Downloading: https://repository.apache.org/content/repositories/snapshots/org/jboss/arquillian/container/arquillian-glassfish-common/1.0.0.CR4/arquillian-glassfish-common-1.0.0.CR4.jar
Downloading: https://repository.apache.org/content/repositories/snapshots/com/sun/jersey/jersey-bundle/1.10/jersey-bundle-1.10.jar
Downloading: https://repository.apache.org/content/repositories/snapshots/com/sun/jersey/contribs/jersey-multipart/1.10/jersey-multipart-1.10.jar
Downloading: http://repo.maven.apache.org/maven2/org/jboss/arquillian/container/arquillian-glassfish-managed-3.1/1.0.0.CR4/arquillian-glassfish-managed-3.1-1.0.0.CR4.jar
Downloading: http://repo.maven.apache.org/maven2/org/jboss/arquillian/container/arquillian-glassfish-common/1.0.0.CR4/arquillian-glassfish-common-1.0.0.CR4.jar
Downloading: http://repo.maven.apache.org/maven2/com/sun/jersey/jersey-bundle/1.10/jersey-bundle-1.10.jar
Downloading: http://repo.maven.apache.org/maven2/com/sun/jersey/contribs/jersey-multipart/1.10/jersey-multipart-1.10.jar
Downloaded: http://repo.maven.apache.org/maven2/com/sun/jersey/contribs/jersey-multipart/1.10/jersey-multipart-1.10.jar
(51 KB at 3184.8 KB/sec)
Downloaded: http://repo.maven.apache.org/maven2/org/jboss/arquillian/container/arquillian-glassfish-common/1.0.0.CR4/arquillian-glassfish-common-1.0.0.CR4.jar
(28 KB at 319.2 KB/sec)
Downloaded: http://repo.maven.apache.org/maven2/org/jboss/arquillian/container/arquillian-glassfish-managed-3.1/1.0.0.CR4/arquillian-glassfish-managed-3.1-1.0.0.CR4.jar
(13 KB at 80.8 KB/sec)
Downloaded: http://repo.maven.apache.org/maven2/com/sun/jersey/jersey-bundle/1.10/jersey-bundle-1.10.jar
(1388 KB at 2752.4 KB/sec)
[INFO] 
[INFO] --- maven-clean-plugin:2.5:clean (default-clean) @ parent-code ---
[INFO] Deleting <https://builds.apache.org/job/DeltaSpike_GF4/ws/deltaspike/parent/code/target>
[INFO] 
[INFO] --- maven-bundle-plugin:2.3.7:cleanVersions (versions) @ parent-code ---
[INFO] 
[INFO] --- maven-antrun-plugin:1.6:run (javadoc.resources) @ parent-code ---
[WARNING] Parameter tasks is deprecated, use target instead
[INFO] Executing tasks

main:
[INFO] Executed tasks
[INFO] 
[INFO] --- maven-remote-resources-plugin:1.3:process (process-remote-resources) @ parent-code
---
[INFO] 
[INFO] --- maven-remote-resources-plugin:1.3:process (default) @ parent-code ---
[INFO] 
[INFO] --- maven-dependency-plugin:2.4:unpack (unpack-glassfish4) @ parent-code ---
[INFO] Configured Artifact: org.glassfish.main.distributions:glassfish:4.0:zip
Downloading: https://repository.apache.org/content/repositories/releases/org/glassfish/main/distributions/glassfish/4.0/glassfish-4.0.zip
Downloading: https://repository.apache.org/content/repositories/snapshots/org/glassfish/main/distributions/glassfish/4.0/glassfish-4.0.zip
Downloading: http://repo.maven.apache.org/maven2/org/glassfish/main/distributions/glassfish/4.0/glassfish-4.0.zip
[INFO] ------------------------------------------------------------------------
[INFO] Reactor Summary:
[INFO] 
[INFO] Apache DeltaSpike ................................. SUCCESS [21.616s]
[INFO] Apache DeltaSpike CheckStyle-rules ................ SUCCESS [2.729s]
[INFO] Apache DeltaSpike Parent .......................... SUCCESS [4.339s]
[INFO] Apache DeltaSpike Test-Utils ...................... SUCCESS [5.111s]
[INFO] Apache DeltaSpike Code Parent ..................... FAILURE [1:05.461s]
[INFO] Apache DeltaSpike Core ............................ SKIPPED
[INFO] Apache DeltaSpike Core-API ........................ SKIPPED
[INFO] Apache DeltaSpike Core-Implementation ............. SKIPPED
[INFO] Apache DeltaSpike ContainerControl parent ......... SKIPPED
[INFO] Apache DeltaSpike CDI ContainerControl API ........ SKIPPED
[INFO] Apache DeltaSpike CDI ContainerControl TCK ........ SKIPPED
[INFO] Apache DeltaSpike CDI OWB-ContainerControl ........ SKIPPED
[INFO] Apache DeltaSpike CDI Weld-ContainerControl ....... SKIPPED
[INFO] Apache DeltaSpike CDI OpenEJB-ContainerControl .... SKIPPED
[INFO] Apache DeltaSpike Modules ......................... SKIPPED
[INFO] Apache DeltaSpike Security-Module ................. SKIPPED
[INFO] Apache DeltaSpike Security-Module API ............. SKIPPED
[INFO] Apache DeltaSpike Security-Module Impl ............ SKIPPED
[INFO] Apache DeltaSpike JPA-Module ...................... SKIPPED
[INFO] Apache DeltaSpike JPA-Module API .................. SKIPPED
[INFO] Apache DeltaSpike JPA-Module Impl ................. SKIPPED
[INFO] Apache DeltaSpike Servlet-Module .................. SKIPPED
[INFO] Apache DeltaSpike Servlet-Module API .............. SKIPPED
[INFO] Apache DeltaSpike Servlet-Module Impl ............. SKIPPED
[INFO] Apache DeltaSpike JSF-Module ...................... SKIPPED
[INFO] Apache DeltaSpike JSF-Module API .................. SKIPPED
[INFO] Apache DeltaSpike JSF-Module Impl ................. SKIPPED
[INFO] Apache DeltaSpike Partial-Bean-Module ............. SKIPPED
[INFO] Apache DeltaSpike Partial-Bean-Module API ......... SKIPPED
[INFO] Apache DeltaSpike Partial-Bean-Module Impl ........ SKIPPED
[INFO] Apache DeltaSpike BeanValidation-Module ........... SKIPPED
[INFO] Apache DeltaSpike BeanValidation-Module API ....... SKIPPED
[INFO] Apache DeltaSpike BeanValidation-Module Impl ...... SKIPPED
[INFO] Apache DeltaSpike Data-Module ..................... SKIPPED
[INFO] Apache DeltaSpike Data-Module API ................. SKIPPED
[INFO] Apache DeltaSpike Data-Module Impl ................ SKIPPED
[INFO] Apache DeltaSpike Scheduler-Module ................ SKIPPED
[INFO] Apache DeltaSpike Scheduler-Module API ............ SKIPPED
[INFO] Apache DeltaSpike Scheduler-Module Impl ........... SKIPPED
[INFO] Apache DeltaSpike Test-Control-Module ............. SKIPPED
[INFO] Apache DeltaSpike Test-Control-Module API ......... SKIPPED
[INFO] Apache DeltaSpike Test-Control-Module Impl ........ SKIPPED
[INFO] Apache DeltaSpike Examples ........................ SKIPPED
[INFO] Apache DeltaSpike Java-SE Examples ................ SKIPPED
[INFO] Apache DeltaSpike JSF Examples .................... SKIPPED
[INFO] Apache DeltaSpike JSF Playground .................. SKIPPED
[INFO] ------------------------------------------------------------------------
[INFO] BUILD FAILURE
[INFO] ------------------------------------------------------------------------
[INFO] Total time: 1:50.417s
[INFO] Finished at: Wed Mar 05 17:13:24 UTC 2014
[INFO] Final Memory: 34M/121M
[INFO] ------------------------------------------------------------------------
Waiting for Jenkins to finish collecting data[ERROR] Failed to execute goal org.apache.maven.plugins:maven-dependency-plugin:2.4:unpack
(unpack-glassfish4) on project parent-code: Unable to resolve artifact. Could not transfer
artifact org.glassfish.main.distributions:glassfish:zip:4.0 from/to central (http://repo.maven.apache.org/maven2):
Failed to transfer file: http://repo.maven.apache.org/maven2/org/glassfish/main/distributions/glassfish/4.0/glassfish-4.0.zip.
Return code is: 503, ReasonPhrase:backend read error.
[ERROR] org.glassfish.main.distributions:glassfish:zip:4.0
[ERROR] 
[ERROR] from the specified remote repositories:
[ERROR] Apache Repository (https://repository.apache.org/content/repositories/releases, releases=true,
snapshots=true),
[ERROR] Apache Snapshot Repository (https://repository.apache.org/content/repositories/snapshots,
releases=true, snapshots=true),
[ERROR] Nexus (http://repository.apache.org/snapshots, releases=false, snapshots=true),
[ERROR] central (http://repo.maven.apache.org/maven2, releases=true, snapshots=false)
[ERROR] -> [Help 1]
[ERROR] 
[ERROR] To see the full stack trace of the errors, re-run Maven with the -e switch.
[ERROR] Re-run Maven using the -X switch to enable full debug logging.
[ERROR] 
[ERROR] For more information about the errors and possible solutions, please read the following
articles:
[ERROR] [Help 1] http://cwiki.apache.org/confluence/display/MAVEN/MojoExecutionException
[ERROR] 
[ERROR] After correcting the problems, you can resume the build with the command
[ERROR]   mvn <goals> -rf :parent-code

[JENKINS] Archiving <https://builds.apache.org/job/DeltaSpike_GF4/ws/deltaspike/modules/partial-bean/api/pom.xml>
to org.apache.deltaspike.modules/deltaspike-partial-bean-module-api/0.6-SNAPSHOT/deltaspike-partial-bean-module-api-0.6-SNAPSHOT.pom
[JENKINS] Archiving <https://builds.apache.org/job/DeltaSpike_GF4/ws/deltaspike/modules/scheduler/impl/pom.xml>
to org.apache.deltaspike.modules/deltaspike-scheduler-module-impl/0.6-SNAPSHOT/deltaspike-scheduler-module-impl-0.6-SNAPSHOT.pom
[JENKINS] Archiving <https://builds.apache.org/job/DeltaSpike_GF4/ws/deltaspike/parent/pom.xml>
to org.apache.deltaspike/parent/0.6-SNAPSHOT/parent-0.6-SNAPSHOT.pom
[JENKINS] Archiving <https://builds.apache.org/job/DeltaSpike_GF4/ws/deltaspike/examples/jse-examples/pom.xml>
to org.apache.deltaspike.examples/deltaspike-jse-example/0.6-SNAPSHOT/deltaspike-jse-example-0.6-SNAPSHOT.pom
[JENKINS] Archiving <https://builds.apache.org/job/DeltaSpike_GF4/ws/deltaspike/modules/bean-validation/api/pom.xml>
to org.apache.deltaspike.modules/deltaspike-bean-validation-module-api/0.6-SNAPSHOT/deltaspike-bean-validation-module-api-0.6-SNAPSHOT.pom
[JENKINS] Archiving <https://builds.apache.org/job/DeltaSpike_GF4/ws/deltaspike/core/pom.xml>
to org.apache.deltaspike.core/core-project/0.6-SNAPSHOT/core-project-0.6-SNAPSHOT.pom
[JENKINS] Archiving <https://builds.apache.org/job/DeltaSpike_GF4/ws/deltaspike/test-utils/pom.xml>
to org.apache.deltaspike.test/test-utils/0.6-SNAPSHOT/test-utils-0.6-SNAPSHOT.pom
[JENKINS] Archiving <https://builds.apache.org/job/DeltaSpike_GF4/ws/deltaspike/test-utils/target/test-utils-0.6-SNAPSHOT.jar>
to org.apache.deltaspike.test/test-utils/0.6-SNAPSHOT/test-utils-0.6-SNAPSHOT.jar
[JENKINS] Archiving <https://builds.apache.org/job/DeltaSpike_GF4/ws/deltaspike/test-utils/target/test-utils-0.6-SNAPSHOT-sources.jar>
to org.apache.deltaspike.test/test-utils/0.6-SNAPSHOT/test-utils-0.6-SNAPSHOT-sources.jar
[JENKINS] Archiving <https://builds.apache.org/job/DeltaSpike_GF4/ws/deltaspike/modules/data/impl/pom.xml>
to org.apache.deltaspike.modules/deltaspike-data-module-impl/0.6-SNAPSHOT/deltaspike-data-module-impl-0.6-SNAPSHOT.pom
[JENKINS] Archiving <https://builds.apache.org/job/DeltaSpike_GF4/ws/deltaspike/core/api/pom.xml>
to org.apache.deltaspike.core/deltaspike-core-api/0.6-SNAPSHOT/deltaspike-core-api-0.6-SNAPSHOT.pom
[JENKINS] Archiving <https://builds.apache.org/job/DeltaSpike_GF4/ws/deltaspike/modules/scheduler/pom.xml>
to org.apache.deltaspike.modules/scheduler-module-project/0.6-SNAPSHOT/scheduler-module-project-0.6-SNAPSHOT.pom
[JENKINS] Archiving <https://builds.apache.org/job/DeltaSpike_GF4/ws/deltaspike/modules/data/api/pom.xml>
to org.apache.deltaspike.modules/deltaspike-data-module-api/0.6-SNAPSHOT/deltaspike-data-module-api-0.6-SNAPSHOT.pom
[JENKINS] Archiving <https://builds.apache.org/job/DeltaSpike_GF4/ws/deltaspike/modules/security/impl/pom.xml>
to org.apache.deltaspike.modules/deltaspike-security-module-impl/0.6-SNAPSHOT/deltaspike-security-module-impl-0.6-SNAPSHOT.pom
[JENKINS] Archiving <https://builds.apache.org/job/DeltaSpike_GF4/ws/deltaspike/core/impl/pom.xml>
to org.apache.deltaspike.core/deltaspike-core-impl/0.6-SNAPSHOT/deltaspike-core-impl-0.6-SNAPSHOT.pom
[JENKINS] Archiving <https://builds.apache.org/job/DeltaSpike_GF4/ws/deltaspike/modules/test-control/pom.xml>
to org.apache.deltaspike.modules/test-control-module-project/0.6-SNAPSHOT/test-control-module-project-0.6-SNAPSHOT.pom
[JENKINS] Archiving <https://builds.apache.org/job/DeltaSpike_GF4/ws/deltaspike/modules/pom.xml>
to org.apache.deltaspike.modules/modules-project/0.6-SNAPSHOT/modules-project-0.6-SNAPSHOT.pom
[JENKINS] Archiving <https://builds.apache.org/job/DeltaSpike_GF4/ws/deltaspike/examples/jsf-examples/pom.xml>
to org.apache.deltaspike.examples/deltaspike-jsf-example/0.6-SNAPSHOT/deltaspike-jsf-example-0.6-SNAPSHOT.pom
[JENKINS] Archiving <https://builds.apache.org/job/DeltaSpike_GF4/ws/deltaspike/cdictrl/api/pom.xml>
to org.apache.deltaspike.cdictrl/deltaspike-cdictrl-api/0.6-SNAPSHOT/deltaspike-cdictrl-api-0.6-SNAPSHOT.pom
[JENKINS] Archiving <https://builds.apache.org/job/DeltaSpike_GF4/ws/deltaspike/checkstyle-rules/pom.xml>
to org.apache.deltaspike/checkstyle-rules/0.6-SNAPSHOT/checkstyle-rules-0.6-SNAPSHOT.pom
[JENKINS] Archiving <https://builds.apache.org/job/DeltaSpike_GF4/ws/deltaspike/checkstyle-rules/target/checkstyle-rules-0.6-SNAPSHOT.jar>
to org.apache.deltaspike/checkstyle-rules/0.6-SNAPSHOT/checkstyle-rules-0.6-SNAPSHOT.jar
[JENKINS] Archiving <https://builds.apache.org/job/DeltaSpike_GF4/ws/deltaspike/parent/code/pom.xml>
to org.apache.deltaspike/parent-code/0.6-SNAPSHOT/parent-code-0.6-SNAPSHOT.pom
[JENKINS] Archiving <https://builds.apache.org/job/DeltaSpike_GF4/ws/deltaspike/modules/partial-bean/pom.xml>
to org.apache.deltaspike.modules/partial-bean-module-project/0.6-SNAPSHOT/partial-bean-module-project-0.6-SNAPSHOT.pom
[JENKINS] Archiving <https://builds.apache.org/job/DeltaSpike_GF4/ws/deltaspike/modules/jsf/impl/pom.xml>
to org.apache.deltaspike.modules/deltaspike-jsf-module-impl/0.6-SNAPSHOT/deltaspike-jsf-module-impl-0.6-SNAPSHOT.pom
[JENKINS] Archiving <https://builds.apache.org/job/DeltaSpike_GF4/ws/deltaspike/examples/pom.xml>
to org.apache.deltaspike.examples/examples-project/0.6-SNAPSHOT/examples-project-0.6-SNAPSHOT.pom
[JENKINS] Archiving <https://builds.apache.org/job/DeltaSpike_GF4/ws/deltaspike/modules/jsf/pom.xml>
to org.apache.deltaspike.modules/jsf-module-project/0.6-SNAPSHOT/jsf-module-project-0.6-SNAPSHOT.pom
[JENKINS] Archiving <https://builds.apache.org/job/DeltaSpike_GF4/ws/deltaspike/cdictrl/impl-openejb/pom.xml>
to org.apache.deltaspike.cdictrl/deltaspike-cdictrl-openejb/0.6-SNAPSHOT/deltaspike-cdictrl-openejb-0.6-SNAPSHOT.pom
[JENKINS] Archiving <https://builds.apache.org/job/DeltaSpike_GF4/ws/deltaspike/cdictrl/tck/pom.xml>
to org.apache.deltaspike.test/deltaspike-cdictrl-tck/0.6-SNAPSHOT/deltaspike-cdictrl-tck-0.6-SNAPSHOT.pom
[JENKINS] Archiving <https://builds.apache.org/job/DeltaSpike_GF4/ws/deltaspike/modules/jsf/api/pom.xml>
to org.apache.deltaspike.modules/deltaspike-jsf-module-api/0.6-SNAPSHOT/deltaspike-jsf-module-api-0.6-SNAPSHOT.pom
[JENKINS] Archiving <https://builds.apache.org/job/DeltaSpike_GF4/ws/deltaspike/examples/jsf-playground/pom.xml>
to org.apache.deltaspike.examples/deltaspike-jsf-playground/0.6-SNAPSHOT/deltaspike-jsf-playground-0.6-SNAPSHOT.pom
[JENKINS] Archiving <https://builds.apache.org/job/DeltaSpike_GF4/ws/deltaspike/modules/security/pom.xml>
to org.apache.deltaspike.modules/security-module-project/0.6-SNAPSHOT/security-module-project-0.6-SNAPSHOT.pom
[JENKINS] Archiving <https://builds.apache.org/job/DeltaSpike_GF4/ws/deltaspike/modules/bean-validation/pom.xml>
to org.apache.deltaspike.modules/bean-validation-module-project/0.6-SNAPSHOT/bean-validation-module-project-0.6-SNAPSHOT.pom
[JENKINS] Archiving <https://builds.apache.org/job/DeltaSpike_GF4/ws/deltaspike/modules/partial-bean/impl/pom.xml>
to org.apache.deltaspike.modules/deltaspike-partial-bean-module-impl/0.6-SNAPSHOT/deltaspike-partial-bean-module-impl-0.6-SNAPSHOT.pom
[JENKINS] Archiving <https://builds.apache.org/job/DeltaSpike_GF4/ws/deltaspike/cdictrl/impl-weld/pom.xml>
to org.apache.deltaspike.cdictrl/deltaspike-cdictrl-weld/0.6-SNAPSHOT/deltaspike-cdictrl-weld-0.6-SNAPSHOT.pom
[JENKINS] Archiving <https://builds.apache.org/job/DeltaSpike_GF4/ws/deltaspike/modules/servlet/impl/pom.xml>
to org.apache.deltaspike.modules/deltaspike-servlet-module-impl/0.6-SNAPSHOT/deltaspike-servlet-module-impl-0.6-SNAPSHOT.pom
[JENKINS] Archiving <https://builds.apache.org/job/DeltaSpike_GF4/ws/deltaspike/modules/jpa/api/pom.xml>
to org.apache.deltaspike.modules/deltaspike-jpa-module-api/0.6-SNAPSHOT/deltaspike-jpa-module-api-0.6-SNAPSHOT.pom
[JENKINS] Archiving <https://builds.apache.org/job/DeltaSpike_GF4/ws/deltaspike/modules/bean-validation/impl/pom.xml>
to org.apache.deltaspike.modules/deltaspike-bean-validation-module-impl/0.6-SNAPSHOT/deltaspike-bean-validation-module-impl-0.6-SNAPSHOT.pom
[JENKINS] Archiving <https://builds.apache.org/job/DeltaSpike_GF4/ws/deltaspike/cdictrl/impl-owb/pom.xml>
to org.apache.deltaspike.cdictrl/deltaspike-cdictrl-owb/0.6-SNAPSHOT/deltaspike-cdictrl-owb-0.6-SNAPSHOT.pom
[JENKINS] Archiving <https://builds.apache.org/job/DeltaSpike_GF4/ws/deltaspike/modules/servlet/api/pom.xml>
to org.apache.deltaspike.modules/deltaspike-servlet-module-api/0.6-SNAPSHOT/deltaspike-servlet-module-api-0.6-SNAPSHOT.pom
[JENKINS] Archiving <https://builds.apache.org/job/DeltaSpike_GF4/ws/deltaspike/modules/jpa/pom.xml>
to org.apache.deltaspike.modules/jpa-module-project/0.6-SNAPSHOT/jpa-module-project-0.6-SNAPSHOT.pom
[JENKINS] Archiving <https://builds.apache.org/job/DeltaSpike_GF4/ws/deltaspike/modules/jpa/impl/pom.xml>
to org.apache.deltaspike.modules/deltaspike-jpa-module-impl/0.6-SNAPSHOT/deltaspike-jpa-module-impl-0.6-SNAPSHOT.pom
[JENKINS] Archiving <https://builds.apache.org/job/DeltaSpike_GF4/ws/deltaspike/modules/data/pom.xml>
to org.apache.deltaspike.modules/data-module-project/0.6-SNAPSHOT/data-module-project-0.6-SNAPSHOT.pom
[JENKINS] Archiving <https://builds.apache.org/job/DeltaSpike_GF4/ws/deltaspike/cdictrl/pom.xml>
to org.apache.deltaspike.cdictrl/cdictrl-project/0.6-SNAPSHOT/cdictrl-project-0.6-SNAPSHOT.pom
[JENKINS] Archiving <https://builds.apache.org/job/DeltaSpike_GF4/ws/deltaspike/modules/scheduler/api/pom.xml>
to org.apache.deltaspike.modules/deltaspike-scheduler-module-api/0.6-SNAPSHOT/deltaspike-scheduler-module-api-0.6-SNAPSHOT.pom
[JENKINS] Archiving <https://builds.apache.org/job/DeltaSpike_GF4/ws/deltaspike/modules/test-control/impl/pom.xml>
to org.apache.deltaspike.modules/deltaspike-test-control-module-impl/0.6-SNAPSHOT/deltaspike-test-control-module-impl-0.6-SNAPSHOT.pom
[JENKINS] Archiving <https://builds.apache.org/job/DeltaSpike_GF4/ws/deltaspike/modules/servlet/pom.xml>
to org.apache.deltaspike.modules/servlet-module-project/0.6-SNAPSHOT/servlet-module-project-0.6-SNAPSHOT.pom
[JENKINS] Archiving <https://builds.apache.org/job/DeltaSpike_GF4/ws/deltaspike/pom.xml>
to org.apache.deltaspike/deltaspike-project/0.6-SNAPSHOT/deltaspike-project-0.6-SNAPSHOT.pom
[JENKINS] Archiving <https://builds.apache.org/job/DeltaSpike_GF4/ws/deltaspike/modules/test-control/api/pom.xml>
to org.apache.deltaspike.modules/deltaspike-test-control-module-api/0.6-SNAPSHOT/deltaspike-test-control-module-api-0.6-SNAPSHOT.pom
[JENKINS] Archiving <https://builds.apache.org/job/DeltaSpike_GF4/ws/deltaspike/modules/security/api/pom.xml>
to org.apache.deltaspike.modules/deltaspike-security-module-api/0.6-SNAPSHOT/deltaspike-security-module-api-0.6-SNAPSHOT.pom
Sending e-mails to: commits@deltaspike.apache.org
channel stopped

Mime
View raw message