deltaspike-commits mailing list archives

Site index · List index
Message view « Date » · « Thread »
Top « Date » · « Thread »
From Apache Jenkins Server <jenk...@builds.apache.org>
Subject Build failed in Jenkins: DeltaSpike RAT-Check » Apache DeltaSpike Security-Module Impl #941
Date Wed, 12 Mar 2014 01:35:41 GMT
See <https://builds.apache.org/job/DeltaSpike%20RAT-Check/org.apache.deltaspike.modules$deltaspike-security-module-impl/941/>

------------------------------------------
[INFO]                                                                         
[INFO] ------------------------------------------------------------------------
[INFO] Building Apache DeltaSpike Security-Module Impl 0.6-SNAPSHOT
[INFO] ------------------------------------------------------------------------
[INFO] 
[INFO] --- maven-clean-plugin:2.5:clean (default-clean) @ deltaspike-security-module-impl
---
[INFO] 
[INFO] --- apache-rat-plugin:0.8:check (default) @ deltaspike-security-module-impl ---
[INFO] Exclude: .idea/**/*
[INFO] Exclude: readme/**/*
[INFO] Exclude: **/*.log
[INFO] 
[INFO] --- maven-bundle-plugin:2.3.7:cleanVersions (versions) @ deltaspike-security-module-impl
---
[INFO] 
[INFO] --- maven-antrun-plugin:1.6:run (javadoc.resources) @ deltaspike-security-module-impl
---
[WARNING] Parameter tasks is deprecated, use target instead
[INFO] Executing tasks

main:
[INFO] Executed tasks
[INFO] 
[INFO] --- maven-remote-resources-plugin:1.3:process (process-remote-resources) @ deltaspike-security-module-impl
---
[INFO] 
[INFO] --- maven-remote-resources-plugin:1.3:process (default) @ deltaspike-security-module-impl
---
[INFO] 
[INFO] --- maven-resources-plugin:2.5:resources (default-resources) @ deltaspike-security-module-impl
---
[debug] execute contextualize
[INFO] Using 'UTF-8' encoding to copy filtered resources.
[INFO] Copying 2 resources
[INFO] Copying 4 resources
[INFO] Copying 4 resources
[INFO] 
[INFO] --- maven-compiler-plugin:2.5:compile (default-compile) @ deltaspike-security-module-impl
---
[INFO] Compiling 12 source files to <https://builds.apache.org/job/DeltaSpike%20RAT-Check/org.apache.deltaspike.modules$deltaspike-security-module-impl/ws/target/classes>
[INFO] 
[INFO] --- maven-resources-plugin:2.5:testResources (default-testResources) @ deltaspike-security-module-impl
---
[debug] execute contextualize
[INFO] Using 'UTF-8' encoding to copy filtered resources.
[INFO] Copying 1 resource
[INFO] Copying 4 resources
[INFO] Copying 4 resources
[INFO] 
[INFO] --- maven-compiler-plugin:2.5:testCompile (default-testCompile) @ deltaspike-security-module-impl
---
[INFO] Compiling 23 source files to <https://builds.apache.org/job/DeltaSpike%20RAT-Check/org.apache.deltaspike.modules$deltaspike-security-module-impl/ws/target/test-classes>
[INFO] 
[INFO] --- maven-surefire-plugin:2.11:test (default-test) @ deltaspike-security-module-impl
---
[INFO] Surefire report directory: <https://builds.apache.org/job/DeltaSpike%20RAT-Check/org.apache.deltaspike.modules$deltaspike-security-module-impl/ws/target/surefire-reports>
[INFO] Using configured provider org.apache.maven.surefire.junitcore.JUnitCoreProvider

-------------------------------------------------------
 T E S T S
-------------------------------------------------------
Concurrency config is parallel='none', perCoreThreadCount=true, threadCount=2, useUnlimitedThreads=false
Mar 12, 2014 1:34:49 AM org.apache.deltaspike.test.utils.ShrinkWrapArchiveUtil getArchives
INFO: Test org.apache.deltaspike.test.security.impl.authorization.securitybinding.SecurityBindingTest
Adding Java ClassPath URL as JavaArchive <https://builds.apache.org/job/DeltaSpike%20RAT-Check/org.apache.deltaspike.modules$deltaspike-security-module-impl/ws/target/classes/META-INF/beans.xml>
Mar 12, 2014 1:34:49 AM org.apache.deltaspike.test.utils.ShrinkWrapArchiveUtil getArchives
INFO: Test org.apache.deltaspike.test.security.impl.authorization.securitybinding.SecurityBindingTest
Adding Java ClassPath URL as JavaArchive jar:file:/home/jenkins/jenkins-slave/workspace/DeltaSpike%20RAT-Check/deltaspike/core/api/target/deltaspike-core-api-0.6-SNAPSHOT.jar!/META-INF/beans.xml
Mar 12, 2014 1:34:49 AM org.apache.deltaspike.test.utils.ShrinkWrapArchiveUtil getArchives
INFO: Test org.apache.deltaspike.test.security.impl.authorization.securitybinding.SecurityBindingTest
Adding Java ClassPath URL as JavaArchive jar:file:/home/jenkins/jenkins-slave/workspace/DeltaSpike%20RAT-Check/deltaspike/core/impl/target/deltaspike-core-impl-0.6-SNAPSHOT.jar!/META-INF/beans.xml
Mar 12, 2014 1:34:49 AM org.apache.deltaspike.test.utils.ShrinkWrapArchiveUtil getArchives
INFO: Test org.apache.deltaspike.test.security.impl.authorization.securitybinding.SecurityBindingTest
Adding Java ClassPath URL as JavaArchive jar:file:/home/jenkins/jenkins-slave/workspace/DeltaSpike%20RAT-Check/deltaspike/modules/security/api/target/deltaspike-security-module-api-0.6-SNAPSHOT.jar!/META-INF/beans.xml
Mar 12, 2014 1:34:49 AM org.apache.webbeans.lifecycle.AbstractLifeCycle startApplication
INFO: OpenWebBeans Container is starting...
Mar 12, 2014 1:34:49 AM org.apache.deltaspike.core.util.ProjectStageProducer initProjectStage
INFO: Computed the following DeltaSpike ProjectStage: UnitTest
Mar 12, 2014 1:34:49 AM org.apache.deltaspike.core.util.ClassDeactivationUtils cacheResult
INFO: class: org.apache.deltaspike.core.impl.message.MessageBundleExtension activated=true
Mar 12, 2014 1:34:49 AM org.apache.deltaspike.core.util.ClassDeactivationUtils cacheResult
INFO: class: org.apache.deltaspike.core.impl.message.NamedMessageBundleInvocationHandler activated=true
Mar 12, 2014 1:34:49 AM org.apache.deltaspike.core.util.ClassDeactivationUtils cacheResult
INFO: class: org.apache.deltaspike.core.impl.scope.DeltaSpikeContextExtension activated=true
Mar 12, 2014 1:34:49 AM org.apache.deltaspike.core.util.ClassDeactivationUtils cacheResult
INFO: class: org.apache.deltaspike.core.impl.config.ConfigurationExtension activated=true
Mar 12, 2014 1:34:49 AM org.apache.deltaspike.core.util.ClassDeactivationUtils cacheResult
INFO: class: org.apache.deltaspike.core.impl.exclude.extension.ExcludeExtension activated=true
Mar 12, 2014 1:34:49 AM org.apache.deltaspike.core.util.ClassDeactivationUtils cacheResult
INFO: class: org.apache.deltaspike.core.impl.exclude.CustomProjectStageBeanFilter activated=true
Mar 12, 2014 1:34:49 AM org.apache.deltaspike.core.util.ClassDeactivationUtils cacheResult
INFO: class: org.apache.deltaspike.core.impl.exclude.GlobalAlternative activated=true
Mar 12, 2014 1:34:49 AM org.apache.deltaspike.core.util.ClassDeactivationUtils cacheResult
INFO: class: org.apache.deltaspike.core.impl.jmx.MBeanExtension activated=true
Mar 12, 2014 1:34:49 AM org.apache.deltaspike.core.util.ClassDeactivationUtils cacheResult
INFO: class: org.apache.deltaspike.security.impl.extension.SecurityExtension activated=true
Mar 12, 2014 1:34:49 AM org.apache.deltaspike.core.util.ClassDeactivationUtils cacheResult
INFO: class: org.apache.deltaspike.core.impl.exception.control.extension.ExceptionControlExtension
activated=true
Mar 12, 2014 1:34:49 AM org.apache.webbeans.xml.WebBeansXMLConfigurator configureInterceptorsElement
WARNING: Interceptor class : org.apache.deltaspike.security.impl.extension.SecurityInterceptor
is already defined
Mar 12, 2014 1:34:50 AM org.apache.webbeans.config.BeansDeployer validateInjectionPoints
INFO: All injection points were validated successfully.
Mar 12, 2014 1:34:50 AM org.apache.webbeans.lifecycle.AbstractLifeCycle startApplication
INFO: OpenWebBeans Container has started, it took [667] ms.
Mar 12, 2014 1:34:50 AM org.apache.deltaspike.test.utils.ShrinkWrapArchiveUtil getArchives
INFO: Test org.apache.deltaspike.test.security.impl.authorization.securityparameterbinding.SecurityParameterBindingTest
Adding Java ClassPath URL as JavaArchive <https://builds.apache.org/job/DeltaSpike%20RAT-Check/org.apache.deltaspike.modules$deltaspike-security-module-impl/ws/target/classes/META-INF/beans.xml>
Mar 12, 2014 1:34:50 AM org.apache.deltaspike.test.utils.ShrinkWrapArchiveUtil getArchives
INFO: Test org.apache.deltaspike.test.security.impl.authorization.securityparameterbinding.SecurityParameterBindingTest
Adding Java ClassPath URL as JavaArchive jar:file:/home/jenkins/jenkins-slave/workspace/DeltaSpike%20RAT-Check/deltaspike/core/api/target/deltaspike-core-api-0.6-SNAPSHOT.jar!/META-INF/beans.xml
Mar 12, 2014 1:34:50 AM org.apache.deltaspike.test.utils.ShrinkWrapArchiveUtil getArchives
INFO: Test org.apache.deltaspike.test.security.impl.authorization.securityparameterbinding.SecurityParameterBindingTest
Adding Java ClassPath URL as JavaArchive jar:file:/home/jenkins/jenkins-slave/workspace/DeltaSpike%20RAT-Check/deltaspike/core/impl/target/deltaspike-core-impl-0.6-SNAPSHOT.jar!/META-INF/beans.xml
Mar 12, 2014 1:34:50 AM org.apache.deltaspike.test.utils.ShrinkWrapArchiveUtil getArchives
INFO: Test org.apache.deltaspike.test.security.impl.authorization.securityparameterbinding.SecurityParameterBindingTest
Adding Java ClassPath URL as JavaArchive jar:file:/home/jenkins/jenkins-slave/workspace/DeltaSpike%20RAT-Check/deltaspike/modules/security/api/target/deltaspike-security-module-api-0.6-SNAPSHOT.jar!/META-INF/beans.xml
Mar 12, 2014 1:34:50 AM org.apache.webbeans.lifecycle.AbstractLifeCycle startApplication
INFO: OpenWebBeans Container is starting...
Mar 12, 2014 1:34:50 AM org.apache.webbeans.xml.WebBeansXMLConfigurator configureInterceptorsElement
WARNING: Interceptor class : org.apache.deltaspike.security.impl.extension.SecurityInterceptor
is already defined
Mar 12, 2014 1:34:50 AM org.apache.webbeans.config.BeansDeployer validateInjectionPoints
INFO: All injection points were validated successfully.
Mar 12, 2014 1:34:50 AM org.apache.webbeans.lifecycle.AbstractLifeCycle startApplication
INFO: OpenWebBeans Container has started, it took [277] ms.
Running org.apache.deltaspike.test.security.impl.authorization.securitybinding.SecurityBindingTest
Exception in thread "ThreadedStreamConsumer" org.apache.maven.surefire.util.NestedRuntimeException:
null; nested exception is org.apache.maven.surefire.report.ReporterException: Unable to create
file for report: <https://builds.apache.org/job/DeltaSpike%20RAT-Check/org.apache.deltaspike.modules$deltaspike-security-module-impl/ws/target/surefire-reports/org.apache.deltaspike.test.security.impl.authorization.securitybinding.SecurityBindingTest.txt>
(No such file or directory); nested exception is java.io.FileNotFoundException: <https://builds.apache.org/job/DeltaSpike%20RAT-Check/org.apache.deltaspike.modules$deltaspike-security-module-impl/ws/target/surefire-reports/org.apache.deltaspike.test.security.impl.authorization.securitybinding.SecurityBindingTest.txt>
(No such file or directory)
org.apache.maven.surefire.report.ReporterException: Unable to create file for report: <https://builds.apache.org/job/DeltaSpike%20RAT-Check/org.apache.deltaspike.modules$deltaspike-security-module-impl/ws/target/surefire-reports/org.apache.deltaspike.test.security.impl.authorization.securitybinding.SecurityBindingTest.txt>
(No such file or directory); nested exception is java.io.FileNotFoundException: <https://builds.apache.org/job/DeltaSpike%20RAT-Check/org.apache.deltaspike.modules$deltaspike-security-module-impl/ws/target/surefire-reports/org.apache.deltaspike.test.security.impl.authorization.securitybinding.SecurityBindingTest.txt>
(No such file or directory)
java.io.FileNotFoundException: <https://builds.apache.org/job/DeltaSpike%20RAT-Check/org.apache.deltaspike.modules$deltaspike-security-module-impl/ws/target/surefire-reports/org.apache.deltaspike.test.security.impl.authorization.securitybinding.SecurityBindingTest.txt>
(No such file or directory)
	at java.io.FileOutputStream.open(Native Method)
	at java.io.FileOutputStream.<init>(FileOutputStream.java:194)
	at java.io.FileOutputStream.<init>(FileOutputStream.java:145)
	at java.io.FileWriter.<init>(FileWriter.java:73)
	at org.apache.maven.surefire.report.AbstractFileReporter.testSetStarting(AbstractFileReporter.java:74)
	at org.apache.maven.surefire.report.MulticastingReporter.testSetStarting(MulticastingReporter.java:44)
	at org.apache.maven.surefire.report.TestSetRunListener.testSetStarting(TestSetRunListener.java:110)
	at org.apache.maven.plugin.surefire.booterclient.output.ForkClient.consumeLine(ForkClient.java:94)
	at org.apache.maven.plugin.surefire.booterclient.output.ThreadedStreamConsumer$Pumper.run(ThreadedStreamConsumer.java:67)
	at java.lang.Thread.run(Thread.java:662)

Results :

Tests run: 0, Failures: 0, Errors: 0, Skipped: 0

[JENKINS] Recording test results
[INFO] 
[INFO] --- maven-jar-plugin:2.4:jar (default-jar) @ deltaspike-security-module-impl ---

Mime
View raw message