deltaspike-commits mailing list archives

Site index · List index
Message view « Date » · « Thread »
Top « Date » · « Thread »
From Apache Jenkins Server <jenk...@builds.apache.org>
Subject Build failed in Jenkins: DeltaSpike_Wildfly #6
Date Sun, 02 Mar 2014 18:52:46 GMT
See <https://builds.apache.org/job/DeltaSpike_Wildfly/6/changes>

Changes:

[tandraschko] DELTASPIKE-487 fixed JSF forward + added unit test

[tandraschko] DELTASPIKE-487 moved navigation logic to own NavigationHandler

------------------------------------------
[...truncated 659 lines...]
Downloading: https://repository.apache.org/content/repositories/snapshots/org/jboss/remotingjmx/remoting-jmx/2.0.0.Final/remoting-jmx-2.0.0.Final.jar
Downloading: https://repository.apache.org/content/repositories/snapshots/org/jboss/sasl/jboss-sasl/1.0.4.Final/jboss-sasl-1.0.4.Final.jar
Downloading: https://repository.apache.org/content/repositories/snapshots/org/wildfly/wildfly-build-config/8.0.0.Final/wildfly-build-config-8.0.0.Final.jar
Downloading: http://repo.maven.apache.org/maven2/org/wildfly/wildfly-arquillian-container-managed/8.0.0.Final/wildfly-arquillian-container-managed-8.0.0.Final.jar
Downloading: http://repo.maven.apache.org/maven2/org/wildfly/wildfly-arquillian-common/8.0.0.Final/wildfly-arquillian-common-8.0.0.Final.jar
Downloading: http://repo.maven.apache.org/maven2/org/jboss/arquillian/testenricher/arquillian-testenricher-osgi/2.1.0.CR2/arquillian-testenricher-osgi-2.1.0.CR2.jar
Downloading: http://repo.maven.apache.org/maven2/org/wildfly/wildfly-arquillian-testenricher-msc/8.0.0.Final/wildfly-arquillian-testenricher-msc-8.0.0.Final.jar
Downloading: http://repo.maven.apache.org/maven2/org/wildfly/wildfly-server/8.0.0.Final/wildfly-server-8.0.0.Final.jar
Downloaded: http://repo.maven.apache.org/maven2/org/wildfly/wildfly-arquillian-common/8.0.0.Final/wildfly-arquillian-common-8.0.0.Final.jar
(45 KB at 2467.1 KB/sec)
Downloading: http://repo.maven.apache.org/maven2/org/wildfly/wildfly-controller/8.0.0.Final/wildfly-controller-8.0.0.Final.jar
Downloaded: http://repo.maven.apache.org/maven2/org/wildfly/wildfly-arquillian-container-managed/8.0.0.Final/wildfly-arquillian-container-managed-8.0.0.Final.jar
(20 KB at 966.5 KB/sec)
Downloading: http://repo.maven.apache.org/maven2/org/wildfly/wildfly-core-security/8.0.0.Final/wildfly-core-security-8.0.0.Final.jar
Downloaded: http://repo.maven.apache.org/maven2/org/jboss/arquillian/testenricher/arquillian-testenricher-osgi/2.1.0.CR2/arquillian-testenricher-osgi-2.1.0.CR2.jar
(12 KB at 412.5 KB/sec)
Downloading: http://repo.maven.apache.org/maven2/org/wildfly/wildfly-domain-http-interface/8.0.0.Final/wildfly-domain-http-interface-8.0.0.Final.jar
Downloaded: http://repo.maven.apache.org/maven2/org/wildfly/wildfly-core-security/8.0.0.Final/wildfly-core-security-8.0.0.Final.jar
(16 KB at 1073.5 KB/sec)
Downloading: http://repo.maven.apache.org/maven2/org/wildfly/wildfly-domain-management/8.0.0.Final/wildfly-domain-management-8.0.0.Final.jar
Downloaded: http://repo.maven.apache.org/maven2/org/wildfly/wildfly-domain-http-interface/8.0.0.Final/wildfly-domain-http-interface-8.0.0.Final.jar
(70 KB at 6301.7 KB/sec)
Downloading: http://repo.maven.apache.org/maven2/org/wildfly/wildfly-deployment-repository/8.0.0.Final/wildfly-deployment-repository-8.0.0.Final.jar
Downloaded: http://repo.maven.apache.org/maven2/org/wildfly/wildfly-deployment-repository/8.0.0.Final/wildfly-deployment-repository-8.0.0.Final.jar
(27 KB at 2920.5 KB/sec)
Downloading: http://repo.maven.apache.org/maven2/org/wildfly/wildfly-patching/8.0.0.Final/wildfly-patching-8.0.0.Final.jar
Downloaded: http://repo.maven.apache.org/maven2/org/wildfly/wildfly-server/8.0.0.Final/wildfly-server-8.0.0.Final.jar
(756 KB at 14804.7 KB/sec)
Downloading: http://repo.maven.apache.org/maven2/org/wildfly/wildfly-cli/8.0.0.Final/wildfly-cli-8.0.0.Final.jar
Downloaded: http://repo.maven.apache.org/maven2/org/wildfly/wildfly-arquillian-testenricher-msc/8.0.0.Final/wildfly-arquillian-testenricher-msc-8.0.0.Final.jar
(9 KB at 149.7 KB/sec)
Downloading: http://repo.maven.apache.org/maven2/org/jboss/aesh/aesh/0.33.11/aesh-0.33.11.jar
Downloaded: http://repo.maven.apache.org/maven2/org/jboss/aesh/aesh/0.33.11/aesh-0.33.11.jar
(167 KB at 8751.1 KB/sec)
Downloading: http://repo.maven.apache.org/maven2/org/picketbox/picketbox/4.0.20.Final/picketbox-4.0.20.Final.jar
Downloaded: http://repo.maven.apache.org/maven2/org/wildfly/wildfly-controller/8.0.0.Final/wildfly-controller-8.0.0.Final.jar
(1403 KB at 23763.0 KB/sec)
Downloading: http://repo.maven.apache.org/maven2/org/wildfly/wildfly-platform-mbean/8.0.0.Final/wildfly-platform-mbean-8.0.0.Final.jar
Downloaded: http://repo.maven.apache.org/maven2/org/wildfly/wildfly-patching/8.0.0.Final/wildfly-patching-8.0.0.Final.jar
(356 KB at 11119.7 KB/sec)
Downloading: http://repo.maven.apache.org/maven2/org/wildfly/wildfly-process-controller/8.0.0.Final/wildfly-process-controller-8.0.0.Final.jar
Downloaded: http://repo.maven.apache.org/maven2/org/wildfly/wildfly-domain-management/8.0.0.Final/wildfly-domain-management-8.0.0.Final.jar
(620 KB at 11916.6 KB/sec)
Downloading: http://repo.maven.apache.org/maven2/org/wildfly/wildfly-remoting/8.0.0.Final/wildfly-remoting-8.0.0.Final.jar
Downloaded: http://repo.maven.apache.org/maven2/org/wildfly/wildfly-platform-mbean/8.0.0.Final/wildfly-platform-mbean-8.0.0.Final.jar
(123 KB at 7626.3 KB/sec)
Downloading: http://repo.maven.apache.org/maven2/org/wildfly/wildfly-io/8.0.0.Final/wildfly-io-8.0.0.Final.jar
Downloaded: http://repo.maven.apache.org/maven2/org/wildfly/wildfly-cli/8.0.0.Final/wildfly-cli-8.0.0.Final.jar
(823 KB at 20068.5 KB/sec)
Downloading: http://repo.maven.apache.org/maven2/org/wildfly/wildfly-network/8.0.0.Final/wildfly-network-8.0.0.Final.jar
Downloaded: http://repo.maven.apache.org/maven2/org/wildfly/wildfly-io/8.0.0.Final/wildfly-io-8.0.0.Final.jar
(32 KB at 3539.5 KB/sec)
Downloading: http://repo.maven.apache.org/maven2/org/wildfly/wildfly-version/8.0.0.Final/wildfly-version-8.0.0.Final.jar
Downloaded: http://repo.maven.apache.org/maven2/org/wildfly/wildfly-network/8.0.0.Final/wildfly-network-8.0.0.Final.jar
(39 KB at 2382.4 KB/sec)
Downloading: http://repo.maven.apache.org/maven2/org/jboss/jandex/1.1.0.Final/jandex-1.1.0.Final.jar
Downloaded: http://repo.maven.apache.org/maven2/org/wildfly/wildfly-process-controller/8.0.0.Final/wildfly-process-controller-8.0.0.Final.jar
(130 KB at 4304.6 KB/sec)
Downloading: http://repo.maven.apache.org/maven2/org/jboss/invocation/jboss-invocation/1.2.1.Final/jboss-invocation-1.2.1.Final.jar
Downloaded: http://repo.maven.apache.org/maven2/org/wildfly/wildfly-version/8.0.0.Final/wildfly-version-8.0.0.Final.jar
(14 KB at 1523.2 KB/sec)
Downloading: http://repo.maven.apache.org/maven2/org/jboss/logmanager/jboss-logmanager/1.5.2.Final/jboss-logmanager-1.5.2.Final.jar
Downloading: http://repo.maven.apache.org/maven2/org/jboss/modules/jboss-modules/1.3.0.Final/jboss-modules-1.3.0.Final.jar
Downloaded: http://repo.maven.apache.org/maven2/org/wildfly/wildfly-remoting/8.0.0.Final/wildfly-remoting-8.0.0.Final.jar
(176 KB at 7963.6 KB/sec)
Downloading: http://repo.maven.apache.org/maven2/org/jboss/stdio/jboss-stdio/1.0.2.GA/jboss-stdio-1.0.2.GA.jar
Downloaded: http://repo.maven.apache.org/maven2/org/picketbox/picketbox/4.0.20.Final/picketbox-4.0.20.Final.jar
(895 KB at 21814.5 KB/sec)
Downloading: http://repo.maven.apache.org/maven2/org/jboss/jboss-vfs/3.2.2.Final/jboss-vfs-3.2.2.Final.jar
Downloading: http://repo.maven.apache.org/maven2/io/undertow/undertow-core/1.0.0.Final/undertow-core-1.0.0.Final.jar
Downloaded: http://repo.maven.apache.org/maven2/org/jboss/jandex/1.1.0.Final/jandex-1.1.0.Final.jar
(75 KB at 4672.3 KB/sec)
Downloading: http://repo.maven.apache.org/maven2/org/jboss/msc/jboss-msc/1.2.0.Final/jboss-msc-1.2.0.Final.jar
Downloaded: http://repo.maven.apache.org/maven2/org/jboss/jboss-vfs/3.2.2.Final/jboss-vfs-3.2.2.Final.jar
(131 KB at 10009.0 KB/sec)
Downloading: http://repo.maven.apache.org/maven2/org/wildfly/wildfly-controller-client/8.0.0.Final/wildfly-controller-client-8.0.0.Final.jar
Downloaded: http://repo.maven.apache.org/maven2/org/jboss/modules/jboss-modules/1.3.0.Final/jboss-modules-1.3.0.Final.jar
(344 KB at 10401.6 KB/sec)
Downloading: http://repo.maven.apache.org/maven2/org/wildfly/wildfly-protocol/8.0.0.Final/wildfly-protocol-8.0.0.Final.jar
Downloaded: http://repo.maven.apache.org/maven2/org/wildfly/wildfly-controller-client/8.0.0.Final/wildfly-controller-client-8.0.0.Final.jar
(180 KB at 9963.7 KB/sec)
Downloading: http://repo.maven.apache.org/maven2/org/jboss/jboss-dmr/1.2.0.Final/jboss-dmr-1.2.0.Final.jar
Downloaded: http://repo.maven.apache.org/maven2/org/jboss/msc/jboss-msc/1.2.0.Final/jboss-msc-1.2.0.Final.jar
(224 KB at 8921.7 KB/sec)
Downloading: http://repo.maven.apache.org/maven2/org/jboss/threads/jboss-threads/2.1.1.Final/jboss-threads-2.1.1.Final.jar
Downloaded: http://repo.maven.apache.org/maven2/org/jboss/logmanager/jboss-logmanager/1.5.2.Final/jboss-logmanager-1.5.2.Final.jar
(307 KB at 7869.4 KB/sec)
Downloading: http://repo.maven.apache.org/maven2/org/wildfly/wildfly-jmx/8.0.0.Final/wildfly-jmx-8.0.0.Final.jar
Downloaded: http://repo.maven.apache.org/maven2/org/jboss/jboss-dmr/1.2.0.Final/jboss-dmr-1.2.0.Final.jar
(95 KB at 7265.8 KB/sec)
Downloading: http://repo.maven.apache.org/maven2/org/jboss/jboss-common-core/2.2.22.GA/jboss-common-core-2.2.22.GA.jar
Downloaded: http://repo.maven.apache.org/maven2/org/jboss/threads/jboss-threads/2.1.1.Final/jboss-threads-2.1.1.Final.jar
(118 KB at 9011.0 KB/sec)
Downloading: http://repo.maven.apache.org/maven2/org/wildfly/wildfly-naming/8.0.0.Final/wildfly-naming-8.0.0.Final.jar
Downloaded: http://repo.maven.apache.org/maven2/org/wildfly/wildfly-protocol/8.0.0.Final/wildfly-protocol-8.0.0.Final.jar
(99 KB at 5813.4 KB/sec)
Downloading: http://repo.maven.apache.org/maven2/org/jboss/jboss-remote-naming/2.0.0.Final/jboss-remote-naming-2.0.0.Final.jar
Downloaded: http://repo.maven.apache.org/maven2/org/wildfly/wildfly-jmx/8.0.0.Final/wildfly-jmx-8.0.0.Final.jar
(198 KB at 14131.9 KB/sec)
Downloading: http://repo.maven.apache.org/maven2/org/jboss/jboss-ejb-client/2.0.0.Final/jboss-ejb-client-2.0.0.Final.jar
Downloaded: http://repo.maven.apache.org/maven2/io/undertow/undertow-core/1.0.0.Final/undertow-core-1.0.0.Final.jar
(1198 KB at 19002.7 KB/sec)
Downloading: http://repo.maven.apache.org/maven2/org/wildfly/wildfly-arquillian-protocol-jmx/8.0.0.Final/wildfly-arquillian-protocol-jmx-8.0.0.Final.jar
Downloaded: http://repo.maven.apache.org/maven2/org/jboss/jboss-remote-naming/2.0.0.Final/jboss-remote-naming-2.0.0.Final.jar
(161 KB at 8935.0 KB/sec)
Downloading: http://repo.maven.apache.org/maven2/org/wildfly/security/wildfly-security-manager/1.0.0.Final/wildfly-security-manager-1.0.0.Final.jar
Downloaded: http://repo.maven.apache.org/maven2/org/jboss/jboss-ejb-client/2.0.0.Final/jboss-ejb-client-2.0.0.Final.jar
(300 KB at 17599.2 KB/sec)
Downloading: http://repo.maven.apache.org/maven2/org/jboss/osgi/metadata/jbosgi-metadata/3.0.1.Final/jbosgi-metadata-3.0.1.Final.jar
Downloaded: http://repo.maven.apache.org/maven2/org/jboss/jboss-common-core/2.2.22.GA/jboss-common-core-2.2.22.GA.jar
(560 KB at 21504.3 KB/sec)
Downloading: http://repo.maven.apache.org/maven2/org/jboss/xnio/xnio-api/3.2.0.Final/xnio-api-3.2.0.Final.jar
Downloading: http://repo.maven.apache.org/maven2/org/jboss/xnio/xnio-nio/3.2.0.Final/xnio-nio-3.2.0.Final.jar
Downloaded: http://repo.maven.apache.org/maven2/org/wildfly/wildfly-arquillian-protocol-jmx/8.0.0.Final/wildfly-arquillian-protocol-jmx-8.0.0.Final.jar
(48 KB at 4290.9 KB/sec)
Downloading: http://repo.maven.apache.org/maven2/org/jboss/logging/jboss-logging/3.1.4.GA/jboss-logging-3.1.4.GA.jar
Downloaded: http://repo.maven.apache.org/maven2/org/wildfly/security/wildfly-security-manager/1.0.0.Final/wildfly-security-manager-1.0.0.Final.jar
(35 KB at 2497.8 KB/sec)
Downloading: http://repo.maven.apache.org/maven2/org/jboss/remoting/jboss-remoting/4.0.0.Final/jboss-remoting-4.0.0.Final.jar
Downloading: http://repo.maven.apache.org/maven2/org/jboss/remotingjmx/remoting-jmx/2.0.0.Final/remoting-jmx-2.0.0.Final.jar
Downloaded: http://repo.maven.apache.org/maven2/org/jboss/logging/jboss-logging/3.1.4.GA/jboss-logging-3.1.4.GA.jar
(56 KB at 5585.3 KB/sec)
Downloading: http://repo.maven.apache.org/maven2/org/jboss/sasl/jboss-sasl/1.0.4.Final/jboss-sasl-1.0.4.Final.jar
Downloaded: http://repo.maven.apache.org/maven2/org/jboss/xnio/xnio-nio/3.2.0.Final/xnio-nio-3.2.0.Final.jar
(95 KB at 5915.0 KB/sec)
Downloading: http://repo.maven.apache.org/maven2/org/wildfly/wildfly-build-config/8.0.0.Final/wildfly-build-config-8.0.0.Final.jar
Downloaded: http://repo.maven.apache.org/maven2/org/jboss/xnio/xnio-api/3.2.0.Final/xnio-api-3.2.0.Final.jar
(480 KB at 23995.0 KB/sec)
Downloaded: http://repo.maven.apache.org/maven2/org/jboss/sasl/jboss-sasl/1.0.4.Final/jboss-sasl-1.0.4.Final.jar
(88 KB at 7972.5 KB/sec)
Downloaded: http://repo.maven.apache.org/maven2/org/wildfly/wildfly-build-config/8.0.0.Final/wildfly-build-config-8.0.0.Final.jar
(4 KB at 269.9 KB/sec)
Downloaded: http://repo.maven.apache.org/maven2/org/jboss/remotingjmx/remoting-jmx/2.0.0.Final/remoting-jmx-2.0.0.Final.jar
(305 KB at 10512.0 KB/sec)
Downloaded: http://repo.maven.apache.org/maven2/org/wildfly/wildfly-naming/8.0.0.Final/wildfly-naming-8.0.0.Final.jar
(222 KB at 1333.4 KB/sec)
Downloading: http://repository.jboss.org/nexus/content/groups/public/org/jboss/invocation/jboss-invocation/1.2.1.Final/jboss-invocation-1.2.1.Final.jar
Downloading: http://repository.jboss.org/nexus/content/groups/public/org/jboss/stdio/jboss-stdio/1.0.2.GA/jboss-stdio-1.0.2.GA.jar
Downloading: http://repository.jboss.org/nexus/content/groups/public/org/jboss/osgi/metadata/jbosgi-metadata/3.0.1.Final/jbosgi-metadata-3.0.1.Final.jar
Downloading: http://repository.jboss.org/nexus/content/groups/public/org/jboss/remoting/jboss-remoting/4.0.0.Final/jboss-remoting-4.0.0.Final.jar
Downloaded: http://repository.jboss.org/nexus/content/groups/public/org/jboss/stdio/jboss-stdio/1.0.2.GA/jboss-stdio-1.0.2.GA.jar
(19 KB at 108.4 KB/sec)
Downloaded: http://repository.jboss.org/nexus/content/groups/public/org/jboss/invocation/jboss-invocation/1.2.1.Final/jboss-invocation-1.2.1.Final.jar
(73 KB at 322.6 KB/sec)
Downloaded: http://repository.jboss.org/nexus/content/groups/public/org/jboss/osgi/metadata/jbosgi-metadata/3.0.1.Final/jbosgi-metadata-3.0.1.Final.jar
(70 KB at 270.4 KB/sec)
Downloaded: http://repository.jboss.org/nexus/content/groups/public/org/jboss/remoting/jboss-remoting/4.0.0.Final/jboss-remoting-4.0.0.Final.jar
(256 KB at 667.9 KB/sec)
[INFO] 
[INFO] --- maven-clean-plugin:2.5:clean (default-clean) @ parent-code ---
[INFO] Deleting <https://builds.apache.org/job/DeltaSpike_Wildfly/ws/deltaspike/parent/code/target>
[INFO] 
[INFO] --- maven-bundle-plugin:2.3.7:cleanVersions (versions) @ parent-code ---
[INFO] 
[INFO] --- maven-antrun-plugin:1.6:run (javadoc.resources) @ parent-code ---
[WARNING] Parameter tasks is deprecated, use target instead
[INFO] Executing tasks

main:
[INFO] Executed tasks
[INFO] 
[INFO] --- maven-remote-resources-plugin:1.3:process (process-remote-resources) @ parent-code
---
[INFO] 
[INFO] --- maven-remote-resources-plugin:1.3:process (default) @ parent-code ---
[INFO] 
[INFO] --- maven-dependency-plugin:2.4:unpack (unpack-wf) @ parent-code ---
[INFO] Configured Artifact: org.wildfly:wildfly-dist:8.0.0.Final:zip
Downloading: https://repository.apache.org/content/repositories/releases/org/wildfly/wildfly-dist/8.0.0.Final/wildfly-dist-8.0.0.Final.zip
Downloading: https://repository.apache.org/content/repositories/snapshots/org/wildfly/wildfly-dist/8.0.0.Final/wildfly-dist-8.0.0.Final.zip
Downloading: http://repo.maven.apache.org/maven2/org/wildfly/wildfly-dist/8.0.0.Final/wildfly-dist-8.0.0.Final.zip
[INFO] ------------------------------------------------------------------------
[INFO] Reactor Summary:
[INFO] 
[INFO] Apache DeltaSpike ................................. SUCCESS [13.571s]
[INFO] Apache DeltaSpike CheckStyle-rules ................ SUCCESS [2.419s]
[INFO] Apache DeltaSpike Parent .......................... SUCCESS [4.639s]
[INFO] Apache DeltaSpike Test-Utils ...................... SUCCESS [5.283s]
[INFO] Apache DeltaSpike Code Parent ..................... FAILURE [1:29.273s]
[INFO] Apache DeltaSpike Core ............................ SKIPPED
[INFO] Apache DeltaSpike Core-API ........................ SKIPPED
[INFO] Apache DeltaSpike Core-Implementation ............. SKIPPED
[INFO] Apache DeltaSpike ContainerControl parent ......... SKIPPED
[INFO] Apache DeltaSpike CDI ContainerControl API ........ SKIPPED
[INFO] Apache DeltaSpike CDI ContainerControl TCK ........ SKIPPED
[INFO] Apache DeltaSpike CDI OWB-ContainerControl ........ SKIPPED
[INFO] Apache DeltaSpike CDI Weld-ContainerControl ....... SKIPPED
[INFO] Apache DeltaSpike CDI OpenEJB-ContainerControl .... SKIPPED
[INFO] Apache DeltaSpike Modules ......................... SKIPPED
[INFO] Apache DeltaSpike Security-Module ................. SKIPPED
[INFO] Apache DeltaSpike Security-Module API ............. SKIPPED
[INFO] Apache DeltaSpike Security-Module Impl ............ SKIPPED
[INFO] Apache DeltaSpike JPA-Module ...................... SKIPPED
[INFO] Apache DeltaSpike JPA-Module API .................. SKIPPED
[INFO] Apache DeltaSpike JPA-Module Impl ................. SKIPPED
[INFO] Apache DeltaSpike Servlet-Module .................. SKIPPED
[INFO] Apache DeltaSpike Servlet-Module API .............. SKIPPED
[INFO] Apache DeltaSpike Servlet-Module Impl ............. SKIPPED
[INFO] Apache DeltaSpike JSF-Module ...................... SKIPPED
[INFO] Apache DeltaSpike JSF-Module API .................. SKIPPED
[INFO] Apache DeltaSpike JSF-Module Impl ................. SKIPPED
[INFO] Apache DeltaSpike Partial-Bean-Module ............. SKIPPED
[INFO] Apache DeltaSpike Partial-Bean-Module API ......... SKIPPED
[INFO] Apache DeltaSpike Partial-Bean-Module Impl ........ SKIPPED
[INFO] Apache DeltaSpike BeanValidation-Module ........... SKIPPED
[INFO] Apache DeltaSpike BeanValidation-Module API ....... SKIPPED
[INFO] Apache DeltaSpike BeanValidation-Module Impl ...... SKIPPED
[INFO] Apache DeltaSpike Data-Module ..................... SKIPPED
[INFO] Apache DeltaSpike Data-Module API ................. SKIPPED
[INFO] Apache DeltaSpike Data-Module Impl ................ SKIPPED
[INFO] Apache DeltaSpike Scheduler-Module ................ SKIPPED
[INFO] Apache DeltaSpike Scheduler-Module API ............ SKIPPED
[INFO] Apache DeltaSpike Scheduler-Module Impl ........... SKIPPED
[INFO] Apache DeltaSpike Test-Control-Module ............. SKIPPED
[INFO] Apache DeltaSpike Test-Control-Module API ......... SKIPPED
[INFO] Apache DeltaSpike Test-Control-Module Impl ........ SKIPPED
[INFO] Apache DeltaSpike Examples ........................ SKIPPED
[INFO] Apache DeltaSpike Java-SE Examples ................ SKIPPED
[INFO] Apache DeltaSpike JSF Examples .................... SKIPPED
[INFO] Apache DeltaSpike JSF Playground .................. SKIPPED
[INFO] ------------------------------------------------------------------------
[INFO] BUILD FAILURE
[INFO] ------------------------------------------------------------------------
[INFO] Total time: 2:06.511s
[INFO] Finished at: Sun Mar 02 18:52:03 UTC 2014
[INFO] Final Memory: 42M/227M
[INFO] ------------------------------------------------------------------------
Waiting for Jenkins to finish collecting data[ERROR] Failed to execute goal org.apache.maven.plugins:maven-dependency-plugin:2.4:unpack
(unpack-wf) on project parent-code: Unable to resolve artifact. Could not transfer artifact
org.wildfly:wildfly-dist:zip:8.0.0.Final from/to central (http://repo.maven.apache.org/maven2):
Failed to transfer file: http://repo.maven.apache.org/maven2/org/wildfly/wildfly-dist/8.0.0.Final/wildfly-dist-8.0.0.Final.zip.
Return code is: 503, ReasonPhrase:backend read error.
[ERROR] org.wildfly:wildfly-dist:zip:8.0.0.Final
[ERROR] 
[ERROR] from the specified remote repositories:
[ERROR] Apache Repository (https://repository.apache.org/content/repositories/releases, releases=true,
snapshots=true),
[ERROR] Apache Snapshot Repository (https://repository.apache.org/content/repositories/snapshots,
releases=true, snapshots=true),
[ERROR] Nexus (http://repository.apache.org/snapshots, releases=false, snapshots=true),
[ERROR] central (http://repo.maven.apache.org/maven2, releases=true, snapshots=false)
[ERROR] -> [Help 1]
[ERROR] 
[ERROR] To see the full stack trace of the errors, re-run Maven with the -e switch.
[ERROR] Re-run Maven using the -X switch to enable full debug logging.
[ERROR] 
[ERROR] For more information about the errors and possible solutions, please read the following
articles:
[ERROR] [Help 1] http://cwiki.apache.org/confluence/display/MAVEN/MojoExecutionException
[ERROR] 
[ERROR] After correcting the problems, you can resume the build with the command
[ERROR]   mvn <goals> -rf :parent-code

[JENKINS] Archiving <https://builds.apache.org/job/DeltaSpike_Wildfly/ws/deltaspike/modules/partial-bean/api/pom.xml>
to org.apache.deltaspike.modules/deltaspike-partial-bean-module-api/0.6-SNAPSHOT/deltaspike-partial-bean-module-api-0.6-SNAPSHOT.pom
[JENKINS] Archiving <https://builds.apache.org/job/DeltaSpike_Wildfly/ws/deltaspike/modules/scheduler/impl/pom.xml>
to org.apache.deltaspike.modules/deltaspike-scheduler-module-impl/0.6-SNAPSHOT/deltaspike-scheduler-module-impl-0.6-SNAPSHOT.pom
[JENKINS] Archiving <https://builds.apache.org/job/DeltaSpike_Wildfly/ws/deltaspike/parent/pom.xml>
to org.apache.deltaspike/parent/0.6-SNAPSHOT/parent-0.6-SNAPSHOT.pom
[JENKINS] Archiving <https://builds.apache.org/job/DeltaSpike_Wildfly/ws/deltaspike/examples/jse-examples/pom.xml>
to org.apache.deltaspike.examples/deltaspike-jse-example/0.6-SNAPSHOT/deltaspike-jse-example-0.6-SNAPSHOT.pom
[JENKINS] Archiving <https://builds.apache.org/job/DeltaSpike_Wildfly/ws/deltaspike/modules/bean-validation/api/pom.xml>
to org.apache.deltaspike.modules/deltaspike-bean-validation-module-api/0.6-SNAPSHOT/deltaspike-bean-validation-module-api-0.6-SNAPSHOT.pom
[JENKINS] Archiving <https://builds.apache.org/job/DeltaSpike_Wildfly/ws/deltaspike/core/pom.xml>
to org.apache.deltaspike.core/core-project/0.6-SNAPSHOT/core-project-0.6-SNAPSHOT.pom
[JENKINS] Archiving <https://builds.apache.org/job/DeltaSpike_Wildfly/ws/deltaspike/test-utils/pom.xml>
to org.apache.deltaspike.test/test-utils/0.6-SNAPSHOT/test-utils-0.6-SNAPSHOT.pom
[JENKINS] Archiving <https://builds.apache.org/job/DeltaSpike_Wildfly/ws/deltaspike/test-utils/target/test-utils-0.6-SNAPSHOT.jar>
to org.apache.deltaspike.test/test-utils/0.6-SNAPSHOT/test-utils-0.6-SNAPSHOT.jar
[JENKINS] Archiving <https://builds.apache.org/job/DeltaSpike_Wildfly/ws/deltaspike/test-utils/target/test-utils-0.6-SNAPSHOT-sources.jar>
to org.apache.deltaspike.test/test-utils/0.6-SNAPSHOT/test-utils-0.6-SNAPSHOT-sources.jar
[JENKINS] Archiving <https://builds.apache.org/job/DeltaSpike_Wildfly/ws/deltaspike/modules/data/impl/pom.xml>
to org.apache.deltaspike.modules/deltaspike-data-module-impl/0.6-SNAPSHOT/deltaspike-data-module-impl-0.6-SNAPSHOT.pom
[JENKINS] Archiving <https://builds.apache.org/job/DeltaSpike_Wildfly/ws/deltaspike/core/api/pom.xml>
to org.apache.deltaspike.core/deltaspike-core-api/0.6-SNAPSHOT/deltaspike-core-api-0.6-SNAPSHOT.pom
[JENKINS] Archiving <https://builds.apache.org/job/DeltaSpike_Wildfly/ws/deltaspike/modules/scheduler/pom.xml>
to org.apache.deltaspike.modules/scheduler-module-project/0.6-SNAPSHOT/scheduler-module-project-0.6-SNAPSHOT.pom
[JENKINS] Archiving <https://builds.apache.org/job/DeltaSpike_Wildfly/ws/deltaspike/modules/data/api/pom.xml>
to org.apache.deltaspike.modules/deltaspike-data-module-api/0.6-SNAPSHOT/deltaspike-data-module-api-0.6-SNAPSHOT.pom
[JENKINS] Archiving <https://builds.apache.org/job/DeltaSpike_Wildfly/ws/deltaspike/modules/security/impl/pom.xml>
to org.apache.deltaspike.modules/deltaspike-security-module-impl/0.6-SNAPSHOT/deltaspike-security-module-impl-0.6-SNAPSHOT.pom
[JENKINS] Archiving <https://builds.apache.org/job/DeltaSpike_Wildfly/ws/deltaspike/core/impl/pom.xml>
to org.apache.deltaspike.core/deltaspike-core-impl/0.6-SNAPSHOT/deltaspike-core-impl-0.6-SNAPSHOT.pom
[JENKINS] Archiving <https://builds.apache.org/job/DeltaSpike_Wildfly/ws/deltaspike/modules/test-control/pom.xml>
to org.apache.deltaspike.modules/test-control-module-project/0.6-SNAPSHOT/test-control-module-project-0.6-SNAPSHOT.pom
[JENKINS] Archiving <https://builds.apache.org/job/DeltaSpike_Wildfly/ws/deltaspike/modules/pom.xml>
to org.apache.deltaspike.modules/modules-project/0.6-SNAPSHOT/modules-project-0.6-SNAPSHOT.pom
[JENKINS] Archiving <https://builds.apache.org/job/DeltaSpike_Wildfly/ws/deltaspike/examples/jsf-examples/pom.xml>
to org.apache.deltaspike.examples/deltaspike-jsf-example/0.6-SNAPSHOT/deltaspike-jsf-example-0.6-SNAPSHOT.pom
[JENKINS] Archiving <https://builds.apache.org/job/DeltaSpike_Wildfly/ws/deltaspike/cdictrl/api/pom.xml>
to org.apache.deltaspike.cdictrl/deltaspike-cdictrl-api/0.6-SNAPSHOT/deltaspike-cdictrl-api-0.6-SNAPSHOT.pom
[JENKINS] Archiving <https://builds.apache.org/job/DeltaSpike_Wildfly/ws/deltaspike/checkstyle-rules/pom.xml>
to org.apache.deltaspike/checkstyle-rules/0.6-SNAPSHOT/checkstyle-rules-0.6-SNAPSHOT.pom
[JENKINS] Archiving <https://builds.apache.org/job/DeltaSpike_Wildfly/ws/deltaspike/checkstyle-rules/target/checkstyle-rules-0.6-SNAPSHOT.jar>
to org.apache.deltaspike/checkstyle-rules/0.6-SNAPSHOT/checkstyle-rules-0.6-SNAPSHOT.jar
[JENKINS] Archiving <https://builds.apache.org/job/DeltaSpike_Wildfly/ws/deltaspike/parent/code/pom.xml>
to org.apache.deltaspike/parent-code/0.6-SNAPSHOT/parent-code-0.6-SNAPSHOT.pom
[JENKINS] Archiving <https://builds.apache.org/job/DeltaSpike_Wildfly/ws/deltaspike/modules/partial-bean/pom.xml>
to org.apache.deltaspike.modules/partial-bean-module-project/0.6-SNAPSHOT/partial-bean-module-project-0.6-SNAPSHOT.pom
[JENKINS] Archiving <https://builds.apache.org/job/DeltaSpike_Wildfly/ws/deltaspike/modules/jsf/impl/pom.xml>
to org.apache.deltaspike.modules/deltaspike-jsf-module-impl/0.6-SNAPSHOT/deltaspike-jsf-module-impl-0.6-SNAPSHOT.pom
[JENKINS] Archiving <https://builds.apache.org/job/DeltaSpike_Wildfly/ws/deltaspike/examples/pom.xml>
to org.apache.deltaspike.examples/examples-project/0.6-SNAPSHOT/examples-project-0.6-SNAPSHOT.pom
[JENKINS] Archiving <https://builds.apache.org/job/DeltaSpike_Wildfly/ws/deltaspike/modules/jsf/pom.xml>
to org.apache.deltaspike.modules/jsf-module-project/0.6-SNAPSHOT/jsf-module-project-0.6-SNAPSHOT.pom
[JENKINS] Archiving <https://builds.apache.org/job/DeltaSpike_Wildfly/ws/deltaspike/cdictrl/impl-openejb/pom.xml>
to org.apache.deltaspike.cdictrl/deltaspike-cdictrl-openejb/0.6-SNAPSHOT/deltaspike-cdictrl-openejb-0.6-SNAPSHOT.pom
[JENKINS] Archiving <https://builds.apache.org/job/DeltaSpike_Wildfly/ws/deltaspike/cdictrl/tck/pom.xml>
to org.apache.deltaspike.test/deltaspike-cdictrl-tck/0.6-SNAPSHOT/deltaspike-cdictrl-tck-0.6-SNAPSHOT.pom
[JENKINS] Archiving <https://builds.apache.org/job/DeltaSpike_Wildfly/ws/deltaspike/modules/jsf/api/pom.xml>
to org.apache.deltaspike.modules/deltaspike-jsf-module-api/0.6-SNAPSHOT/deltaspike-jsf-module-api-0.6-SNAPSHOT.pom
[JENKINS] Archiving <https://builds.apache.org/job/DeltaSpike_Wildfly/ws/deltaspike/examples/jsf-playground/pom.xml>
to org.apache.deltaspike.examples/deltaspike-jsf-playground/0.6-SNAPSHOT/deltaspike-jsf-playground-0.6-SNAPSHOT.pom
[JENKINS] Archiving <https://builds.apache.org/job/DeltaSpike_Wildfly/ws/deltaspike/modules/security/pom.xml>
to org.apache.deltaspike.modules/security-module-project/0.6-SNAPSHOT/security-module-project-0.6-SNAPSHOT.pom
[JENKINS] Archiving <https://builds.apache.org/job/DeltaSpike_Wildfly/ws/deltaspike/modules/bean-validation/pom.xml>
to org.apache.deltaspike.modules/bean-validation-module-project/0.6-SNAPSHOT/bean-validation-module-project-0.6-SNAPSHOT.pom
[JENKINS] Archiving <https://builds.apache.org/job/DeltaSpike_Wildfly/ws/deltaspike/modules/partial-bean/impl/pom.xml>
to org.apache.deltaspike.modules/deltaspike-partial-bean-module-impl/0.6-SNAPSHOT/deltaspike-partial-bean-module-impl-0.6-SNAPSHOT.pom
[JENKINS] Archiving <https://builds.apache.org/job/DeltaSpike_Wildfly/ws/deltaspike/cdictrl/impl-weld/pom.xml>
to org.apache.deltaspike.cdictrl/deltaspike-cdictrl-weld/0.6-SNAPSHOT/deltaspike-cdictrl-weld-0.6-SNAPSHOT.pom
[JENKINS] Archiving <https://builds.apache.org/job/DeltaSpike_Wildfly/ws/deltaspike/modules/servlet/impl/pom.xml>
to org.apache.deltaspike.modules/deltaspike-servlet-module-impl/0.6-SNAPSHOT/deltaspike-servlet-module-impl-0.6-SNAPSHOT.pom
[JENKINS] Archiving <https://builds.apache.org/job/DeltaSpike_Wildfly/ws/deltaspike/modules/jpa/api/pom.xml>
to org.apache.deltaspike.modules/deltaspike-jpa-module-api/0.6-SNAPSHOT/deltaspike-jpa-module-api-0.6-SNAPSHOT.pom
[JENKINS] Archiving <https://builds.apache.org/job/DeltaSpike_Wildfly/ws/deltaspike/modules/bean-validation/impl/pom.xml>
to org.apache.deltaspike.modules/deltaspike-bean-validation-module-impl/0.6-SNAPSHOT/deltaspike-bean-validation-module-impl-0.6-SNAPSHOT.pom
[JENKINS] Archiving <https://builds.apache.org/job/DeltaSpike_Wildfly/ws/deltaspike/cdictrl/impl-owb/pom.xml>
to org.apache.deltaspike.cdictrl/deltaspike-cdictrl-owb/0.6-SNAPSHOT/deltaspike-cdictrl-owb-0.6-SNAPSHOT.pom
[JENKINS] Archiving <https://builds.apache.org/job/DeltaSpike_Wildfly/ws/deltaspike/modules/servlet/api/pom.xml>
to org.apache.deltaspike.modules/deltaspike-servlet-module-api/0.6-SNAPSHOT/deltaspike-servlet-module-api-0.6-SNAPSHOT.pom
[JENKINS] Archiving <https://builds.apache.org/job/DeltaSpike_Wildfly/ws/deltaspike/modules/jpa/pom.xml>
to org.apache.deltaspike.modules/jpa-module-project/0.6-SNAPSHOT/jpa-module-project-0.6-SNAPSHOT.pom
[JENKINS] Archiving <https://builds.apache.org/job/DeltaSpike_Wildfly/ws/deltaspike/modules/jpa/impl/pom.xml>
to org.apache.deltaspike.modules/deltaspike-jpa-module-impl/0.6-SNAPSHOT/deltaspike-jpa-module-impl-0.6-SNAPSHOT.pom
[JENKINS] Archiving <https://builds.apache.org/job/DeltaSpike_Wildfly/ws/deltaspike/modules/data/pom.xml>
to org.apache.deltaspike.modules/data-module-project/0.6-SNAPSHOT/data-module-project-0.6-SNAPSHOT.pom
[JENKINS] Archiving <https://builds.apache.org/job/DeltaSpike_Wildfly/ws/deltaspike/cdictrl/pom.xml>
to org.apache.deltaspike.cdictrl/cdictrl-project/0.6-SNAPSHOT/cdictrl-project-0.6-SNAPSHOT.pom
[JENKINS] Archiving <https://builds.apache.org/job/DeltaSpike_Wildfly/ws/deltaspike/modules/scheduler/api/pom.xml>
to org.apache.deltaspike.modules/deltaspike-scheduler-module-api/0.6-SNAPSHOT/deltaspike-scheduler-module-api-0.6-SNAPSHOT.pom
[JENKINS] Archiving <https://builds.apache.org/job/DeltaSpike_Wildfly/ws/deltaspike/modules/test-control/impl/pom.xml>
to org.apache.deltaspike.modules/deltaspike-test-control-module-impl/0.6-SNAPSHOT/deltaspike-test-control-module-impl-0.6-SNAPSHOT.pom
[JENKINS] Archiving <https://builds.apache.org/job/DeltaSpike_Wildfly/ws/deltaspike/modules/servlet/pom.xml>
to org.apache.deltaspike.modules/servlet-module-project/0.6-SNAPSHOT/servlet-module-project-0.6-SNAPSHOT.pom
[JENKINS] Archiving <https://builds.apache.org/job/DeltaSpike_Wildfly/ws/deltaspike/pom.xml>
to org.apache.deltaspike/deltaspike-project/0.6-SNAPSHOT/deltaspike-project-0.6-SNAPSHOT.pom
[JENKINS] Archiving <https://builds.apache.org/job/DeltaSpike_Wildfly/ws/deltaspike/modules/test-control/api/pom.xml>
to org.apache.deltaspike.modules/deltaspike-test-control-module-api/0.6-SNAPSHOT/deltaspike-test-control-module-api-0.6-SNAPSHOT.pom
[JENKINS] Archiving <https://builds.apache.org/job/DeltaSpike_Wildfly/ws/deltaspike/modules/security/api/pom.xml>
to org.apache.deltaspike.modules/deltaspike-security-module-api/0.6-SNAPSHOT/deltaspike-security-module-api-0.6-SNAPSHOT.pom
Sending e-mails to: commits@deltaspike.apache.org
channel stopped

Mime
View raw message