deltaspike-commits mailing list archives

Site index · List index
Message view « Date » · « Thread »
Top « Date » · « Thread »
From Apache Jenkins Server <jenk...@builds.apache.org>
Subject Build failed in Jenkins: DeltaSpike_AS7 #99
Date Sat, 01 Mar 2014 00:16:08 GMT
See <https://builds.apache.org/job/DeltaSpike_AS7/99/changes>

Changes:

[tandraschko] DELTASPIKE-487 added sample, simple unit test and bug fixes

[gpetracek] DELTASPIKE-487 tests and minor cleanup

------------------------------------------
[...truncated 1429 lines...]
[INFO] META-INF/LICENSE already added, skipping
[INFO] META-INF/DISCLAIMER already added, skipping
[INFO] META-INF/DEPENDENCIES already added, skipping
[INFO] META-INF/NOTICE already added, skipping
[INFO] META-INF already added, skipping
[INFO] META-INF/LICENSE already added, skipping
[INFO] META-INF/DISCLAIMER already added, skipping
[INFO] META-INF/DEPENDENCIES already added, skipping
[INFO] META-INF/NOTICE already added, skipping
[INFO] Building jar: <https://builds.apache.org/job/DeltaSpike_AS7/ws/deltaspike/cdictrl/impl-weld/target/deltaspike-cdictrl-weld-0.6-SNAPSHOT-sources.jar>
[INFO] META-INF already added, skipping
[INFO] META-INF/LICENSE already added, skipping
[INFO] META-INF/DISCLAIMER already added, skipping
[INFO] META-INF/DEPENDENCIES already added, skipping
[INFO] META-INF/NOTICE already added, skipping
[INFO] META-INF already added, skipping
[INFO] META-INF already added, skipping
[INFO] META-INF/LICENSE already added, skipping
[INFO] META-INF/DISCLAIMER already added, skipping
[INFO] META-INF/DEPENDENCIES already added, skipping
[INFO] META-INF/NOTICE already added, skipping
[INFO] META-INF already added, skipping
[INFO] META-INF/LICENSE already added, skipping
[INFO] META-INF/DISCLAIMER already added, skipping
[INFO] META-INF/DEPENDENCIES already added, skipping
[INFO] META-INF/NOTICE already added, skipping
[INFO] 
[INFO] --- maven-checkstyle-plugin:2.9.1:check (verify-style) @ deltaspike-cdictrl-weld ---
[INFO] Starting audit...
Audit done.

[INFO] 
[INFO] --- maven-install-plugin:2.3.1:install (default-install) @ deltaspike-cdictrl-weld
---
[INFO] Installing <https://builds.apache.org/job/DeltaSpike_AS7/ws/deltaspike/cdictrl/impl-weld/target/deltaspike-cdictrl-weld-0.6-SNAPSHOT.jar>
to /home/jenkins/jenkins-slave/maven-repositories/0/org/apache/deltaspike/cdictrl/deltaspike-cdictrl-weld/0.6-SNAPSHOT/deltaspike-cdictrl-weld-0.6-SNAPSHOT.jar
[INFO] Installing <https://builds.apache.org/job/DeltaSpike_AS7/ws/deltaspike/cdictrl/impl-weld/pom.xml>
to /home/jenkins/jenkins-slave/maven-repositories/0/org/apache/deltaspike/cdictrl/deltaspike-cdictrl-weld/0.6-SNAPSHOT/deltaspike-cdictrl-weld-0.6-SNAPSHOT.pom
[INFO] Installing <https://builds.apache.org/job/DeltaSpike_AS7/ws/deltaspike/cdictrl/impl-weld/target/deltaspike-cdictrl-weld-0.6-SNAPSHOT-sources.jar>
to /home/jenkins/jenkins-slave/maven-repositories/0/org/apache/deltaspike/cdictrl/deltaspike-cdictrl-weld/0.6-SNAPSHOT/deltaspike-cdictrl-weld-0.6-SNAPSHOT-sources.jar
[INFO]                                                                         
[INFO] ------------------------------------------------------------------------
[INFO] Building Apache DeltaSpike CDI OpenEJB-ContainerControl 0.6-SNAPSHOT
[INFO] ------------------------------------------------------------------------
[INFO] 
[INFO] --- maven-clean-plugin:2.5:clean (default-clean) @ deltaspike-cdictrl-openejb ---
[INFO] Deleting <https://builds.apache.org/job/DeltaSpike_AS7/ws/deltaspike/cdictrl/impl-openejb/target>
[INFO] 
[INFO] --- maven-bundle-plugin:2.3.7:cleanVersions (versions) @ deltaspike-cdictrl-openejb
---
[INFO] 
[INFO] --- maven-antrun-plugin:1.6:run (javadoc.resources) @ deltaspike-cdictrl-openejb ---
[WARNING] Parameter tasks is deprecated, use target instead
[INFO] Executing tasks

main:
[INFO] Executed tasks
[INFO] 
[INFO] --- maven-dependency-plugin:2.4:unpack (unpack-context) @ deltaspike-cdictrl-openejb
---
[INFO] Configured Artifact: org.apache.deltaspike.cdictrl:deltaspike-cdictrl-owb:0.6-SNAPSHOT:jar
[INFO] Unpacking <https://builds.apache.org/job/DeltaSpike_AS7/ws/deltaspike/cdictrl/impl-owb/target/deltaspike-cdictrl-owb-0.6-SNAPSHOT.jar>
to <https://builds.apache.org/job/DeltaSpike_AS7/ws/deltaspike/cdictrl/impl-openejb/target/classes>
with includes "" and excludes "**\/META-INF\/**,**\/OpenWebBeansContainerControl.class"
[INFO] 
[INFO] --- maven-remote-resources-plugin:1.3:process (process-remote-resources) @ deltaspike-cdictrl-openejb
---
[INFO] 
[INFO] --- maven-remote-resources-plugin:1.3:process (default) @ deltaspike-cdictrl-openejb
---
[INFO] 
[INFO] --- maven-resources-plugin:2.5:resources (default-resources) @ deltaspike-cdictrl-openejb
---
[debug] execute contextualize
[INFO] Using 'UTF-8' encoding to copy filtered resources.
[INFO] Copying 2 resources
[INFO] Copying 4 resources
[INFO] Copying 4 resources
[INFO] 
[INFO] --- maven-compiler-plugin:2.5:compile (default-compile) @ deltaspike-cdictrl-openejb
---
[INFO] Compiling 1 source file to <https://builds.apache.org/job/DeltaSpike_AS7/ws/deltaspike/cdictrl/impl-openejb/target/classes>
[INFO] 
[INFO] --- maven-resources-plugin:2.5:testResources (default-testResources) @ deltaspike-cdictrl-openejb
---
[debug] execute contextualize
[INFO] Using 'UTF-8' encoding to copy filtered resources.
[INFO] skip non existing resourceDirectory <https://builds.apache.org/job/DeltaSpike_AS7/ws/deltaspike/cdictrl/impl-openejb/src/test/resources>
[INFO] Copying 4 resources
[INFO] Copying 4 resources
[INFO] 
[INFO] --- maven-compiler-plugin:2.5:testCompile (default-testCompile) @ deltaspike-cdictrl-openejb
---
[INFO] Compiling 2 source files to <https://builds.apache.org/job/DeltaSpike_AS7/ws/deltaspike/cdictrl/impl-openejb/target/test-classes>
[INFO] 
[INFO] --- maven-dependency-plugin:2.4:unpack (unpack) @ deltaspike-cdictrl-openejb ---
[INFO] Configured Artifact: org.apache.deltaspike.test:deltaspike-cdictrl-tck:0.6-SNAPSHOT:jar
[INFO] Unpacking <https://builds.apache.org/job/DeltaSpike_AS7/ws/deltaspike/cdictrl/tck/target/deltaspike-cdictrl-tck-0.6-SNAPSHOT.jar>
to <https://builds.apache.org/job/DeltaSpike_AS7/ws/deltaspike/cdictrl/impl-openejb/target/test-classes>
with includes "" and excludes ""
[INFO] 
[INFO] --- maven-surefire-plugin:2.11:test (default-test) @ deltaspike-cdictrl-openejb ---
[INFO] Surefire report directory: <https://builds.apache.org/job/DeltaSpike_AS7/ws/deltaspike/cdictrl/impl-openejb/target/surefire-reports>
[INFO] Using configured provider org.apache.maven.surefire.junitcore.JUnitCoreProvider

-------------------------------------------------------
 T E S T S
-------------------------------------------------------
Concurrency config is parallel='none', perCoreThreadCount=true, threadCount=2, useUnlimitedThreads=false
Running org.apache.deltaspike.cdise.tck.ContainerCtrlTckTest
Exception in thread "ThreadedStreamConsumer" org.apache.maven.surefire.util.NestedRuntimeException:
null; nested exception is org.apache.maven.surefire.report.ReporterException: Unable to create
file for report: <https://builds.apache.org/job/DeltaSpike_AS7/ws/deltaspike/cdictrl/impl-openejb/target/surefire-reports/org.apache.deltaspike.cdise.tck.ContainerCtrlTckTest.txt>
(No such file or directory); nested exception is java.io.FileNotFoundException: <https://builds.apache.org/job/DeltaSpike_AS7/ws/deltaspike/cdictrl/impl-openejb/target/surefire-reports/org.apache.deltaspike.cdise.tck.ContainerCtrlTckTest.txt>
(No such file or directory)
org.apache.maven.surefire.report.ReporterException: Unable to create file for report: <https://builds.apache.org/job/DeltaSpike_AS7/ws/deltaspike/cdictrl/impl-openejb/target/surefire-reports/org.apache.deltaspike.cdise.tck.ContainerCtrlTckTest.txt>
(No such file or directory); nested exception is java.io.FileNotFoundException: <https://builds.apache.org/job/DeltaSpike_AS7/ws/deltaspike/cdictrl/impl-openejb/target/surefire-reports/org.apache.deltaspike.cdise.tck.ContainerCtrlTckTest.txt>
(No such file or directory)
java.io.FileNotFoundException: <https://builds.apache.org/job/DeltaSpike_AS7/ws/deltaspike/cdictrl/impl-openejb/target/surefire-reports/org.apache.deltaspike.cdise.tck.ContainerCtrlTckTest.txt>
(No such file or directory)
	at java.io.FileOutputStream.open(Native Method)
	at java.io.FileOutputStream.<init>(FileOutputStream.java:194)
	at java.io.FileOutputStream.<init>(FileOutputStream.java:145)
	at java.io.FileWriter.<init>(FileWriter.java:73)
	at org.apache.maven.surefire.report.AbstractFileReporter.testSetStarting(AbstractFileReporter.java:74)
	at org.apache.maven.surefire.report.MulticastingReporter.testSetStarting(MulticastingReporter.java:44)
	at org.apache.maven.surefire.report.TestSetRunListener.testSetStarting(TestSetRunListener.java:110)
	at org.apache.maven.plugin.surefire.booterclient.output.ForkClient.consumeLine(ForkClient.java:94)
	at org.apache.maven.plugin.surefire.booterclient.output.ThreadedStreamConsumer$Pumper.run(ThreadedStreamConsumer.java:67)
	at java.lang.Thread.run(Thread.java:662)

Results :

Tests run: 0, Failures: 0, Errors: 0, Skipped: 0

[JENKINS] Recording test results
[INFO] 
[INFO] --- maven-jar-plugin:2.4:jar (default-jar) @ deltaspike-cdictrl-openejb ---
[INFO] ------------------------------------------------------------------------
[INFO] Reactor Summary:
[INFO] 
[INFO] Apache DeltaSpike ................................. SUCCESS [24.483s]
[INFO] Apache DeltaSpike CheckStyle-rules ................ SUCCESS [4.077s]
[INFO] Apache DeltaSpike Parent .......................... SUCCESS [6.234s]
[INFO] Apache DeltaSpike Test-Utils ...................... SUCCESS [5.200s]
[INFO] Apache DeltaSpike Code Parent ..................... SUCCESS [29.964s]
[INFO] Apache DeltaSpike Core ............................ SUCCESS [7.908s]
[INFO] Apache DeltaSpike Core-API ........................ SUCCESS [23.545s]
[INFO] Apache DeltaSpike Core-Implementation ............. SUCCESS [1:22.383s]
[INFO] Apache DeltaSpike ContainerControl parent ......... SUCCESS [1.921s]
[INFO] Apache DeltaSpike CDI ContainerControl API ........ SUCCESS [3.599s]
[INFO] Apache DeltaSpike CDI ContainerControl TCK ........ SUCCESS [3.383s]
[INFO] Apache DeltaSpike CDI OWB-ContainerControl ........ SUCCESS [5.174s]
[INFO] Apache DeltaSpike CDI Weld-ContainerControl ....... SUCCESS [6.048s]
[INFO] Apache DeltaSpike CDI OpenEJB-ContainerControl .... FAILURE [11.247s]
[INFO] Apache DeltaSpike Modules ......................... SKIPPED
[INFO] Apache DeltaSpike Security-Module ................. SKIPPED
[INFO] Apache DeltaSpike Security-Module API ............. SKIPPED
[INFO] Apache DeltaSpike Security-Module Impl ............ SKIPPED
[INFO] Apache DeltaSpike JPA-Module ...................... SKIPPED
[INFO] Apache DeltaSpike JPA-Module API .................. SKIPPED
[INFO] Apache DeltaSpike JPA-Module Impl ................. SKIPPED
[INFO] Apache DeltaSpike Servlet-Module .................. SKIPPED
[INFO] Apache DeltaSpike Servlet-Module API .............. SKIPPED
[INFO] Apache DeltaSpike Servlet-Module Impl ............. SKIPPED
[INFO] Apache DeltaSpike JSF-Module ...................... SKIPPED
[INFO] Apache DeltaSpike JSF-Module API .................. SKIPPED
[INFO] Apache DeltaSpike JSF-Module Impl ................. SKIPPED
[INFO] Apache DeltaSpike Partial-Bean-Module ............. SKIPPED
[INFO] Apache DeltaSpike Partial-Bean-Module API ......... SKIPPED
[INFO] Apache DeltaSpike Partial-Bean-Module Impl ........ SKIPPED
[INFO] Apache DeltaSpike BeanValidation-Module ........... SKIPPED
[INFO] Apache DeltaSpike BeanValidation-Module API ....... SKIPPED
[INFO] Apache DeltaSpike BeanValidation-Module Impl ...... SKIPPED
[INFO] Apache DeltaSpike Data-Module ..................... SKIPPED
[INFO] Apache DeltaSpike Data-Module API ................. SKIPPED
[INFO] Apache DeltaSpike Data-Module Impl ................ SKIPPED
[INFO] Apache DeltaSpike Scheduler-Module ................ SKIPPED
[INFO] Apache DeltaSpike Scheduler-Module API ............ SKIPPED
[INFO] Apache DeltaSpike Scheduler-Module Impl ........... SKIPPED
[INFO] Apache DeltaSpike Test-Control-Module ............. SKIPPED
[INFO] Apache DeltaSpike Test-Control-Module API ......... SKIPPED
[INFO] Apache DeltaSpike Test-Control-Module Impl ........ SKIPPED
[INFO] Apache DeltaSpike Examples ........................ SKIPPED
[INFO] Apache DeltaSpike Java-SE Examples ................ SKIPPED
[INFO] Apache DeltaSpike JSF Examples .................... SKIPPED
[INFO] Apache DeltaSpike JSF Playground .................. SKIPPED
[INFO] ------------------------------------------------------------------------
[INFO] BUILD FAILURE
[INFO] ------------------------------------------------------------------------
[INFO] Total time: 4:03.064s
[INFO] Finished at: Sat Mar 01 00:15:03 UTC 2014
[INFO] Final Memory: 51M/351M
[INFO] ------------------------------------------------------------------------
Waiting for Jenkins to finish collecting data
[ERROR] Failed to execute goal org.apache.maven.plugins:maven-jar-plugin:2.4:jar (default-jar)
on project deltaspike-cdictrl-openejb: Error assembling JAR: Failed to create directory: <https://builds.apache.org/job/DeltaSpike_AS7/ws/deltaspike/cdictrl/impl-openejb/target/maven-archiver>
-> [Help 1]
[ERROR] 
[ERROR] To see the full stack trace of the errors, re-run Maven with the -e switch.
[ERROR] Re-run Maven using the -X switch to enable full debug logging.
[ERROR] 
[ERROR] For more information about the errors and possible solutions, please read the following
articles:
[ERROR] [Help 1] http://cwiki.apache.org/confluence/display/MAVEN/MojoExecutionException
[ERROR] 
[ERROR] After correcting the problems, you can resume the build with the command
[ERROR]   mvn <goals> -rf :deltaspike-cdictrl-openejb
[JENKINS] Archiving <https://builds.apache.org/job/DeltaSpike_AS7/ws/deltaspike/modules/partial-bean/api/pom.xml>
to org.apache.deltaspike.modules/deltaspike-partial-bean-module-api/0.6-SNAPSHOT/deltaspike-partial-bean-module-api-0.6-SNAPSHOT.pom
[JENKINS] Archiving <https://builds.apache.org/job/DeltaSpike_AS7/ws/deltaspike/modules/scheduler/impl/pom.xml>
to org.apache.deltaspike.modules/deltaspike-scheduler-module-impl/0.6-SNAPSHOT/deltaspike-scheduler-module-impl-0.6-SNAPSHOT.pom
[JENKINS] Archiving <https://builds.apache.org/job/DeltaSpike_AS7/ws/deltaspike/parent/pom.xml>
to org.apache.deltaspike/parent/0.6-SNAPSHOT/parent-0.6-SNAPSHOT.pom
[JENKINS] Archiving <https://builds.apache.org/job/DeltaSpike_AS7/ws/deltaspike/examples/jse-examples/pom.xml>
to org.apache.deltaspike.examples/deltaspike-jse-example/0.6-SNAPSHOT/deltaspike-jse-example-0.6-SNAPSHOT.pom
[JENKINS] Archiving <https://builds.apache.org/job/DeltaSpike_AS7/ws/deltaspike/modules/bean-validation/api/pom.xml>
to org.apache.deltaspike.modules/deltaspike-bean-validation-module-api/0.6-SNAPSHOT/deltaspike-bean-validation-module-api-0.6-SNAPSHOT.pom
[JENKINS] Archiving <https://builds.apache.org/job/DeltaSpike_AS7/ws/deltaspike/core/pom.xml>
to org.apache.deltaspike.core/core-project/0.6-SNAPSHOT/core-project-0.6-SNAPSHOT.pom
[JENKINS] Archiving <https://builds.apache.org/job/DeltaSpike_AS7/ws/deltaspike/core/target/core-project-0.6-SNAPSHOT-tests.jar>
to org.apache.deltaspike.core/core-project/0.6-SNAPSHOT/core-project-0.6-SNAPSHOT-tests.jar
[JENKINS] Archiving <https://builds.apache.org/job/DeltaSpike_AS7/ws/deltaspike/test-utils/pom.xml>
to org.apache.deltaspike.test/test-utils/0.6-SNAPSHOT/test-utils-0.6-SNAPSHOT.pom
[JENKINS] Archiving <https://builds.apache.org/job/DeltaSpike_AS7/ws/deltaspike/test-utils/target/test-utils-0.6-SNAPSHOT.jar>
to org.apache.deltaspike.test/test-utils/0.6-SNAPSHOT/test-utils-0.6-SNAPSHOT.jar
[JENKINS] Archiving <https://builds.apache.org/job/DeltaSpike_AS7/ws/deltaspike/test-utils/target/test-utils-0.6-SNAPSHOT-sources.jar>
to org.apache.deltaspike.test/test-utils/0.6-SNAPSHOT/test-utils-0.6-SNAPSHOT-sources.jar
[JENKINS] Archiving <https://builds.apache.org/job/DeltaSpike_AS7/ws/deltaspike/modules/data/impl/pom.xml>
to org.apache.deltaspike.modules/deltaspike-data-module-impl/0.6-SNAPSHOT/deltaspike-data-module-impl-0.6-SNAPSHOT.pom
[JENKINS] Archiving <https://builds.apache.org/job/DeltaSpike_AS7/ws/deltaspike/core/api/pom.xml>
to org.apache.deltaspike.core/deltaspike-core-api/0.6-SNAPSHOT/deltaspike-core-api-0.6-SNAPSHOT.pom
[JENKINS] Archiving <https://builds.apache.org/job/DeltaSpike_AS7/ws/deltaspike/core/api/target/deltaspike-core-api-0.6-SNAPSHOT.jar>
to org.apache.deltaspike.core/deltaspike-core-api/0.6-SNAPSHOT/deltaspike-core-api-0.6-SNAPSHOT.jar
[JENKINS] Archiving <https://builds.apache.org/job/DeltaSpike_AS7/ws/deltaspike/core/api/target/deltaspike-core-api-0.6-SNAPSHOT-tests.jar>
to org.apache.deltaspike.core/deltaspike-core-api/0.6-SNAPSHOT/deltaspike-core-api-0.6-SNAPSHOT-tests.jar
[JENKINS] Archiving <https://builds.apache.org/job/DeltaSpike_AS7/ws/deltaspike/core/api/target/deltaspike-core-api-0.6-SNAPSHOT-sources.jar>
to org.apache.deltaspike.core/deltaspike-core-api/0.6-SNAPSHOT/deltaspike-core-api-0.6-SNAPSHOT-sources.jar
[JENKINS] Archiving <https://builds.apache.org/job/DeltaSpike_AS7/ws/deltaspike/modules/scheduler/pom.xml>
to org.apache.deltaspike.modules/scheduler-module-project/0.6-SNAPSHOT/scheduler-module-project-0.6-SNAPSHOT.pom
[JENKINS] Archiving <https://builds.apache.org/job/DeltaSpike_AS7/ws/deltaspike/modules/data/api/pom.xml>
to org.apache.deltaspike.modules/deltaspike-data-module-api/0.6-SNAPSHOT/deltaspike-data-module-api-0.6-SNAPSHOT.pom
[JENKINS] Archiving <https://builds.apache.org/job/DeltaSpike_AS7/ws/deltaspike/modules/security/impl/pom.xml>
to org.apache.deltaspike.modules/deltaspike-security-module-impl/0.6-SNAPSHOT/deltaspike-security-module-impl-0.6-SNAPSHOT.pom
[JENKINS] Archiving <https://builds.apache.org/job/DeltaSpike_AS7/ws/deltaspike/core/impl/pom.xml>
to org.apache.deltaspike.core/deltaspike-core-impl/0.6-SNAPSHOT/deltaspike-core-impl-0.6-SNAPSHOT.pom
[JENKINS] Archiving <https://builds.apache.org/job/DeltaSpike_AS7/ws/deltaspike/core/impl/target/deltaspike-core-impl-0.6-SNAPSHOT.jar>
to org.apache.deltaspike.core/deltaspike-core-impl/0.6-SNAPSHOT/deltaspike-core-impl-0.6-SNAPSHOT.jar
[JENKINS] Archiving <https://builds.apache.org/job/DeltaSpike_AS7/ws/deltaspike/core/impl/target/deltaspike-core-impl-0.6-SNAPSHOT-tests.jar>
to org.apache.deltaspike.core/deltaspike-core-impl/0.6-SNAPSHOT/deltaspike-core-impl-0.6-SNAPSHOT-tests.jar
[JENKINS] Archiving <https://builds.apache.org/job/DeltaSpike_AS7/ws/deltaspike/core/impl/target/deltaspike-core-impl-0.6-SNAPSHOT-sources.jar>
to org.apache.deltaspike.core/deltaspike-core-impl/0.6-SNAPSHOT/deltaspike-core-impl-0.6-SNAPSHOT-sources.jar
[JENKINS] Archiving <https://builds.apache.org/job/DeltaSpike_AS7/ws/deltaspike/modules/test-control/pom.xml>
to org.apache.deltaspike.modules/test-control-module-project/0.6-SNAPSHOT/test-control-module-project-0.6-SNAPSHOT.pom
[JENKINS] Archiving <https://builds.apache.org/job/DeltaSpike_AS7/ws/deltaspike/modules/pom.xml>
to org.apache.deltaspike.modules/modules-project/0.6-SNAPSHOT/modules-project-0.6-SNAPSHOT.pom
[JENKINS] Archiving <https://builds.apache.org/job/DeltaSpike_AS7/ws/deltaspike/examples/jsf-examples/pom.xml>
to org.apache.deltaspike.examples/deltaspike-jsf-example/0.6-SNAPSHOT/deltaspike-jsf-example-0.6-SNAPSHOT.pom
[JENKINS] Archiving <https://builds.apache.org/job/DeltaSpike_AS7/ws/deltaspike/cdictrl/api/pom.xml>
to org.apache.deltaspike.cdictrl/deltaspike-cdictrl-api/0.6-SNAPSHOT/deltaspike-cdictrl-api-0.6-SNAPSHOT.pom
[JENKINS] Archiving <https://builds.apache.org/job/DeltaSpike_AS7/ws/deltaspike/cdictrl/api/target/deltaspike-cdictrl-api-0.6-SNAPSHOT.jar>
to org.apache.deltaspike.cdictrl/deltaspike-cdictrl-api/0.6-SNAPSHOT/deltaspike-cdictrl-api-0.6-SNAPSHOT.jar
[JENKINS] Archiving <https://builds.apache.org/job/DeltaSpike_AS7/ws/deltaspike/cdictrl/api/target/deltaspike-cdictrl-api-0.6-SNAPSHOT-sources.jar>
to org.apache.deltaspike.cdictrl/deltaspike-cdictrl-api/0.6-SNAPSHOT/deltaspike-cdictrl-api-0.6-SNAPSHOT-sources.jar
[JENKINS] Archiving <https://builds.apache.org/job/DeltaSpike_AS7/ws/deltaspike/checkstyle-rules/pom.xml>
to org.apache.deltaspike/checkstyle-rules/0.6-SNAPSHOT/checkstyle-rules-0.6-SNAPSHOT.pom
[JENKINS] Archiving <https://builds.apache.org/job/DeltaSpike_AS7/ws/deltaspike/checkstyle-rules/target/checkstyle-rules-0.6-SNAPSHOT.jar>
to org.apache.deltaspike/checkstyle-rules/0.6-SNAPSHOT/checkstyle-rules-0.6-SNAPSHOT.jar
[JENKINS] Archiving <https://builds.apache.org/job/DeltaSpike_AS7/ws/deltaspike/parent/code/pom.xml>
to org.apache.deltaspike/parent-code/0.6-SNAPSHOT/parent-code-0.6-SNAPSHOT.pom
[JENKINS] Archiving <https://builds.apache.org/job/DeltaSpike_AS7/ws/deltaspike/parent/code/target/parent-code-0.6-SNAPSHOT-tests.jar>
to org.apache.deltaspike/parent-code/0.6-SNAPSHOT/parent-code-0.6-SNAPSHOT-tests.jar
[JENKINS] Archiving <https://builds.apache.org/job/DeltaSpike_AS7/ws/deltaspike/modules/partial-bean/pom.xml>
to org.apache.deltaspike.modules/partial-bean-module-project/0.6-SNAPSHOT/partial-bean-module-project-0.6-SNAPSHOT.pom
[JENKINS] Archiving <https://builds.apache.org/job/DeltaSpike_AS7/ws/deltaspike/modules/jsf/impl/pom.xml>
to org.apache.deltaspike.modules/deltaspike-jsf-module-impl/0.6-SNAPSHOT/deltaspike-jsf-module-impl-0.6-SNAPSHOT.pom
[JENKINS] Archiving <https://builds.apache.org/job/DeltaSpike_AS7/ws/deltaspike/examples/pom.xml>
to org.apache.deltaspike.examples/examples-project/0.6-SNAPSHOT/examples-project-0.6-SNAPSHOT.pom
[JENKINS] Archiving <https://builds.apache.org/job/DeltaSpike_AS7/ws/deltaspike/modules/jsf/pom.xml>
to org.apache.deltaspike.modules/jsf-module-project/0.6-SNAPSHOT/jsf-module-project-0.6-SNAPSHOT.pom
[JENKINS] Archiving <https://builds.apache.org/job/DeltaSpike_AS7/ws/deltaspike/cdictrl/impl-openejb/pom.xml>
to org.apache.deltaspike.cdictrl/deltaspike-cdictrl-openejb/0.6-SNAPSHOT/deltaspike-cdictrl-openejb-0.6-SNAPSHOT.pom
[JENKINS] Archiving <https://builds.apache.org/job/DeltaSpike_AS7/ws/deltaspike/cdictrl/tck/pom.xml>
to org.apache.deltaspike.test/deltaspike-cdictrl-tck/0.6-SNAPSHOT/deltaspike-cdictrl-tck-0.6-SNAPSHOT.pom
[JENKINS] Archiving <https://builds.apache.org/job/DeltaSpike_AS7/ws/deltaspike/cdictrl/tck/target/deltaspike-cdictrl-tck-0.6-SNAPSHOT.jar>
to org.apache.deltaspike.test/deltaspike-cdictrl-tck/0.6-SNAPSHOT/deltaspike-cdictrl-tck-0.6-SNAPSHOT.jar
[JENKINS] Archiving <https://builds.apache.org/job/DeltaSpike_AS7/ws/deltaspike/cdictrl/tck/target/deltaspike-cdictrl-tck-0.6-SNAPSHOT-sources.jar>
to org.apache.deltaspike.test/deltaspike-cdictrl-tck/0.6-SNAPSHOT/deltaspike-cdictrl-tck-0.6-SNAPSHOT-sources.jar
[JENKINS] Archiving <https://builds.apache.org/job/DeltaSpike_AS7/ws/deltaspike/modules/jsf/api/pom.xml>
to org.apache.deltaspike.modules/deltaspike-jsf-module-api/0.6-SNAPSHOT/deltaspike-jsf-module-api-0.6-SNAPSHOT.pom
[JENKINS] Archiving <https://builds.apache.org/job/DeltaSpike_AS7/ws/deltaspike/examples/jsf-playground/pom.xml>
to org.apache.deltaspike.examples/deltaspike-jsf-playground/0.6-SNAPSHOT/deltaspike-jsf-playground-0.6-SNAPSHOT.pom
[JENKINS] Archiving <https://builds.apache.org/job/DeltaSpike_AS7/ws/deltaspike/modules/security/pom.xml>
to org.apache.deltaspike.modules/security-module-project/0.6-SNAPSHOT/security-module-project-0.6-SNAPSHOT.pom
[JENKINS] Archiving <https://builds.apache.org/job/DeltaSpike_AS7/ws/deltaspike/modules/bean-validation/pom.xml>
to org.apache.deltaspike.modules/bean-validation-module-project/0.6-SNAPSHOT/bean-validation-module-project-0.6-SNAPSHOT.pom
[JENKINS] Archiving <https://builds.apache.org/job/DeltaSpike_AS7/ws/deltaspike/modules/partial-bean/impl/pom.xml>
to org.apache.deltaspike.modules/deltaspike-partial-bean-module-impl/0.6-SNAPSHOT/deltaspike-partial-bean-module-impl-0.6-SNAPSHOT.pom
[JENKINS] Archiving <https://builds.apache.org/job/DeltaSpike_AS7/ws/deltaspike/cdictrl/impl-weld/pom.xml>
to org.apache.deltaspike.cdictrl/deltaspike-cdictrl-weld/0.6-SNAPSHOT/deltaspike-cdictrl-weld-0.6-SNAPSHOT.pom
[JENKINS] Archiving <https://builds.apache.org/job/DeltaSpike_AS7/ws/deltaspike/cdictrl/impl-weld/target/deltaspike-cdictrl-weld-0.6-SNAPSHOT.jar>
to org.apache.deltaspike.cdictrl/deltaspike-cdictrl-weld/0.6-SNAPSHOT/deltaspike-cdictrl-weld-0.6-SNAPSHOT.jar
[JENKINS] Archiving <https://builds.apache.org/job/DeltaSpike_AS7/ws/deltaspike/cdictrl/impl-weld/target/deltaspike-cdictrl-weld-0.6-SNAPSHOT-sources.jar>
to org.apache.deltaspike.cdictrl/deltaspike-cdictrl-weld/0.6-SNAPSHOT/deltaspike-cdictrl-weld-0.6-SNAPSHOT-sources.jar
[JENKINS] Archiving <https://builds.apache.org/job/DeltaSpike_AS7/ws/deltaspike/modules/servlet/impl/pom.xml>
to org.apache.deltaspike.modules/deltaspike-servlet-module-impl/0.6-SNAPSHOT/deltaspike-servlet-module-impl-0.6-SNAPSHOT.pom
[JENKINS] Archiving <https://builds.apache.org/job/DeltaSpike_AS7/ws/deltaspike/modules/jpa/api/pom.xml>
to org.apache.deltaspike.modules/deltaspike-jpa-module-api/0.6-SNAPSHOT/deltaspike-jpa-module-api-0.6-SNAPSHOT.pom
[JENKINS] Archiving <https://builds.apache.org/job/DeltaSpike_AS7/ws/deltaspike/modules/bean-validation/impl/pom.xml>
to org.apache.deltaspike.modules/deltaspike-bean-validation-module-impl/0.6-SNAPSHOT/deltaspike-bean-validation-module-impl-0.6-SNAPSHOT.pom
[JENKINS] Archiving <https://builds.apache.org/job/DeltaSpike_AS7/ws/deltaspike/cdictrl/impl-owb/pom.xml>
to org.apache.deltaspike.cdictrl/deltaspike-cdictrl-owb/0.6-SNAPSHOT/deltaspike-cdictrl-owb-0.6-SNAPSHOT.pom
[JENKINS] Archiving <https://builds.apache.org/job/DeltaSpike_AS7/ws/deltaspike/cdictrl/impl-owb/target/deltaspike-cdictrl-owb-0.6-SNAPSHOT.jar>
to org.apache.deltaspike.cdictrl/deltaspike-cdictrl-owb/0.6-SNAPSHOT/deltaspike-cdictrl-owb-0.6-SNAPSHOT.jar
[JENKINS] Archiving <https://builds.apache.org/job/DeltaSpike_AS7/ws/deltaspike/cdictrl/impl-owb/target/deltaspike-cdictrl-owb-0.6-SNAPSHOT-sources.jar>
to org.apache.deltaspike.cdictrl/deltaspike-cdictrl-owb/0.6-SNAPSHOT/deltaspike-cdictrl-owb-0.6-SNAPSHOT-sources.jar
[JENKINS] Archiving <https://builds.apache.org/job/DeltaSpike_AS7/ws/deltaspike/modules/servlet/api/pom.xml>
to org.apache.deltaspike.modules/deltaspike-servlet-module-api/0.6-SNAPSHOT/deltaspike-servlet-module-api-0.6-SNAPSHOT.pom
[JENKINS] Archiving <https://builds.apache.org/job/DeltaSpike_AS7/ws/deltaspike/modules/jpa/pom.xml>
to org.apache.deltaspike.modules/jpa-module-project/0.6-SNAPSHOT/jpa-module-project-0.6-SNAPSHOT.pom
[JENKINS] Archiving <https://builds.apache.org/job/DeltaSpike_AS7/ws/deltaspike/modules/jpa/impl/pom.xml>
to org.apache.deltaspike.modules/deltaspike-jpa-module-impl/0.6-SNAPSHOT/deltaspike-jpa-module-impl-0.6-SNAPSHOT.pom
[JENKINS] Archiving <https://builds.apache.org/job/DeltaSpike_AS7/ws/deltaspike/modules/data/pom.xml>
to org.apache.deltaspike.modules/data-module-project/0.6-SNAPSHOT/data-module-project-0.6-SNAPSHOT.pom
[JENKINS] Archiving <https://builds.apache.org/job/DeltaSpike_AS7/ws/deltaspike/cdictrl/pom.xml>
to org.apache.deltaspike.cdictrl/cdictrl-project/0.6-SNAPSHOT/cdictrl-project-0.6-SNAPSHOT.pom
[JENKINS] Archiving <https://builds.apache.org/job/DeltaSpike_AS7/ws/deltaspike/modules/scheduler/api/pom.xml>
to org.apache.deltaspike.modules/deltaspike-scheduler-module-api/0.6-SNAPSHOT/deltaspike-scheduler-module-api-0.6-SNAPSHOT.pom
[JENKINS] Archiving <https://builds.apache.org/job/DeltaSpike_AS7/ws/deltaspike/modules/test-control/impl/pom.xml>
to org.apache.deltaspike.modules/deltaspike-test-control-module-impl/0.6-SNAPSHOT/deltaspike-test-control-module-impl-0.6-SNAPSHOT.pom
[JENKINS] Archiving <https://builds.apache.org/job/DeltaSpike_AS7/ws/deltaspike/modules/servlet/pom.xml>
to org.apache.deltaspike.modules/servlet-module-project/0.6-SNAPSHOT/servlet-module-project-0.6-SNAPSHOT.pom
[JENKINS] Archiving <https://builds.apache.org/job/DeltaSpike_AS7/ws/deltaspike/pom.xml>
to org.apache.deltaspike/deltaspike-project/0.6-SNAPSHOT/deltaspike-project-0.6-SNAPSHOT.pom
[JENKINS] Archiving <https://builds.apache.org/job/DeltaSpike_AS7/ws/deltaspike/modules/test-control/api/pom.xml>
to org.apache.deltaspike.modules/deltaspike-test-control-module-api/0.6-SNAPSHOT/deltaspike-test-control-module-api-0.6-SNAPSHOT.pom
[JENKINS] Archiving <https://builds.apache.org/job/DeltaSpike_AS7/ws/deltaspike/modules/security/api/pom.xml>
to org.apache.deltaspike.modules/deltaspike-security-module-api/0.6-SNAPSHOT/deltaspike-security-module-api-0.6-SNAPSHOT.pom
Sending e-mails to: commits@deltaspike.apache.org
channel stopped

Mime
View raw message