deltaspike-commits mailing list archives

Site index · List index
Message view « Date » · « Thread »
Top « Date » · « Thread »
From Apache Jenkins Server <jenk...@builds.apache.org>
Subject Build failed in Jenkins: DeltaSpike Weld 1.1.18 #1
Date Thu, 27 Feb 2014 23:55:23 GMT
See <https://builds.apache.org/job/DeltaSpike%20Weld%201.1.18/1/>

------------------------------------------
Started by timer
Building remotely on ubuntu3 in workspace <https://builds.apache.org/job/DeltaSpike%20Weld%201.1.18/ws/>
Cloning the remote Git repository
Cloning repository https://git-wip-us.apache.org/repos/asf/deltaspike.git
Fetching upstream changes from https://git-wip-us.apache.org/repos/asf/deltaspike.git
Fetching upstream changes from https://git-wip-us.apache.org/repos/asf/deltaspike.git
Checking out Revision 9f59afca6df252229c1c7f1bee89f2f44e022750 (origin/master)
First time build. Skipping changelog.
Parsing POMs
Discovered a new module org.apache.deltaspike:deltaspike-project Apache DeltaSpike
Discovered a new module org.apache.deltaspike:checkstyle-rules Apache DeltaSpike CheckStyle-rules
Discovered a new module org.apache.deltaspike:parent Apache DeltaSpike Parent
Discovered a new module org.apache.deltaspike:parent-code Apache DeltaSpike Code Parent
Discovered a new module org.apache.deltaspike.test:test-utils Apache DeltaSpike Test-Utils
Discovered a new module org.apache.deltaspike.core:core-project Apache DeltaSpike Core
Discovered a new module org.apache.deltaspike.core:deltaspike-core-api Apache DeltaSpike Core-API
Discovered a new module org.apache.deltaspike.core:deltaspike-core-impl Apache DeltaSpike
Core-Implementation
Discovered a new module org.apache.deltaspike.cdictrl:cdictrl-project Apache DeltaSpike ContainerControl
parent
Discovered a new module org.apache.deltaspike.cdictrl:deltaspike-cdictrl-api Apache DeltaSpike
CDI ContainerControl API
Discovered a new module org.apache.deltaspike.test:deltaspike-cdictrl-tck Apache DeltaSpike
CDI ContainerControl TCK
Discovered a new module org.apache.deltaspike.cdictrl:deltaspike-cdictrl-owb Apache DeltaSpike
CDI OWB-ContainerControl
Discovered a new module org.apache.deltaspike.cdictrl:deltaspike-cdictrl-weld Apache DeltaSpike
CDI Weld-ContainerControl
Discovered a new module org.apache.deltaspike.cdictrl:deltaspike-cdictrl-openejb Apache DeltaSpike
CDI OpenEJB-ContainerControl
Discovered a new module org.apache.deltaspike.modules:modules-project Apache DeltaSpike Modules
Discovered a new module org.apache.deltaspike.modules:security-module-project Apache DeltaSpike
Security-Module
Discovered a new module org.apache.deltaspike.modules:deltaspike-security-module-api Apache
DeltaSpike Security-Module API
Discovered a new module org.apache.deltaspike.modules:deltaspike-security-module-impl Apache
DeltaSpike Security-Module Impl
Discovered a new module org.apache.deltaspike.modules:jpa-module-project Apache DeltaSpike
JPA-Module
Discovered a new module org.apache.deltaspike.modules:deltaspike-jpa-module-api Apache DeltaSpike
JPA-Module API
Discovered a new module org.apache.deltaspike.modules:deltaspike-jpa-module-impl Apache DeltaSpike
JPA-Module Impl
Discovered a new module org.apache.deltaspike.modules:servlet-module-project Apache DeltaSpike
Servlet-Module
Discovered a new module org.apache.deltaspike.modules:deltaspike-servlet-module-api Apache
DeltaSpike Servlet-Module API
Discovered a new module org.apache.deltaspike.modules:deltaspike-servlet-module-impl Apache
DeltaSpike Servlet-Module Impl
Discovered a new module org.apache.deltaspike.modules:jsf-module-project Apache DeltaSpike
JSF-Module
Discovered a new module org.apache.deltaspike.modules:deltaspike-jsf-module-api Apache DeltaSpike
JSF-Module API
Discovered a new module org.apache.deltaspike.modules:deltaspike-jsf-module-impl Apache DeltaSpike
JSF-Module Impl
Discovered a new module org.apache.deltaspike.modules:partial-bean-module-project Apache DeltaSpike
Partial-Bean-Module
Discovered a new module org.apache.deltaspike.modules:deltaspike-partial-bean-module-api Apache
DeltaSpike Partial-Bean-Module API
Discovered a new module org.apache.deltaspike.modules:deltaspike-partial-bean-module-impl
Apache DeltaSpike Partial-Bean-Module Impl
Discovered a new module org.apache.deltaspike.modules:bean-validation-module-project Apache
DeltaSpike BeanValidation-Module
Discovered a new module org.apache.deltaspike.modules:deltaspike-bean-validation-module-api
Apache DeltaSpike BeanValidation-Module API
Discovered a new module org.apache.deltaspike.modules:deltaspike-bean-validation-module-impl
Apache DeltaSpike BeanValidation-Module Impl
Discovered a new module org.apache.deltaspike.modules:data-module-project Apache DeltaSpike
Data-Module
Discovered a new module org.apache.deltaspike.modules:deltaspike-data-module-api Apache DeltaSpike
Data-Module API
Discovered a new module org.apache.deltaspike.modules:deltaspike-data-module-impl Apache DeltaSpike
Data-Module Impl
Discovered a new module org.apache.deltaspike.modules:scheduler-module-project Apache DeltaSpike
Scheduler-Module
Discovered a new module org.apache.deltaspike.modules:deltaspike-scheduler-module-api Apache
DeltaSpike Scheduler-Module API
Discovered a new module org.apache.deltaspike.modules:deltaspike-scheduler-module-impl Apache
DeltaSpike Scheduler-Module Impl
Discovered a new module org.apache.deltaspike.modules:test-control-module-project Apache DeltaSpike
Test-Control-Module
Discovered a new module org.apache.deltaspike.modules:deltaspike-test-control-module-api Apache
DeltaSpike Test-Control-Module API
Discovered a new module org.apache.deltaspike.modules:deltaspike-test-control-module-impl
Apache DeltaSpike Test-Control-Module Impl
Discovered a new module org.apache.deltaspike.examples:examples-project Apache DeltaSpike
Examples
Discovered a new module org.apache.deltaspike.examples:deltaspike-jse-example Apache DeltaSpike
Java-SE Examples
Discovered a new module org.apache.deltaspike.examples:deltaspike-jsf-example Apache DeltaSpike
JSF Examples
Discovered a new module org.apache.deltaspike.examples:deltaspike-jsf-playground Apache DeltaSpike
JSF Playground
Modules changed, recalculating dependency graph
maven3-agent.jar already up to date
maven3-interceptor.jar already up to date
maven3-interceptor-commons.jar already up to date
[deltaspike] $ /home/hudson/tools/java/latest1.6/bin/java -cp /home/jenkins/jenkins-slave/maven3-agent.jar:/home/hudson/tools/maven/apache-maven-3.0.4/boot/plexus-classworlds-2.4.jar
org.jvnet.hudson.maven3.agent.Maven3Main /home/hudson/tools/maven/apache-maven-3.0.4 /x1/jenkins/jenkins-slave/slave.jar
/home/jenkins/jenkins-slave/maven3-interceptor.jar /home/jenkins/jenkins-slave/maven3-interceptor-commons.jar
41694
<===[JENKINS REMOTING CAPACITY]===>   channel started
log4j:WARN No appenders could be found for logger (org.apache.commons.beanutils.converters.BooleanConverter).
log4j:WARN Please initialize the log4j system properly.
Executing Maven:  -B -f <https://builds.apache.org/job/DeltaSpike%20Weld%201.1.18/ws/deltaspike/pom.xml>
-Dmaven.repo.local=/home/jenkins/jenkins-slave/maven-repositories/1 clean install -PWeld -Dweld.version=1.1.18.Final
[INFO] Scanning for projects...
Downloading: https://repository.apache.org/content/repositories/releases/org/jboss/weld/weld-core-bom/1.1.18.Final/weld-core-bom-1.1.18.Final.pom
Downloading: https://repository.apache.org/content/repositories/snapshots/org/jboss/weld/weld-core-bom/1.1.18.Final/weld-core-bom-1.1.18.Final.pom
Downloading: http://repo.maven.apache.org/maven2/org/jboss/weld/weld-core-bom/1.1.18.Final/weld-core-bom-1.1.18.Final.pom
Downloading: https://repository.apache.org/content/repositories/releases/org/jboss/weld/weld-core-bom/1.1.18.Final/weld-core-bom-1.1.18.Final.pom
Downloading: https://repository.apache.org/content/repositories/snapshots/org/jboss/weld/weld-core-bom/1.1.18.Final/weld-core-bom-1.1.18.Final.pom
Downloading: http://repo.maven.apache.org/maven2/org/jboss/weld/weld-core-bom/1.1.18.Final/weld-core-bom-1.1.18.Final.pom
Downloading: https://repository.apache.org/content/repositories/releases/org/jboss/weld/weld-core-bom/1.1.18.Final/weld-core-bom-1.1.18.Final.pom
Downloading: https://repository.apache.org/content/repositories/snapshots/org/jboss/weld/weld-core-bom/1.1.18.Final/weld-core-bom-1.1.18.Final.pom
Downloading: http://repo.maven.apache.org/maven2/org/jboss/weld/weld-core-bom/1.1.18.Final/weld-core-bom-1.1.18.Final.pom
[ERROR] The build could not read 3 projects -> [Help 1]
[ERROR]   
[ERROR]   The project org.apache.deltaspike:parent-code:0.6-SNAPSHOT (<https://builds.apache.org/job/DeltaSpike%20Weld%201.1.18/ws/deltaspike/parent/code/pom.xml)>
has 7 errors
[ERROR]     Non-resolvable import POM: Could not find artifact org.jboss.weld:weld-core-bom:pom:1.1.18.Final
in Apache Repository (https://repository.apache.org/content/repositories/releases) @ line
245, column 33 -> [Help 2]
[ERROR]     'dependencies.dependency.version' for javax.enterprise:cdi-api:jar is missing.
@ line 255, column 29
[ERROR]     'dependencies.dependency.version' for org.jboss.weld:weld-api:jar is missing.
@ line 260, column 29
[ERROR]     'dependencies.dependency.version' for org.jboss.weld:weld-core:jar is missing.
@ line 265, column 29
[ERROR]     'dependencies.dependency.version' for org.jboss.spec.javax.ejb:jboss-ejb-api_3.1_spec:jar
is missing. @ line 281, column 29
[ERROR]     'dependencies.dependency.version' for javax.validation:validation-api:jar is missing.
@ line 286, column 29
[ERROR]     'dependencies.dependency.version' for javax.persistence:persistence-api:jar is
missing. @ line 291, column 29
[ERROR]   
[ERROR]   The project org.apache.deltaspike.core:core-project:0.6-SNAPSHOT (<https://builds.apache.org/job/DeltaSpike%20Weld%201.1.18/ws/deltaspike/core/pom.xml)>
has 7 errors
[ERROR]     Non-resolvable import POM: Could not find artifact org.jboss.weld:weld-core-bom:pom:1.1.18.Final
in Apache Repository (https://repository.apache.org/content/repositories/releases) @ org.apache.deltaspike:parent-code:0.6-SNAPSHOT,
<https://builds.apache.org/job/DeltaSpike%20Weld%201.1.18/ws/deltaspike/parent/code/pom.xml,>
line 245, column 33 -> [Help 2]
[ERROR]     'dependencies.dependency.version' for javax.enterprise:cdi-api:jar is missing.
@ org.apache.deltaspike:parent-code:0.6-SNAPSHOT, <https://builds.apache.org/job/DeltaSpike%20Weld%201.1.18/ws/deltaspike/parent/code/pom.xml,>
line 255, column 29
[ERROR]     'dependencies.dependency.version' for org.jboss.weld:weld-api:jar is missing.
@ org.apache.deltaspike:parent-code:0.6-SNAPSHOT, <https://builds.apache.org/job/DeltaSpike%20Weld%201.1.18/ws/deltaspike/parent/code/pom.xml,>
line 260, column 29
[ERROR]     'dependencies.dependency.version' for org.jboss.weld:weld-core:jar is missing.
@ org.apache.deltaspike:parent-code:0.6-SNAPSHOT, <https://builds.apache.org/job/DeltaSpike%20Weld%201.1.18/ws/deltaspike/parent/code/pom.xml,>
line 265, column 29
[ERROR]     'dependencies.dependency.version' for org.jboss.spec.javax.ejb:jboss-ejb-api_3.1_spec:jar
is missing. @ org.apache.deltaspike:parent-code:0.6-SNAPSHOT, <https://builds.apache.org/job/DeltaSpike%20Weld%201.1.18/ws/deltaspike/parent/code/pom.xml,>
line 281, column 29
[ERROR]     'dependencies.dependency.version' for javax.validation:validation-api:jar is missing.
@ org.apache.deltaspike:parent-code:0.6-SNAPSHOT, <https://builds.apache.org/job/DeltaSpike%20Weld%201.1.18/ws/deltaspike/parent/code/pom.xml,>
line 286, column 29
[ERROR]     'dependencies.dependency.version' for javax.persistence:persistence-api:jar is
missing. @ org.apache.deltaspike:parent-code:0.6-SNAPSHOT, <https://builds.apache.org/job/DeltaSpike%20Weld%201.1.18/ws/deltaspike/parent/code/pom.xml,>
line 291, column 29
[ERROR]   
[ERROR]   The project org.apache.deltaspike.modules:modules-project:0.6-SNAPSHOT (<https://builds.apache.org/job/DeltaSpike%20Weld%201.1.18/ws/deltaspike/modules/pom.xml)>
has 7 errors
[ERROR]     Non-resolvable import POM: Could not find artifact org.jboss.weld:weld-core-bom:pom:1.1.18.Final
in Apache Repository (https://repository.apache.org/content/repositories/releases) @ org.apache.deltaspike:parent-code:0.6-SNAPSHOT,
<https://builds.apache.org/job/DeltaSpike%20Weld%201.1.18/ws/deltaspike/parent/code/pom.xml,>
line 245, column 33 -> [Help 2]
[ERROR]     'dependencies.dependency.version' for javax.enterprise:cdi-api:jar is missing.
@ org.apache.deltaspike:parent-code:0.6-SNAPSHOT, <https://builds.apache.org/job/DeltaSpike%20Weld%201.1.18/ws/deltaspike/parent/code/pom.xml,>
line 255, column 29
[ERROR]     'dependencies.dependency.version' for org.jboss.weld:weld-api:jar is missing.
@ org.apache.deltaspike:parent-code:0.6-SNAPSHOT, <https://builds.apache.org/job/DeltaSpike%20Weld%201.1.18/ws/deltaspike/parent/code/pom.xml,>
line 260, column 29
[ERROR]     'dependencies.dependency.version' for org.jboss.weld:weld-core:jar is missing.
@ org.apache.deltaspike:parent-code:0.6-SNAPSHOT, <https://builds.apache.org/job/DeltaSpike%20Weld%201.1.18/ws/deltaspike/parent/code/pom.xml,>
line 265, column 29
[ERROR]     'dependencies.dependency.version' for org.jboss.spec.javax.ejb:jboss-ejb-api_3.1_spec:jar
is missing. @ org.apache.deltaspike:parent-code:0.6-SNAPSHOT, <https://builds.apache.org/job/DeltaSpike%20Weld%201.1.18/ws/deltaspike/parent/code/pom.xml,>
line 281, column 29
[ERROR]     'dependencies.dependency.version' for javax.validation:validation-api:jar is missing.
@ org.apache.deltaspike:parent-code:0.6-SNAPSHOT, <https://builds.apache.org/job/DeltaSpike%20Weld%201.1.18/ws/deltaspike/parent/code/pom.xml,>
line 286, column 29
[ERROR]     'dependencies.dependency.version' for javax.persistence:persistence-api:jar is
missing. @ org.apache.deltaspike:parent-code:0.6-SNAPSHOT, <https://builds.apache.org/job/DeltaSpike%20Weld%201.1.18/ws/deltaspike/parent/code/pom.xml,>
line 291, column 29
[ERROR] 
[ERROR] To see the full stack trace of the errors, re-run Maven with the -e switch.
[ERROR] Re-run Maven using the -X switch to enable full debug logging.
[ERROR] 
[ERROR] For more information about the errors and possible solutions, please read the following
articles:
[ERROR] [Help 1] http://cwiki.apache.org/confluence/display/MAVEN/ProjectBuildingException
[ERROR] [Help 2] http://cwiki.apache.org/confluence/display/MAVEN/UnresolvableModelException
channel stopped

Mime
View raw message