deltaspike-commits mailing list archives

Site index · List index
Message view « Date » · « Thread »
Top « Date » · « Thread »
From Apache Jenkins Server <jenk...@builds.apache.org>
Subject Build failed in Jenkins: Deltaspike OWB 1.1.9-SNAPSHOT #121
Date Fri, 28 Feb 2014 19:40:52 GMT
See <https://builds.apache.org/job/Deltaspike%20OWB%201.1.9-SNAPSHOT/121/changes>

Changes:

[tandraschko] DELTASPIKE-487 ViewAccessScoped prototype

[tommy] DELTASPIKE-487 removed unused logic

[tandraschko] DELTASPIKE-487 removed unused logic

[tandraschko] DELTASPIKE-487 removed unused logic (thanks netbeans)

[tandraschko] DELTASPIKE-487 removed unused logic (thanks netbeans for destroying my workspace)

[tandraschko] DELTASPIKE-487 added sample, simple unit test and bug fixes

[gpetracek] DELTASPIKE-487 tests and minor cleanup

------------------------------------------
[...truncated 5353 lines...]
[debug] execute contextualize
[INFO] Using 'UTF-8' encoding to copy filtered resources.
[INFO] Copying 2 resources
[INFO] Copying 4 resources
[INFO] Copying 4 resources
[INFO] 
[INFO] --- maven-compiler-plugin:2.5:compile (default-compile) @ deltaspike-data-module-impl ---
[INFO] Compiling 146 source files to <https://builds.apache.org/job/Deltaspike%20OWB%201.1.9-SNAPSHOT/ws/deltaspike/modules/data/impl/target/classes>
[INFO] 
[INFO] --- maven-processor-plugin:2.0.7:process-test (process-test) @ deltaspike-data-module-impl ---
[INFO] Source directory: <https://builds.apache.org/job/Deltaspike%20OWB%201.1.9-SNAPSHOT/ws/deltaspike/modules/data/impl/target/generated-sources/apt-test> added
[INFO] javac option: -cp
[INFO] javac option: /home/jenkins/jenkins-slave/maven-repositories/1/org/hibernate/hibernate-jpamodelgen/1.2.0.Final/hibernate-jpamodelgen-1.2.0.Final.jar:/home/jenkins/jenkins-slave/maven-repositories/1/org/sonatype/sisu/sisu-inject-bean/1.4.3.1/sisu-inject-bean-1.4.3.1.jar:/home/jenkins/jenkins-slave/maven-repositories/1/org/sonatype/sisu/sisu-guice/2.9.1/sisu-guice-2.9.1-noaop.jar:/home/jenkins/jenkins-slave/maven-repositories/1/org/sonatype/aether/aether-util/1.8/aether-util-1.8.jar:/home/jenkins/jenkins-slave/maven-repositories/1/org/codehaus/plexus/plexus-interpolation/1.14/plexus-interpolation-1.14.jar:/home/jenkins/jenkins-slave/maven-repositories/1/org/codehaus/plexus/plexus-utils/2.0.4/plexus-utils-2.0.4.jar:/home/jenkins/jenkins-slave/maven-repositories/1/org/codehaus/plexus/plexus-component-annotations/1.5.5/plexus-component-annotations-1.5.5.jar:/home/jenkins/jenkins-slave/maven-repositories/1/org/sonatype/plexus/plexus-sec-dispatcher/1.3/plexus-sec-dispatcher-1.3.jar:/home/jenkins/jenkins-slave/maven-repositories/1/org/sonatype/plexus/plexus-cipher/1.4/plexus-cipher-1.4.jar:<https://builds.apache.org/job/Deltaspike%20OWB%201.1.9-SNAPSHOT/ws/deltaspike/modules/data/impl/src/test/resources>:<https://builds.apache.org/job/Deltaspike%20OWB%201.1.9-SNAPSHOT/ws/deltaspike/modules/data/impl/target/maven-shared-archive-resources>:<https://builds.apache.org/job/Deltaspike%20OWB%201.1.9-SNAPSHOT/ws/deltaspike/modules/data/impl/target/test-classes>:<https://builds.apache.org/job/Deltaspike%20OWB%201.1.9-SNAPSHOT/ws/deltaspike/modules/data/impl/target/classes>:/home/jenkins/jenkins-slave/maven-repositories/1/org/apache/geronimo/specs/geronimo-jpa_2.0_spec/1.1/geronimo-jpa_2.0_spec-1.1.jar:/home/jenkins/jenkins-slave/maven-repositories/1/org/apache/geronimo/specs/geronimo-jta_1.1_spec/1.1.1/geronimo-jta_1.1_spec-1.1.1.jar:<https://builds.apache.org/job/Deltaspike%20OWB%201.1.9-SNAPSHOT/ws/deltaspike/modules/data/api/target/deltaspike-data-module-api-0.6-SNAPSHOT.jar>:<https://builds.apache.org/job/Deltaspike%20OWB%201.1.9-SNAPSHOT/ws/deltaspike/core/api/target/deltaspike-core-api-0.6-SNAPSHOT.jar>:<https://builds.apache.org/job/Deltaspike%20OWB%201.1.9-SNAPSHOT/ws/deltaspike/modules/partial-bean/api/target/deltaspike-partial-bean-module-api-0.6-SNAPSHOT.jar>:<https://builds.apache.org/job/Deltaspike%20OWB%201.1.9-SNAPSHOT/ws/deltaspike/core/impl/target/deltaspike-core-impl-0.6-SNAPSHOT.jar>:<https://builds.apache.org/job/Deltaspike%20OWB%201.1.9-SNAPSHOT/ws/deltaspike/modules/partial-bean/impl/target/deltaspike-partial-bean-module-impl-0.6-SNAPSHOT.jar>:<https://builds.apache.org/job/Deltaspike%20OWB%201.1.9-SNAPSHOT/ws/deltaspike/modules/jpa/impl/target/deltaspike-jpa-module-impl-0.6-SNAPSHOT.jar>:<https://builds.apache.org/job/Deltaspike%20OWB%201.1.9-SNAPSHOT/ws/deltaspike/modules/jpa/api/target/deltaspike-jpa-module-api-0.6-SNAPSHOT.jar>:/home/jenkins/jenkins-slave/maven-repositories/1/org/jboss/shrinkwrap/resolver/shrinkwrap-resolver-impl-maven/2.0.0/shrinkwrap-resolver-impl-maven-2.0.0.jar:/home/jenkins/jenkins-slave/maven-repositories/1/org/jboss/shrinkwrap/resolver/shrinkwrap-resolver-api-maven/2.0.0/shrinkwrap-resolver-api-maven-2.0.0.jar:/home/jenkins/jenkins-slave/maven-repositories/1/org/jboss/shrinkwrap/resolver/shrinkwrap-resolver-api/2.0.0/shrinkwrap-resolver-api-2.0.0.jar:/home/jenkins/jenkins-slave/maven-repositories/1/org/jboss/shrinkwrap/resolver/shrinkwrap-resolver-spi-maven/2.0.0/shrinkwrap-resolver-spi-maven-2.0.0.jar:/home/jenkins/jenkins-slave/maven-repositories/1/org/jboss/shrinkwrap/resolver/shrinkwrap-resolver-spi/2.0.0/shrinkwrap-resolver-spi-2.0.0.jar:/home/jenkins/jenkins-slave/maven-repositories/1/org/sonatype/aether/aether-api/1.13.1/aether-api-1.13.1.jar:/home/jenkins/jenkins-slave/maven-repositories/1/org/sonatype/aether/aether-impl/1.13.1/aether-impl-1.13.1.jar:/home/jenkins/jenkins-slave/maven-repositories/1/org/sonatype/aether/aether-spi/1.13.1/aether-spi-1.13.1.jar:/home/jenkins/jenkins-slave/maven-repositories/1/org/sonatype/aether/aether-util/1.13.1/aether-util-1.13.1.jar:/home/jenkins/jenkins-slave/maven-repositories/1/org/sonatype/aether/aether-connector-wagon/1.13.1/aether-connector-wagon-1.13.1.jar:/home/jenkins/jenkins-slave/maven-repositories/1/org/apache/maven/maven-aether-provider/3.0.5/maven-aether-provider-3.0.5.jar:/home/jenkins/jenkins-slave/maven-repositories/1/org/apache/maven/maven-model/3.0.5/maven-model-3.0.5.jar:/home/jenkins/jenkins-slave/maven-repositories/1/org/apache/maven/maven-model-builder/3.0.5/maven-model-builder-3.0.5.jar:/home/jenkins/jenkins-slave/maven-repositories/1/org/apache/maven/maven-repository-metadata/3.0.5/maven-repository-metadata-3.0.5.jar:/home/jenkins/jenkins-slave/maven-repositories/1/org/apache/maven/maven-settings/3.0.5/maven-settings-3.0.5.jar:/home/jenkins/jenkins-slave/maven-repositories/1/org/apache/maven/maven-settings-builder/3.0.5/maven-settings-builder-3.0.5.jar:/home/jenkins/jenkins-slave/maven-repositories/1/org/codehaus/plexus/plexus-utils/2.0.6/plexus-utils-2.0.6.jar:/home/jenkins/jenkins-slave/maven-repositories/1/org/sonatype/plexus/plexus-sec-dispatcher/1.4/plexus-sec-dispatcher-1.4.jar:/home/jenkins/jenkins-slave/maven-repositories/1/org/apache/maven/wagon/wagon-provider-api/2.4/wagon-provider-api-2.4.jar:/home/jenkins/jenkins-slave/maven-repositories/1/org/apache/maven/wagon/wagon-file/2.4/wagon-file-2.4.jar:/home/jenkins/jenkins-slave/maven-repositories/1/org/apache/maven/wagon/wagon-http-lightweight/2.4/wagon-http-lightweight-2.4.jar:/home/jenkins/jenkins-slave/maven-repositories/1/org/apache/maven/wagon/wagon-http-shared4/2.4/wagon-http-shared4-2.4.jar:/home/jenkins/jenkins-slave/maven-repositories/1/org/jsoup/jsoup/1.7.1/jsoup-1.7.1.jar:/home/jenkins/jenkins-slave/maven-repositories/1/org/apache/httpcomponents/httpcore/4.2.3/httpcore-4.2.3.jar:/home/jenkins/jenkins-slave/maven-repositories/1/commons-io/commons-io/2.0.1/commons-io-2.0.1.jar:/home/jenkins/jenkins-slave/maven-repositories/1/org/jboss/shrinkwrap/descriptors/shrinkwrap-descriptors-impl-javaee/2.0.0-alpha-3/shrinkwrap-descriptors-impl-javaee-2.0.0-alpha-3.jar:/home/jenkins/jenkins-slave/maven-repositories/1/org/jboss/shrinkwrap/descriptors/shrinkwrap-descriptors-api-javaee/2.0.0-alpha-3/shrinkwrap-descriptors-api-javaee-2.0.0-alpha-3.jar:/home/jenkins/jenkins-slave/maven-repositories/1/org/jboss/shrinkwrap/descriptors/shrinkwrap-descriptors-api-base/2.0.0-alpha-3/shrinkwrap-descriptors-api-base-2.0.0-alpha-3.jar:/home/jenkins/jenkins-slave/maven-repositories/1/org/jboss/shrinkwrap/descriptors/shrinkwrap-descriptors-impl-base/2.0.0-alpha-3/shrinkwrap-descriptors-impl-base-2.0.0-alpha-3.jar:/home/jenkins/jenkins-slave/maven-repositories/1/org/jboss/shrinkwrap/descriptors/shrinkwrap-descriptors-spi/2.0.0-alpha-3/shrinkwrap-descriptors-spi-2.0.0-alpha-3.jar:<https://builds.apache.org/job/Deltaspike%20OWB%201.1.9-SNAPSHOT/ws/deltaspike/test-utils/target/test-utils-0.6-SNAPSHOT.jar>:/home/jenkins/jenkins-slave/maven-repositories/1/org/jboss/shrinkwrap/shrinkwrap-api/1.0.1/shrinkwrap-api-1.0.1.jar:/home/jenkins/jenkins-slave/maven-repositories/1/org/apache/geronimo/specs/geronimo-atinject_1.0_spec/1.0/geronimo-atinject_1.0_spec-1.0.jar:/home/jenkins/jenkins-slave/maven-repositories/1/org/apache/geronimo/specs/geronimo-jcdi_1.0_spec/1.0/geronimo-jcdi_1.0_spec-1.0.jar:/home/jenkins/jenkins-slave/maven-repositories/1/org/apache/geronimo/specs/geronimo-interceptor_1.1_spec/1.0/geronimo-interceptor_1.1_spec-1.0.jar:/home/jenkins/jenkins-slave/maven-repositories/1/org/apache/openwebbeans/openwebbeans-impl/1.1.9-SNAPSHOT/openwebbeans-impl-1.1.9-SNAPSHOT.jar:/home/jenkins/jenkins-slave/maven-repositories/1/javassist/javassist/3.12.0.GA/javassist-3.12.0.GA.jar:/home/jenkins/jenkins-slave/maven-repositories/1/net/sf/scannotation/scannotation/1.0.2/scannotation-1.0.2.jar:/home/jenkins/jenkins-slave/maven-repositories/1/org/apache/openwebbeans/openwebbeans-spi/1.1.9-SNAPSHOT/openwebbeans-spi-1.1.9-SNAPSHOT.jar:/home/jenkins/jenkins-slave/maven-repositories/1/org/apache/openwebbeans/openwebbeans-resource/1.1.9-SNAPSHOT/openwebbeans-resource-1.1.9-SNAPSHOT.jar:/home/jenkins/jenkins-slave/maven-repositories/1/org/apache/openwebbeans/arquillian/owb-arquillian-standalone/1.2.0/owb-arquillian-standalone-1.2.0.jar:/home/jenkins/jenkins-slave/maven-repositories/1/org/jboss/arquillian/container/arquillian-container-spi/1.0.2.Final/arquillian-container-spi-1.0.2.Final.jar:/home/jenkins/jenkins-slave/maven-repositories/1/org/jboss/arquillian/core/arquillian-core-spi/1.0.2.Final/arquillian-core-spi-1.0.2.Final.jar:/home/jenkins/jenkins-slave/maven-repositories/1/org/jboss/arquillian/config/arquillian-config-api/1.0.2.Final/arquillian-config-api-1.0.2.Final.jar:/home/jenkins/jenkins-slave/maven-repositories/1/org/jboss/arquillian/config/arquillian-config-impl-base/1.0.2.Final/arquillian-config-impl-base-1.0.2.Final.jar:/home/jenkins/jenkins-slave/maven-repositories/1/org/jboss/arquillian/test/arquillian-test-spi/1.0.2.Final/arquillian-test-spi-1.0.2.Final.jar:/home/jenkins/jenkins-slave/maven-repositories/1/org/jboss/arquillian/testenricher/arquillian-testenricher-cdi/1.0.2.Final/arquillian-testenricher-cdi-1.0.2.Final.jar:/home/jenkins/jenkins-slave/maven-repositories/1/org/apache/bval/bval-jsr303/0.5/bval-jsr303-0.5.jar:/home/jenkins/jenkins-slave/maven-repositories/1/org/apache/bval/bval-core/0.5/bval-core-0.5.jar:/home/jenkins/jenkins-slave/maven-repositories/1/commons-beanutils/commons-beanutils-core/1.8.3/commons-beanutils-core-1.8.3.jar:/home/jenkins/jenkins-slave/maven-repositories/1/org/apache/commons/commons-lang3/3.1/commons-lang3-3.1.jar:/home/jenkins/jenkins-slave/maven-repositories/1/junit/junit/4.10/junit-4.10.jar:/home/jenkins/jenkins-slave/maven-repositories/1/org/hamcrest/hamcrest-core/1.1/hamcrest-core-1.1.jar:/home/jenkins/jenkins-slave/maven-repositories/1/org/jboss/arquillian/junit/arquillian-junit-container/1.0.2.Final/arquillian-junit-container-1.0.2.Final.jar:/home/jenkins/jenkins-slave/maven-repositories/1/org/jboss/arquillian/junit/arquillian-junit-core/1.0.2.Final/arquillian-junit-core-1.0.2.Final.jar:/home/jenkins/jenkins-slave/maven-repositories/1/org/jboss/arquillian/test/arquillian-test-api/1.0.2.Final/arquillian-test-api-1.0.2.Final.jar:/home/jenkins/jenkins-slave/maven-repositories/1/org/jboss/arquillian/core/arquillian-core-api/1.0.2.Final/arquillian-core-api-1.0.2.Final.jar:/home/jenkins/jenkins-slave/maven-repositories/1/org/jboss/arquillian/container/arquillian-container-test-api/1.0.2.Final/arquillian-container-test-api-1.0.2.Final.jar:/home/jenkins/jenkins-slave/maven-repositories/1/org/jboss/arquillian/container/arquillian-container-test-spi/1.0.2.Final/arquillian-container-test-spi-1.0.2.Final.jar:/home/jenkins/jenkins-slave/maven-repositories/1/org/jboss/arquillian/core/arquillian-core-impl-base/1.0.2.Final/arquillian-core-impl-base-1.0.2.Final.jar:/home/jenkins/jenkins-slave/maven-repositories/1/org/jboss/arquillian/test/arquillian-test-impl-base/1.0.2.Final/arquillian-test-impl-base-1.0.2.Final.jar:/home/jenkins/jenkins-slave/maven-repositories/1/org/jboss/arquillian/container/arquillian-container-impl-base/1.0.2.Final/arquillian-container-impl-base-1.0.2.Final.jar:/home/jenkins/jenkins-slave/maven-repositories/1/org/jboss/arquillian/container/arquillian-container-test-impl-base/1.0.2.Final/arquillian-container-test-impl-base-1.0.2.Final.jar:/home/jenkins/jenkins-slave/maven-repositories/1/org/jboss/shrinkwrap/shrinkwrap-impl-base/1.0.1/shrinkwrap-impl-base-1.0.1.jar:/home/jenkins/jenkins-slave/maven-repositories/1/org/jboss/shrinkwrap/shrinkwrap-spi/1.0.1/shrinkwrap-spi-1.0.1.jar:
[INFO] javac option: -proc:only
[INFO] javac option: -processor
[INFO] javac option: org.hibernate.jpamodelgen.JPAMetaModelEntityProcessor
[INFO] javac option: -d
[INFO] javac option: <https://builds.apache.org/job/Deltaspike%20OWB%201.1.9-SNAPSHOT/ws/deltaspike/modules/data/impl/target/test-classes>
[INFO] javac option: -s
[INFO] javac option: <https://builds.apache.org/job/Deltaspike%20OWB%201.1.9-SNAPSHOT/ws/deltaspike/modules/data/impl/target/generated-sources/apt-test>
[INFO] diagnostic <https://builds.apache.org/job/Deltaspike%20OWB%201.1.9-SNAPSHOT/ws/deltaspike/modules/data/impl/src/test/java/org/apache/deltaspike/data/impl/handler/EntityRepositoryHandlerTest.java>:36: cannot find symbol
symbol  : class Simple_
location: package org.apache.deltaspike.data.test.domain
[INFO] diagnostic <https://builds.apache.org/job/Deltaspike%20OWB%201.1.9-SNAPSHOT/ws/deltaspike/modules/data/impl/src/test/java/org/apache/deltaspike/data/test/service/SimpleCriteriaRepository.java>:27: cannot find symbol
symbol  : class Simple_
location: package org.apache.deltaspike.data.test.domain
[INFO] diagnostic <https://builds.apache.org/job/Deltaspike%20OWB%201.1.9-SNAPSHOT/ws/deltaspike/modules/data/impl/src/test/java/org/apache/deltaspike/data/test/service/ParentRepository.java>:29: cannot find symbol
symbol  : class OneToMany_
location: package org.apache.deltaspike.data.test.domain
[INFO] diagnostic <https://builds.apache.org/job/Deltaspike%20OWB%201.1.9-SNAPSHOT/ws/deltaspike/modules/data/impl/src/test/java/org/apache/deltaspike/data/test/service/ParentRepository.java>:31: cannot find symbol
symbol  : class OneToOne_
location: package org.apache.deltaspike.data.test.domain
[INFO] diagnostic <https://builds.apache.org/job/Deltaspike%20OWB%201.1.9-SNAPSHOT/ws/deltaspike/modules/data/impl/src/test/java/org/apache/deltaspike/data/test/service/ParentRepository.java>:33: cannot find symbol
symbol  : class Parent_
location: package org.apache.deltaspike.data.test.domain
[INFO] diagnostic <https://builds.apache.org/job/Deltaspike%20OWB%201.1.9-SNAPSHOT/ws/deltaspike/modules/data/impl/src/test/java/org/apache/deltaspike/data/impl/mapping/MappedRepositoryTest.java>:34: cannot find symbol
symbol  : class Simple_
location: package org.apache.deltaspike.data.test.domain
[INFO] diagnostic <https://builds.apache.org/job/Deltaspike%20OWB%201.1.9-SNAPSHOT/ws/deltaspike/modules/data/impl/src/test/java/org/apache/deltaspike/data/impl/QueryResultTest.java>:42: cannot find symbol
symbol  : class Simple_
location: package org.apache.deltaspike.data.test.domain
[INFO] diagnostic Note: Hibernate JPA 2 Static-Metamodel Generator 1.2.0.Final
[INFO] 
[INFO] --- maven-resources-plugin:2.5:testResources (default-testResources) @ deltaspike-data-module-impl ---
[debug] execute contextualize
[INFO] Using 'UTF-8' encoding to copy filtered resources.
[INFO] Copying 5 resources
[INFO] Copying 4 resources
[INFO] Copying 4 resources
[INFO] 
[INFO] --- maven-compiler-plugin:2.5:testCompile (default-testCompile) @ deltaspike-data-module-impl ---
[INFO] Compiling 87 source files to <https://builds.apache.org/job/Deltaspike%20OWB%201.1.9-SNAPSHOT/ws/deltaspike/modules/data/impl/target/test-classes>
[INFO] 
[INFO] --- maven-surefire-plugin:2.11:test (default-test) @ deltaspike-data-module-impl ---
[INFO] Surefire report directory: <https://builds.apache.org/job/Deltaspike%20OWB%201.1.9-SNAPSHOT/ws/deltaspike/modules/data/impl/target/surefire-reports>
[INFO] Using configured provider org.apache.maven.surefire.junitcore.JUnitCoreProvider

-------------------------------------------------------
 T E S T S
-------------------------------------------------------

Results :

Tests run: 0, Failures: 0, Errors: 0, Skipped: 0

[JENKINS] Recording test results
[INFO] ------------------------------------------------------------------------
[INFO] Reactor Summary:
[INFO] 
[INFO] Apache DeltaSpike ................................. SUCCESS [16.541s]
[INFO] Apache DeltaSpike CheckStyle-rules ................ SUCCESS [4.506s]
[INFO] Apache DeltaSpike Parent .......................... SUCCESS [6.319s]
[INFO] Apache DeltaSpike Test-Utils ...................... SUCCESS [6.164s]
[INFO] Apache DeltaSpike Code Parent ..................... SUCCESS [7.020s]
[INFO] Apache DeltaSpike Core ............................ SUCCESS [2.237s]
[INFO] Apache DeltaSpike Core-API ........................ SUCCESS [12.498s]
[INFO] Apache DeltaSpike Core-Implementation ............. SUCCESS [20.583s]
[INFO] Apache DeltaSpike ContainerControl parent ......... SUCCESS [2.389s]
[INFO] Apache DeltaSpike CDI ContainerControl API ........ SUCCESS [3.657s]
[INFO] Apache DeltaSpike CDI ContainerControl TCK ........ SUCCESS [4.655s]
[INFO] Apache DeltaSpike CDI OWB-ContainerControl ........ SUCCESS [5.990s]
[INFO] Apache DeltaSpike CDI Weld-ContainerControl ....... SUCCESS [6.393s]
[INFO] Apache DeltaSpike CDI OpenEJB-ContainerControl .... SUCCESS [11.435s]
[INFO] Apache DeltaSpike Modules ......................... SUCCESS [2.672s]
[INFO] Apache DeltaSpike Security-Module ................. SUCCESS [3.633s]
[INFO] Apache DeltaSpike Security-Module API ............. SUCCESS [3.904s]
[INFO] Apache DeltaSpike Security-Module Impl ............ SUCCESS [7.121s]
[INFO] Apache DeltaSpike JPA-Module ...................... SUCCESS [2.534s]
[INFO] Apache DeltaSpike JPA-Module API .................. SUCCESS [3.890s]
[INFO] Apache DeltaSpike JPA-Module Impl ................. SUCCESS [15.894s]
[INFO] Apache DeltaSpike Servlet-Module .................. SUCCESS [2.389s]
[INFO] Apache DeltaSpike Servlet-Module API .............. SUCCESS [4.014s]
[INFO] Apache DeltaSpike Servlet-Module Impl ............. SUCCESS [5.064s]
[INFO] Apache DeltaSpike JSF-Module ...................... SUCCESS [2.635s]
[INFO] Apache DeltaSpike JSF-Module API .................. SUCCESS [5.316s]
[INFO] Apache DeltaSpike JSF-Module Impl ................. SUCCESS [17.358s]
[INFO] Apache DeltaSpike Partial-Bean-Module ............. SUCCESS [2.008s]
[INFO] Apache DeltaSpike Partial-Bean-Module API ......... SUCCESS [4.010s]
[INFO] Apache DeltaSpike Partial-Bean-Module Impl ........ SUCCESS [6.544s]
[INFO] Apache DeltaSpike BeanValidation-Module ........... SUCCESS [2.749s]
[INFO] Apache DeltaSpike BeanValidation-Module API ....... SUCCESS [4.336s]
[INFO] Apache DeltaSpike BeanValidation-Module Impl ...... SUCCESS [6.201s]
[INFO] Apache DeltaSpike Data-Module ..................... SUCCESS [2.207s]
[INFO] Apache DeltaSpike Data-Module API ................. SUCCESS [3.668s]
[INFO] Apache DeltaSpike Data-Module Impl ................ FAILURE [7.777s]
[INFO] Apache DeltaSpike Scheduler-Module ................ SKIPPED
[INFO] Apache DeltaSpike Scheduler-Module API ............ SKIPPED
[INFO] Apache DeltaSpike Scheduler-Module Impl ........... SKIPPED
[INFO] Apache DeltaSpike Test-Control-Module ............. SKIPPED
[INFO] Apache DeltaSpike Test-Control-Module API ......... SKIPPED
[INFO] Apache DeltaSpike Test-Control-Module Impl ........ SKIPPED
[INFO] Apache DeltaSpike Examples ........................ SKIPPED
[INFO] Apache DeltaSpike Java-SE Examples ................ SKIPPED
[INFO] Apache DeltaSpike JSF Examples .................... SKIPPED
[INFO] Apache DeltaSpike JSF Playground .................. SKIPPED
[INFO] ------------------------------------------------------------------------
[INFO] BUILD FAILURE
[INFO] ------------------------------------------------------------------------
[INFO] Total time: 4:44.166s
[INFO] Finished at: Fri Feb 28 19:40:06 UTC 2014
[INFO] Final Memory: 63M/128M
[INFO] ------------------------------------------------------------------------
Waiting for Jenkins to finish collecting data[ERROR] Failed to execute goal org.apache.maven.plugins:maven-surefire-plugin:2.11:test (default-test) on project deltaspike-data-module-impl: Error creating properties files for forking; nested exception is java.io.IOException: No such file or directory -> [Help 1]
[ERROR] 
[ERROR] To see the full stack trace of the errors, re-run Maven with the -e switch.
[ERROR] Re-run Maven using the -X switch to enable full debug logging.
[ERROR] 
[ERROR] For more information about the errors and possible solutions, please read the following articles:
[ERROR] [Help 1] http://cwiki.apache.org/confluence/display/MAVEN/MojoExecutionException
[ERROR] 
[ERROR] After correcting the problems, you can resume the build with the command
[ERROR]   mvn <goals> -rf :deltaspike-data-module-impl

[JENKINS] Archiving <https://builds.apache.org/job/Deltaspike%20OWB%201.1.9-SNAPSHOT/ws/deltaspike/modules/partial-bean/api/pom.xml> to org.apache.deltaspike.modules/deltaspike-partial-bean-module-api/0.6-SNAPSHOT/deltaspike-partial-bean-module-api-0.6-SNAPSHOT.pom
[JENKINS] Archiving <https://builds.apache.org/job/Deltaspike%20OWB%201.1.9-SNAPSHOT/ws/deltaspike/modules/partial-bean/api/target/deltaspike-partial-bean-module-api-0.6-SNAPSHOT.jar> to org.apache.deltaspike.modules/deltaspike-partial-bean-module-api/0.6-SNAPSHOT/deltaspike-partial-bean-module-api-0.6-SNAPSHOT.jar
[JENKINS] Archiving <https://builds.apache.org/job/Deltaspike%20OWB%201.1.9-SNAPSHOT/ws/deltaspike/modules/partial-bean/api/target/deltaspike-partial-bean-module-api-0.6-SNAPSHOT-tests.jar> to org.apache.deltaspike.modules/deltaspike-partial-bean-module-api/0.6-SNAPSHOT/deltaspike-partial-bean-module-api-0.6-SNAPSHOT-tests.jar
[JENKINS] Archiving <https://builds.apache.org/job/Deltaspike%20OWB%201.1.9-SNAPSHOT/ws/deltaspike/modules/partial-bean/api/target/deltaspike-partial-bean-module-api-0.6-SNAPSHOT-sources.jar> to org.apache.deltaspike.modules/deltaspike-partial-bean-module-api/0.6-SNAPSHOT/deltaspike-partial-bean-module-api-0.6-SNAPSHOT-sources.jar
[JENKINS] Archiving <https://builds.apache.org/job/Deltaspike%20OWB%201.1.9-SNAPSHOT/ws/deltaspike/modules/scheduler/impl/pom.xml> to org.apache.deltaspike.modules/deltaspike-scheduler-module-impl/0.6-SNAPSHOT/deltaspike-scheduler-module-impl-0.6-SNAPSHOT.pom
[JENKINS] Archiving <https://builds.apache.org/job/Deltaspike%20OWB%201.1.9-SNAPSHOT/ws/deltaspike/parent/pom.xml> to org.apache.deltaspike/parent/0.6-SNAPSHOT/parent-0.6-SNAPSHOT.pom
[JENKINS] Archiving <https://builds.apache.org/job/Deltaspike%20OWB%201.1.9-SNAPSHOT/ws/deltaspike/examples/jse-examples/pom.xml> to org.apache.deltaspike.examples/deltaspike-jse-example/0.6-SNAPSHOT/deltaspike-jse-example-0.6-SNAPSHOT.pom
[JENKINS] Archiving <https://builds.apache.org/job/Deltaspike%20OWB%201.1.9-SNAPSHOT/ws/deltaspike/modules/bean-validation/api/pom.xml> to org.apache.deltaspike.modules/deltaspike-bean-validation-module-api/0.6-SNAPSHOT/deltaspike-bean-validation-module-api-0.6-SNAPSHOT.pom
[JENKINS] Archiving <https://builds.apache.org/job/Deltaspike%20OWB%201.1.9-SNAPSHOT/ws/deltaspike/modules/bean-validation/api/target/deltaspike-bean-validation-module-api-0.6-SNAPSHOT.jar> to org.apache.deltaspike.modules/deltaspike-bean-validation-module-api/0.6-SNAPSHOT/deltaspike-bean-validation-module-api-0.6-SNAPSHOT.jar
[JENKINS] Archiving <https://builds.apache.org/job/Deltaspike%20OWB%201.1.9-SNAPSHOT/ws/deltaspike/modules/bean-validation/api/target/deltaspike-bean-validation-module-api-0.6-SNAPSHOT-tests.jar> to org.apache.deltaspike.modules/deltaspike-bean-validation-module-api/0.6-SNAPSHOT/deltaspike-bean-validation-module-api-0.6-SNAPSHOT-tests.jar
[JENKINS] Archiving <https://builds.apache.org/job/Deltaspike%20OWB%201.1.9-SNAPSHOT/ws/deltaspike/modules/bean-validation/api/target/deltaspike-bean-validation-module-api-0.6-SNAPSHOT-sources.jar> to org.apache.deltaspike.modules/deltaspike-bean-validation-module-api/0.6-SNAPSHOT/deltaspike-bean-validation-module-api-0.6-SNAPSHOT-sources.jar
[JENKINS] Archiving <https://builds.apache.org/job/Deltaspike%20OWB%201.1.9-SNAPSHOT/ws/deltaspike/core/pom.xml> to org.apache.deltaspike.core/core-project/0.6-SNAPSHOT/core-project-0.6-SNAPSHOT.pom
[JENKINS] Archiving <https://builds.apache.org/job/Deltaspike%20OWB%201.1.9-SNAPSHOT/ws/deltaspike/core/target/core-project-0.6-SNAPSHOT-tests.jar> to org.apache.deltaspike.core/core-project/0.6-SNAPSHOT/core-project-0.6-SNAPSHOT-tests.jar
[JENKINS] Archiving <https://builds.apache.org/job/Deltaspike%20OWB%201.1.9-SNAPSHOT/ws/deltaspike/test-utils/pom.xml> to org.apache.deltaspike.test/test-utils/0.6-SNAPSHOT/test-utils-0.6-SNAPSHOT.pom
[JENKINS] Archiving <https://builds.apache.org/job/Deltaspike%20OWB%201.1.9-SNAPSHOT/ws/deltaspike/test-utils/target/test-utils-0.6-SNAPSHOT.jar> to org.apache.deltaspike.test/test-utils/0.6-SNAPSHOT/test-utils-0.6-SNAPSHOT.jar
[JENKINS] Archiving <https://builds.apache.org/job/Deltaspike%20OWB%201.1.9-SNAPSHOT/ws/deltaspike/test-utils/target/test-utils-0.6-SNAPSHOT-sources.jar> to org.apache.deltaspike.test/test-utils/0.6-SNAPSHOT/test-utils-0.6-SNAPSHOT-sources.jar
[JENKINS] Archiving <https://builds.apache.org/job/Deltaspike%20OWB%201.1.9-SNAPSHOT/ws/deltaspike/modules/data/impl/pom.xml> to org.apache.deltaspike.modules/deltaspike-data-module-impl/0.6-SNAPSHOT/deltaspike-data-module-impl-0.6-SNAPSHOT.pom
[JENKINS] Archiving <https://builds.apache.org/job/Deltaspike%20OWB%201.1.9-SNAPSHOT/ws/deltaspike/core/api/pom.xml> to org.apache.deltaspike.core/deltaspike-core-api/0.6-SNAPSHOT/deltaspike-core-api-0.6-SNAPSHOT.pom
[JENKINS] Archiving <https://builds.apache.org/job/Deltaspike%20OWB%201.1.9-SNAPSHOT/ws/deltaspike/core/api/target/deltaspike-core-api-0.6-SNAPSHOT.jar> to org.apache.deltaspike.core/deltaspike-core-api/0.6-SNAPSHOT/deltaspike-core-api-0.6-SNAPSHOT.jar
[JENKINS] Archiving <https://builds.apache.org/job/Deltaspike%20OWB%201.1.9-SNAPSHOT/ws/deltaspike/core/api/target/deltaspike-core-api-0.6-SNAPSHOT-tests.jar> to org.apache.deltaspike.core/deltaspike-core-api/0.6-SNAPSHOT/deltaspike-core-api-0.6-SNAPSHOT-tests.jar
[JENKINS] Archiving <https://builds.apache.org/job/Deltaspike%20OWB%201.1.9-SNAPSHOT/ws/deltaspike/core/api/target/deltaspike-core-api-0.6-SNAPSHOT-sources.jar> to org.apache.deltaspike.core/deltaspike-core-api/0.6-SNAPSHOT/deltaspike-core-api-0.6-SNAPSHOT-sources.jar
[JENKINS] Archiving <https://builds.apache.org/job/Deltaspike%20OWB%201.1.9-SNAPSHOT/ws/deltaspike/modules/scheduler/pom.xml> to org.apache.deltaspike.modules/scheduler-module-project/0.6-SNAPSHOT/scheduler-module-project-0.6-SNAPSHOT.pom
[JENKINS] Archiving <https://builds.apache.org/job/Deltaspike%20OWB%201.1.9-SNAPSHOT/ws/deltaspike/modules/data/api/pom.xml> to org.apache.deltaspike.modules/deltaspike-data-module-api/0.6-SNAPSHOT/deltaspike-data-module-api-0.6-SNAPSHOT.pom
[JENKINS] Archiving <https://builds.apache.org/job/Deltaspike%20OWB%201.1.9-SNAPSHOT/ws/deltaspike/modules/data/api/target/deltaspike-data-module-api-0.6-SNAPSHOT.jar> to org.apache.deltaspike.modules/deltaspike-data-module-api/0.6-SNAPSHOT/deltaspike-data-module-api-0.6-SNAPSHOT.jar
[JENKINS] Archiving <https://builds.apache.org/job/Deltaspike%20OWB%201.1.9-SNAPSHOT/ws/deltaspike/modules/data/api/target/deltaspike-data-module-api-0.6-SNAPSHOT-tests.jar> to org.apache.deltaspike.modules/deltaspike-data-module-api/0.6-SNAPSHOT/deltaspike-data-module-api-0.6-SNAPSHOT-tests.jar
[JENKINS] Archiving <https://builds.apache.org/job/Deltaspike%20OWB%201.1.9-SNAPSHOT/ws/deltaspike/modules/data/api/target/deltaspike-data-module-api-0.6-SNAPSHOT-sources.jar> to org.apache.deltaspike.modules/deltaspike-data-module-api/0.6-SNAPSHOT/deltaspike-data-module-api-0.6-SNAPSHOT-sources.jar
[JENKINS] Archiving <https://builds.apache.org/job/Deltaspike%20OWB%201.1.9-SNAPSHOT/ws/deltaspike/modules/security/impl/pom.xml> to org.apache.deltaspike.modules/deltaspike-security-module-impl/0.6-SNAPSHOT/deltaspike-security-module-impl-0.6-SNAPSHOT.pom
[JENKINS] Archiving <https://builds.apache.org/job/Deltaspike%20OWB%201.1.9-SNAPSHOT/ws/deltaspike/modules/security/impl/target/deltaspike-security-module-impl-0.6-SNAPSHOT.jar> to org.apache.deltaspike.modules/deltaspike-security-module-impl/0.6-SNAPSHOT/deltaspike-security-module-impl-0.6-SNAPSHOT.jar
[JENKINS] Archiving <https://builds.apache.org/job/Deltaspike%20OWB%201.1.9-SNAPSHOT/ws/deltaspike/modules/security/impl/target/deltaspike-security-module-impl-0.6-SNAPSHOT-tests.jar> to org.apache.deltaspike.modules/deltaspike-security-module-impl/0.6-SNAPSHOT/deltaspike-security-module-impl-0.6-SNAPSHOT-tests.jar
[JENKINS] Archiving <https://builds.apache.org/job/Deltaspike%20OWB%201.1.9-SNAPSHOT/ws/deltaspike/modules/security/impl/target/deltaspike-security-module-impl-0.6-SNAPSHOT-sources.jar> to org.apache.deltaspike.modules/deltaspike-security-module-impl/0.6-SNAPSHOT/deltaspike-security-module-impl-0.6-SNAPSHOT-sources.jar
[JENKINS] Archiving <https://builds.apache.org/job/Deltaspike%20OWB%201.1.9-SNAPSHOT/ws/deltaspike/core/impl/pom.xml> to org.apache.deltaspike.core/deltaspike-core-impl/0.6-SNAPSHOT/deltaspike-core-impl-0.6-SNAPSHOT.pom
[JENKINS] Archiving <https://builds.apache.org/job/Deltaspike%20OWB%201.1.9-SNAPSHOT/ws/deltaspike/core/impl/target/deltaspike-core-impl-0.6-SNAPSHOT.jar> to org.apache.deltaspike.core/deltaspike-core-impl/0.6-SNAPSHOT/deltaspike-core-impl-0.6-SNAPSHOT.jar
[JENKINS] Archiving <https://builds.apache.org/job/Deltaspike%20OWB%201.1.9-SNAPSHOT/ws/deltaspike/core/impl/target/deltaspike-core-impl-0.6-SNAPSHOT-tests.jar> to org.apache.deltaspike.core/deltaspike-core-impl/0.6-SNAPSHOT/deltaspike-core-impl-0.6-SNAPSHOT-tests.jar
[JENKINS] Archiving <https://builds.apache.org/job/Deltaspike%20OWB%201.1.9-SNAPSHOT/ws/deltaspike/core/impl/target/deltaspike-core-impl-0.6-SNAPSHOT-sources.jar> to org.apache.deltaspike.core/deltaspike-core-impl/0.6-SNAPSHOT/deltaspike-core-impl-0.6-SNAPSHOT-sources.jar
[JENKINS] Archiving <https://builds.apache.org/job/Deltaspike%20OWB%201.1.9-SNAPSHOT/ws/deltaspike/modules/test-control/pom.xml> to org.apache.deltaspike.modules/test-control-module-project/0.6-SNAPSHOT/test-control-module-project-0.6-SNAPSHOT.pom
[JENKINS] Archiving <https://builds.apache.org/job/Deltaspike%20OWB%201.1.9-SNAPSHOT/ws/deltaspike/modules/pom.xml> to org.apache.deltaspike.modules/modules-project/0.6-SNAPSHOT/modules-project-0.6-SNAPSHOT.pom
[JENKINS] Archiving <https://builds.apache.org/job/Deltaspike%20OWB%201.1.9-SNAPSHOT/ws/deltaspike/modules/target/modules-project-0.6-SNAPSHOT-tests.jar> to org.apache.deltaspike.modules/modules-project/0.6-SNAPSHOT/modules-project-0.6-SNAPSHOT-tests.jar
[JENKINS] Archiving <https://builds.apache.org/job/Deltaspike%20OWB%201.1.9-SNAPSHOT/ws/deltaspike/examples/jsf-examples/pom.xml> to org.apache.deltaspike.examples/deltaspike-jsf-example/0.6-SNAPSHOT/deltaspike-jsf-example-0.6-SNAPSHOT.pom
[JENKINS] Archiving <https://builds.apache.org/job/Deltaspike%20OWB%201.1.9-SNAPSHOT/ws/deltaspike/cdictrl/api/pom.xml> to org.apache.deltaspike.cdictrl/deltaspike-cdictrl-api/0.6-SNAPSHOT/deltaspike-cdictrl-api-0.6-SNAPSHOT.pom
[JENKINS] Archiving <https://builds.apache.org/job/Deltaspike%20OWB%201.1.9-SNAPSHOT/ws/deltaspike/cdictrl/api/target/deltaspike-cdictrl-api-0.6-SNAPSHOT.jar> to org.apache.deltaspike.cdictrl/deltaspike-cdictrl-api/0.6-SNAPSHOT/deltaspike-cdictrl-api-0.6-SNAPSHOT.jar
[JENKINS] Archiving <https://builds.apache.org/job/Deltaspike%20OWB%201.1.9-SNAPSHOT/ws/deltaspike/cdictrl/api/target/deltaspike-cdictrl-api-0.6-SNAPSHOT-sources.jar> to org.apache.deltaspike.cdictrl/deltaspike-cdictrl-api/0.6-SNAPSHOT/deltaspike-cdictrl-api-0.6-SNAPSHOT-sources.jar
[JENKINS] Archiving <https://builds.apache.org/job/Deltaspike%20OWB%201.1.9-SNAPSHOT/ws/deltaspike/checkstyle-rules/pom.xml> to org.apache.deltaspike/checkstyle-rules/0.6-SNAPSHOT/checkstyle-rules-0.6-SNAPSHOT.pom
[JENKINS] Archiving <https://builds.apache.org/job/Deltaspike%20OWB%201.1.9-SNAPSHOT/ws/deltaspike/checkstyle-rules/target/checkstyle-rules-0.6-SNAPSHOT.jar> to org.apache.deltaspike/checkstyle-rules/0.6-SNAPSHOT/checkstyle-rules-0.6-SNAPSHOT.jar
[JENKINS] Archiving <https://builds.apache.org/job/Deltaspike%20OWB%201.1.9-SNAPSHOT/ws/deltaspike/parent/code/pom.xml> to org.apache.deltaspike/parent-code/0.6-SNAPSHOT/parent-code-0.6-SNAPSHOT.pom
[JENKINS] Archiving <https://builds.apache.org/job/Deltaspike%20OWB%201.1.9-SNAPSHOT/ws/deltaspike/parent/code/target/parent-code-0.6-SNAPSHOT-tests.jar> to org.apache.deltaspike/parent-code/0.6-SNAPSHOT/parent-code-0.6-SNAPSHOT-tests.jar
[JENKINS] Archiving <https://builds.apache.org/job/Deltaspike%20OWB%201.1.9-SNAPSHOT/ws/deltaspike/modules/partial-bean/pom.xml> to org.apache.deltaspike.modules/partial-bean-module-project/0.6-SNAPSHOT/partial-bean-module-project-0.6-SNAPSHOT.pom
[JENKINS] Archiving <https://builds.apache.org/job/Deltaspike%20OWB%201.1.9-SNAPSHOT/ws/deltaspike/modules/partial-bean/target/partial-bean-module-project-0.6-SNAPSHOT-tests.jar> to org.apache.deltaspike.modules/partial-bean-module-project/0.6-SNAPSHOT/partial-bean-module-project-0.6-SNAPSHOT-tests.jar
[JENKINS] Archiving <https://builds.apache.org/job/Deltaspike%20OWB%201.1.9-SNAPSHOT/ws/deltaspike/modules/jsf/impl/pom.xml> to org.apache.deltaspike.modules/deltaspike-jsf-module-impl/0.6-SNAPSHOT/deltaspike-jsf-module-impl-0.6-SNAPSHOT.pom
[JENKINS] Archiving <https://builds.apache.org/job/Deltaspike%20OWB%201.1.9-SNAPSHOT/ws/deltaspike/modules/jsf/impl/target/deltaspike-jsf-module-impl-0.6-SNAPSHOT.jar> to org.apache.deltaspike.modules/deltaspike-jsf-module-impl/0.6-SNAPSHOT/deltaspike-jsf-module-impl-0.6-SNAPSHOT.jar
[JENKINS] Archiving <https://builds.apache.org/job/Deltaspike%20OWB%201.1.9-SNAPSHOT/ws/deltaspike/modules/jsf/impl/target/deltaspike-jsf-module-impl-0.6-SNAPSHOT-tests.jar> to org.apache.deltaspike.modules/deltaspike-jsf-module-impl/0.6-SNAPSHOT/deltaspike-jsf-module-impl-0.6-SNAPSHOT-tests.jar
[JENKINS] Archiving <https://builds.apache.org/job/Deltaspike%20OWB%201.1.9-SNAPSHOT/ws/deltaspike/modules/jsf/impl/target/deltaspike-jsf-module-impl-0.6-SNAPSHOT-sources.jar> to org.apache.deltaspike.modules/deltaspike-jsf-module-impl/0.6-SNAPSHOT/deltaspike-jsf-module-impl-0.6-SNAPSHOT-sources.jar
[JENKINS] Archiving <https://builds.apache.org/job/Deltaspike%20OWB%201.1.9-SNAPSHOT/ws/deltaspike/examples/pom.xml> to org.apache.deltaspike.examples/examples-project/0.6-SNAPSHOT/examples-project-0.6-SNAPSHOT.pom
[JENKINS] Archiving <https://builds.apache.org/job/Deltaspike%20OWB%201.1.9-SNAPSHOT/ws/deltaspike/modules/jsf/pom.xml> to org.apache.deltaspike.modules/jsf-module-project/0.6-SNAPSHOT/jsf-module-project-0.6-SNAPSHOT.pom
[JENKINS] Archiving <https://builds.apache.org/job/Deltaspike%20OWB%201.1.9-SNAPSHOT/ws/deltaspike/modules/jsf/target/jsf-module-project-0.6-SNAPSHOT-tests.jar> to org.apache.deltaspike.modules/jsf-module-project/0.6-SNAPSHOT/jsf-module-project-0.6-SNAPSHOT-tests.jar
[JENKINS] Archiving <https://builds.apache.org/job/Deltaspike%20OWB%201.1.9-SNAPSHOT/ws/deltaspike/cdictrl/impl-openejb/pom.xml> to org.apache.deltaspike.cdictrl/deltaspike-cdictrl-openejb/0.6-SNAPSHOT/deltaspike-cdictrl-openejb-0.6-SNAPSHOT.pom
[JENKINS] Archiving <https://builds.apache.org/job/Deltaspike%20OWB%201.1.9-SNAPSHOT/ws/deltaspike/cdictrl/impl-openejb/target/deltaspike-cdictrl-openejb-0.6-SNAPSHOT.jar> to org.apache.deltaspike.cdictrl/deltaspike-cdictrl-openejb/0.6-SNAPSHOT/deltaspike-cdictrl-openejb-0.6-SNAPSHOT.jar
[JENKINS] Archiving <https://builds.apache.org/job/Deltaspike%20OWB%201.1.9-SNAPSHOT/ws/deltaspike/cdictrl/impl-openejb/target/deltaspike-cdictrl-openejb-0.6-SNAPSHOT-sources.jar> to org.apache.deltaspike.cdictrl/deltaspike-cdictrl-openejb/0.6-SNAPSHOT/deltaspike-cdictrl-openejb-0.6-SNAPSHOT-sources.jar
[JENKINS] Archiving <https://builds.apache.org/job/Deltaspike%20OWB%201.1.9-SNAPSHOT/ws/deltaspike/cdictrl/tck/pom.xml> to org.apache.deltaspike.test/deltaspike-cdictrl-tck/0.6-SNAPSHOT/deltaspike-cdictrl-tck-0.6-SNAPSHOT.pom
[JENKINS] Archiving <https://builds.apache.org/job/Deltaspike%20OWB%201.1.9-SNAPSHOT/ws/deltaspike/cdictrl/tck/target/deltaspike-cdictrl-tck-0.6-SNAPSHOT.jar> to org.apache.deltaspike.test/deltaspike-cdictrl-tck/0.6-SNAPSHOT/deltaspike-cdictrl-tck-0.6-SNAPSHOT.jar
[JENKINS] Archiving <https://builds.apache.org/job/Deltaspike%20OWB%201.1.9-SNAPSHOT/ws/deltaspike/cdictrl/tck/target/deltaspike-cdictrl-tck-0.6-SNAPSHOT-sources.jar> to org.apache.deltaspike.test/deltaspike-cdictrl-tck/0.6-SNAPSHOT/deltaspike-cdictrl-tck-0.6-SNAPSHOT-sources.jar
[JENKINS] Archiving <https://builds.apache.org/job/Deltaspike%20OWB%201.1.9-SNAPSHOT/ws/deltaspike/modules/jsf/api/pom.xml> to org.apache.deltaspike.modules/deltaspike-jsf-module-api/0.6-SNAPSHOT/deltaspike-jsf-module-api-0.6-SNAPSHOT.pom
[JENKINS] Archiving <https://builds.apache.org/job/Deltaspike%20OWB%201.1.9-SNAPSHOT/ws/deltaspike/modules/jsf/api/target/deltaspike-jsf-module-api-0.6-SNAPSHOT.jar> to org.apache.deltaspike.modules/deltaspike-jsf-module-api/0.6-SNAPSHOT/deltaspike-jsf-module-api-0.6-SNAPSHOT.jar
[JENKINS] Archiving <https://builds.apache.org/job/Deltaspike%20OWB%201.1.9-SNAPSHOT/ws/deltaspike/modules/jsf/api/target/deltaspike-jsf-module-api-0.6-SNAPSHOT-tests.jar> to org.apache.deltaspike.modules/deltaspike-jsf-module-api/0.6-SNAPSHOT/deltaspike-jsf-module-api-0.6-SNAPSHOT-tests.jar
[JENKINS] Archiving <https://builds.apache.org/job/Deltaspike%20OWB%201.1.9-SNAPSHOT/ws/deltaspike/modules/jsf/api/target/deltaspike-jsf-module-api-0.6-SNAPSHOT-sources.jar> to org.apache.deltaspike.modules/deltaspike-jsf-module-api/0.6-SNAPSHOT/deltaspike-jsf-module-api-0.6-SNAPSHOT-sources.jar
[JENKINS] Archiving <https://builds.apache.org/job/Deltaspike%20OWB%201.1.9-SNAPSHOT/ws/deltaspike/examples/jsf-playground/pom.xml> to org.apache.deltaspike.examples/deltaspike-jsf-playground/0.6-SNAPSHOT/deltaspike-jsf-playground-0.6-SNAPSHOT.pom
[JENKINS] Archiving <https://builds.apache.org/job/Deltaspike%20OWB%201.1.9-SNAPSHOT/ws/deltaspike/modules/security/pom.xml> to org.apache.deltaspike.modules/security-module-project/0.6-SNAPSHOT/security-module-project-0.6-SNAPSHOT.pom
[JENKINS] Archiving <https://builds.apache.org/job/Deltaspike%20OWB%201.1.9-SNAPSHOT/ws/deltaspike/modules/security/target/security-module-project-0.6-SNAPSHOT-tests.jar> to org.apache.deltaspike.modules/security-module-project/0.6-SNAPSHOT/security-module-project-0.6-SNAPSHOT-tests.jar
[JENKINS] Archiving <https://builds.apache.org/job/Deltaspike%20OWB%201.1.9-SNAPSHOT/ws/deltaspike/modules/bean-validation/pom.xml> to org.apache.deltaspike.modules/bean-validation-module-project/0.6-SNAPSHOT/bean-validation-module-project-0.6-SNAPSHOT.pom
[JENKINS] Archiving <https://builds.apache.org/job/Deltaspike%20OWB%201.1.9-SNAPSHOT/ws/deltaspike/modules/bean-validation/target/bean-validation-module-project-0.6-SNAPSHOT-tests.jar> to org.apache.deltaspike.modules/bean-validation-module-project/0.6-SNAPSHOT/bean-validation-module-project-0.6-SNAPSHOT-tests.jar
[JENKINS] Archiving <https://builds.apache.org/job/Deltaspike%20OWB%201.1.9-SNAPSHOT/ws/deltaspike/modules/partial-bean/impl/pom.xml> to org.apache.deltaspike.modules/deltaspike-partial-bean-module-impl/0.6-SNAPSHOT/deltaspike-partial-bean-module-impl-0.6-SNAPSHOT.pom
[JENKINS] Archiving <https://builds.apache.org/job/Deltaspike%20OWB%201.1.9-SNAPSHOT/ws/deltaspike/modules/partial-bean/impl/target/deltaspike-partial-bean-module-impl-0.6-SNAPSHOT.jar> to org.apache.deltaspike.modules/deltaspike-partial-bean-module-impl/0.6-SNAPSHOT/deltaspike-partial-bean-module-impl-0.6-SNAPSHOT.jar
[JENKINS] Archiving <https://builds.apache.org/job/Deltaspike%20OWB%201.1.9-SNAPSHOT/ws/deltaspike/modules/partial-bean/impl/target/deltaspike-partial-bean-module-impl-0.6-SNAPSHOT-tests.jar> to org.apache.deltaspike.modules/deltaspike-partial-bean-module-impl/0.6-SNAPSHOT/deltaspike-partial-bean-module-impl-0.6-SNAPSHOT-tests.jar
[JENKINS] Archiving <https://builds.apache.org/job/Deltaspike%20OWB%201.1.9-SNAPSHOT/ws/deltaspike/modules/partial-bean/impl/target/deltaspike-partial-bean-module-impl-0.6-SNAPSHOT-sources.jar> to org.apache.deltaspike.modules/deltaspike-partial-bean-module-impl/0.6-SNAPSHOT/deltaspike-partial-bean-module-impl-0.6-SNAPSHOT-sources.jar
[JENKINS] Archiving <https://builds.apache.org/job/Deltaspike%20OWB%201.1.9-SNAPSHOT/ws/deltaspike/cdictrl/impl-weld/pom.xml> to org.apache.deltaspike.cdictrl/deltaspike-cdictrl-weld/0.6-SNAPSHOT/deltaspike-cdictrl-weld-0.6-SNAPSHOT.pom
[JENKINS] Archiving <https://builds.apache.org/job/Deltaspike%20OWB%201.1.9-SNAPSHOT/ws/deltaspike/cdictrl/impl-weld/target/deltaspike-cdictrl-weld-0.6-SNAPSHOT.jar> to org.apache.deltaspike.cdictrl/deltaspike-cdictrl-weld/0.6-SNAPSHOT/deltaspike-cdictrl-weld-0.6-SNAPSHOT.jar
[JENKINS] Archiving <https://builds.apache.org/job/Deltaspike%20OWB%201.1.9-SNAPSHOT/ws/deltaspike/cdictrl/impl-weld/target/deltaspike-cdictrl-weld-0.6-SNAPSHOT-sources.jar> to org.apache.deltaspike.cdictrl/deltaspike-cdictrl-weld/0.6-SNAPSHOT/deltaspike-cdictrl-weld-0.6-SNAPSHOT-sources.jar
[JENKINS] Archiving <https://builds.apache.org/job/Deltaspike%20OWB%201.1.9-SNAPSHOT/ws/deltaspike/modules/servlet/impl/pom.xml> to org.apache.deltaspike.modules/deltaspike-servlet-module-impl/0.6-SNAPSHOT/deltaspike-servlet-module-impl-0.6-SNAPSHOT.pom
[JENKINS] Archiving <https://builds.apache.org/job/Deltaspike%20OWB%201.1.9-SNAPSHOT/ws/deltaspike/modules/servlet/impl/target/deltaspike-servlet-module-impl-0.6-SNAPSHOT.jar> to org.apache.deltaspike.modules/deltaspike-servlet-module-impl/0.6-SNAPSHOT/deltaspike-servlet-module-impl-0.6-SNAPSHOT.jar
[JENKINS] Archiving <https://builds.apache.org/job/Deltaspike%20OWB%201.1.9-SNAPSHOT/ws/deltaspike/modules/servlet/impl/target/deltaspike-servlet-module-impl-0.6-SNAPSHOT-tests.jar> to org.apache.deltaspike.modules/deltaspike-servlet-module-impl/0.6-SNAPSHOT/deltaspike-servlet-module-impl-0.6-SNAPSHOT-tests.jar
[JENKINS] Archiving <https://builds.apache.org/job/Deltaspike%20OWB%201.1.9-SNAPSHOT/ws/deltaspike/modules/servlet/impl/target/deltaspike-servlet-module-impl-0.6-SNAPSHOT-sources.jar> to org.apache.deltaspike.modules/deltaspike-servlet-module-impl/0.6-SNAPSHOT/deltaspike-servlet-module-impl-0.6-SNAPSHOT-sources.jar
[JENKINS] Archiving <https://builds.apache.org/job/Deltaspike%20OWB%201.1.9-SNAPSHOT/ws/deltaspike/modules/jpa/api/pom.xml> to org.apache.deltaspike.modules/deltaspike-jpa-module-api/0.6-SNAPSHOT/deltaspike-jpa-module-api-0.6-SNAPSHOT.pom
[JENKINS] Archiving <https://builds.apache.org/job/Deltaspike%20OWB%201.1.9-SNAPSHOT/ws/deltaspike/modules/jpa/api/target/deltaspike-jpa-module-api-0.6-SNAPSHOT.jar> to org.apache.deltaspike.modules/deltaspike-jpa-module-api/0.6-SNAPSHOT/deltaspike-jpa-module-api-0.6-SNAPSHOT.jar
[JENKINS] Archiving <https://builds.apache.org/job/Deltaspike%20OWB%201.1.9-SNAPSHOT/ws/deltaspike/modules/jpa/api/target/deltaspike-jpa-module-api-0.6-SNAPSHOT-tests.jar> to org.apache.deltaspike.modules/deltaspike-jpa-module-api/0.6-SNAPSHOT/deltaspike-jpa-module-api-0.6-SNAPSHOT-tests.jar
[JENKINS] Archiving <https://builds.apache.org/job/Deltaspike%20OWB%201.1.9-SNAPSHOT/ws/deltaspike/modules/jpa/api/target/deltaspike-jpa-module-api-0.6-SNAPSHOT-sources.jar> to org.apache.deltaspike.modules/deltaspike-jpa-module-api/0.6-SNAPSHOT/deltaspike-jpa-module-api-0.6-SNAPSHOT-sources.jar
[JENKINS] Archiving <https://builds.apache.org/job/Deltaspike%20OWB%201.1.9-SNAPSHOT/ws/deltaspike/modules/bean-validation/impl/pom.xml> to org.apache.deltaspike.modules/deltaspike-bean-validation-module-impl/0.6-SNAPSHOT/deltaspike-bean-validation-module-impl-0.6-SNAPSHOT.pom
[JENKINS] Archiving <https://builds.apache.org/job/Deltaspike%20OWB%201.1.9-SNAPSHOT/ws/deltaspike/modules/bean-validation/impl/target/deltaspike-bean-validation-module-impl-0.6-SNAPSHOT.jar> to org.apache.deltaspike.modules/deltaspike-bean-validation-module-impl/0.6-SNAPSHOT/deltaspike-bean-validation-module-impl-0.6-SNAPSHOT.jar
[JENKINS] Archiving <https://builds.apache.org/job/Deltaspike%20OWB%201.1.9-SNAPSHOT/ws/deltaspike/modules/bean-validation/impl/target/deltaspike-bean-validation-module-impl-0.6-SNAPSHOT-tests.jar> to org.apache.deltaspike.modules/deltaspike-bean-validation-module-impl/0.6-SNAPSHOT/deltaspike-bean-validation-module-impl-0.6-SNAPSHOT-tests.jar
[JENKINS] Archiving <https://builds.apache.org/job/Deltaspike%20OWB%201.1.9-SNAPSHOT/ws/deltaspike/modules/bean-validation/impl/target/deltaspike-bean-validation-module-impl-0.6-SNAPSHOT-sources.jar> to org.apache.deltaspike.modules/deltaspike-bean-validation-module-impl/0.6-SNAPSHOT/deltaspike-bean-validation-module-impl-0.6-SNAPSHOT-sources.jar
[JENKINS] Archiving <https://builds.apache.org/job/Deltaspike%20OWB%201.1.9-SNAPSHOT/ws/deltaspike/cdictrl/impl-owb/pom.xml> to org.apache.deltaspike.cdictrl/deltaspike-cdictrl-owb/0.6-SNAPSHOT/deltaspike-cdictrl-owb-0.6-SNAPSHOT.pom
[JENKINS] Archiving <https://builds.apache.org/job/Deltaspike%20OWB%201.1.9-SNAPSHOT/ws/deltaspike/cdictrl/impl-owb/target/deltaspike-cdictrl-owb-0.6-SNAPSHOT.jar> to org.apache.deltaspike.cdictrl/deltaspike-cdictrl-owb/0.6-SNAPSHOT/deltaspike-cdictrl-owb-0.6-SNAPSHOT.jar
[JENKINS] Archiving <https://builds.apache.org/job/Deltaspike%20OWB%201.1.9-SNAPSHOT/ws/deltaspike/cdictrl/impl-owb/target/deltaspike-cdictrl-owb-0.6-SNAPSHOT-sources.jar> to org.apache.deltaspike.cdictrl/deltaspike-cdictrl-owb/0.6-SNAPSHOT/deltaspike-cdictrl-owb-0.6-SNAPSHOT-sources.jar
[JENKINS] Archiving <https://builds.apache.org/job/Deltaspike%20OWB%201.1.9-SNAPSHOT/ws/deltaspike/modules/servlet/api/pom.xml> to org.apache.deltaspike.modules/deltaspike-servlet-module-api/0.6-SNAPSHOT/deltaspike-servlet-module-api-0.6-SNAPSHOT.pom
[JENKINS] Archiving <https://builds.apache.org/job/Deltaspike%20OWB%201.1.9-SNAPSHOT/ws/deltaspike/modules/servlet/api/target/deltaspike-servlet-module-api-0.6-SNAPSHOT.jar> to org.apache.deltaspike.modules/deltaspike-servlet-module-api/0.6-SNAPSHOT/deltaspike-servlet-module-api-0.6-SNAPSHOT.jar
[JENKINS] Archiving <https://builds.apache.org/job/Deltaspike%20OWB%201.1.9-SNAPSHOT/ws/deltaspike/modules/servlet/api/target/deltaspike-servlet-module-api-0.6-SNAPSHOT-tests.jar> to org.apache.deltaspike.modules/deltaspike-servlet-module-api/0.6-SNAPSHOT/deltaspike-servlet-module-api-0.6-SNAPSHOT-tests.jar
[JENKINS] Archiving <https://builds.apache.org/job/Deltaspike%20OWB%201.1.9-SNAPSHOT/ws/deltaspike/modules/servlet/api/target/deltaspike-servlet-module-api-0.6-SNAPSHOT-sources.jar> to org.apache.deltaspike.modules/deltaspike-servlet-module-api/0.6-SNAPSHOT/deltaspike-servlet-module-api-0.6-SNAPSHOT-sources.jar
[JENKINS] Archiving <https://builds.apache.org/job/Deltaspike%20OWB%201.1.9-SNAPSHOT/ws/deltaspike/modules/jpa/pom.xml> to org.apache.deltaspike.modules/jpa-module-project/0.6-SNAPSHOT/jpa-module-project-0.6-SNAPSHOT.pom
[JENKINS] Archiving <https://builds.apache.org/job/Deltaspike%20OWB%201.1.9-SNAPSHOT/ws/deltaspike/modules/jpa/target/jpa-module-project-0.6-SNAPSHOT-tests.jar> to org.apache.deltaspike.modules/jpa-module-project/0.6-SNAPSHOT/jpa-module-project-0.6-SNAPSHOT-tests.jar
[JENKINS] Archiving <https://builds.apache.org/job/Deltaspike%20OWB%201.1.9-SNAPSHOT/ws/deltaspike/modules/jpa/impl/pom.xml> to org.apache.deltaspike.modules/deltaspike-jpa-module-impl/0.6-SNAPSHOT/deltaspike-jpa-module-impl-0.6-SNAPSHOT.pom
[JENKINS] Archiving <https://builds.apache.org/job/Deltaspike%20OWB%201.1.9-SNAPSHOT/ws/deltaspike/modules/jpa/impl/target/deltaspike-jpa-module-impl-0.6-SNAPSHOT.jar> to org.apache.deltaspike.modules/deltaspike-jpa-module-impl/0.6-SNAPSHOT/deltaspike-jpa-module-impl-0.6-SNAPSHOT.jar
[JENKINS] Archiving <https://builds.apache.org/job/Deltaspike%20OWB%201.1.9-SNAPSHOT/ws/deltaspike/modules/jpa/impl/target/deltaspike-jpa-module-impl-0.6-SNAPSHOT-tests.jar> to org.apache.deltaspike.modules/deltaspike-jpa-module-impl/0.6-SNAPSHOT/deltaspike-jpa-module-impl-0.6-SNAPSHOT-tests.jar
[JENKINS] Archiving <https://builds.apache.org/job/Deltaspike%20OWB%201.1.9-SNAPSHOT/ws/deltaspike/modules/jpa/impl/target/deltaspike-jpa-module-impl-0.6-SNAPSHOT-sources.jar> to org.apache.deltaspike.modules/deltaspike-jpa-module-impl/0.6-SNAPSHOT/deltaspike-jpa-module-impl-0.6-SNAPSHOT-sources.jar
[JENKINS] Archiving <https://builds.apache.org/job/Deltaspike%20OWB%201.1.9-SNAPSHOT/ws/deltaspike/modules/data/pom.xml> to org.apache.deltaspike.modules/data-module-project/0.6-SNAPSHOT/data-module-project-0.6-SNAPSHOT.pom
[JENKINS] Archiving <https://builds.apache.org/job/Deltaspike%20OWB%201.1.9-SNAPSHOT/ws/deltaspike/modules/data/target/data-module-project-0.6-SNAPSHOT-tests.jar> to org.apache.deltaspike.modules/data-module-project/0.6-SNAPSHOT/data-module-project-0.6-SNAPSHOT-tests.jar
[JENKINS] Archiving <https://builds.apache.org/job/Deltaspike%20OWB%201.1.9-SNAPSHOT/ws/deltaspike/cdictrl/pom.xml> to org.apache.deltaspike.cdictrl/cdictrl-project/0.6-SNAPSHOT/cdictrl-project-0.6-SNAPSHOT.pom
[JENKINS] Archiving <https://builds.apache.org/job/Deltaspike%20OWB%201.1.9-SNAPSHOT/ws/deltaspike/modules/scheduler/api/pom.xml> to org.apache.deltaspike.modules/deltaspike-scheduler-module-api/0.6-SNAPSHOT/deltaspike-scheduler-module-api-0.6-SNAPSHOT.pom
[JENKINS] Archiving <https://builds.apache.org/job/Deltaspike%20OWB%201.1.9-SNAPSHOT/ws/deltaspike/modules/test-control/impl/pom.xml> to org.apache.deltaspike.modules/deltaspike-test-control-module-impl/0.6-SNAPSHOT/deltaspike-test-control-module-impl-0.6-SNAPSHOT.pom
[JENKINS] Archiving <https://builds.apache.org/job/Deltaspike%20OWB%201.1.9-SNAPSHOT/ws/deltaspike/modules/servlet/pom.xml> to org.apache.deltaspike.modules/servlet-module-project/0.6-SNAPSHOT/servlet-module-project-0.6-SNAPSHOT.pom
[JENKINS] Archiving <https://builds.apache.org/job/Deltaspike%20OWB%201.1.9-SNAPSHOT/ws/deltaspike/modules/servlet/target/servlet-module-project-0.6-SNAPSHOT-tests.jar> to org.apache.deltaspike.modules/servlet-module-project/0.6-SNAPSHOT/servlet-module-project-0.6-SNAPSHOT-tests.jar
[JENKINS] Archiving <https://builds.apache.org/job/Deltaspike%20OWB%201.1.9-SNAPSHOT/ws/deltaspike/pom.xml> to org.apache.deltaspike/deltaspike-project/0.6-SNAPSHOT/deltaspike-project-0.6-SNAPSHOT.pom
[JENKINS] Archiving <https://builds.apache.org/job/Deltaspike%20OWB%201.1.9-SNAPSHOT/ws/deltaspike/modules/test-control/api/pom.xml> to org.apache.deltaspike.modules/deltaspike-test-control-module-api/0.6-SNAPSHOT/deltaspike-test-control-module-api-0.6-SNAPSHOT.pom
[JENKINS] Archiving <https://builds.apache.org/job/Deltaspike%20OWB%201.1.9-SNAPSHOT/ws/deltaspike/modules/security/api/pom.xml> to org.apache.deltaspike.modules/deltaspike-security-module-api/0.6-SNAPSHOT/deltaspike-security-module-api-0.6-SNAPSHOT.pom
[JENKINS] Archiving <https://builds.apache.org/job/Deltaspike%20OWB%201.1.9-SNAPSHOT/ws/deltaspike/modules/security/api/target/deltaspike-security-module-api-0.6-SNAPSHOT.jar> to org.apache.deltaspike.modules/deltaspike-security-module-api/0.6-SNAPSHOT/deltaspike-security-module-api-0.6-SNAPSHOT.jar
[JENKINS] Archiving <https://builds.apache.org/job/Deltaspike%20OWB%201.1.9-SNAPSHOT/ws/deltaspike/modules/security/api/target/deltaspike-security-module-api-0.6-SNAPSHOT-tests.jar> to org.apache.deltaspike.modules/deltaspike-security-module-api/0.6-SNAPSHOT/deltaspike-security-module-api-0.6-SNAPSHOT-tests.jar
[JENKINS] Archiving <https://builds.apache.org/job/Deltaspike%20OWB%201.1.9-SNAPSHOT/ws/deltaspike/modules/security/api/target/deltaspike-security-module-api-0.6-SNAPSHOT-sources.jar> to org.apache.deltaspike.modules/deltaspike-security-module-api/0.6-SNAPSHOT/deltaspike-security-module-api-0.6-SNAPSHOT-sources.jar
Sending e-mails to: commits@deltaspike.apache.org
channel stopped

Mime
View raw message