deltaspike-commits mailing list archives

Site index · List index
Message view « Date » · « Thread »
Top « Date » · « Thread »
From Apache Jenkins Server <jenk...@builds.apache.org>
Subject Build failed in Jenkins: DeltaSpike RAT-Check #827
Date Thu, 02 Jan 2014 08:01:23 GMT
See <https://builds.apache.org/job/DeltaSpike%20RAT-Check/827/>

------------------------------------------
[...truncated 3438 lines...]
INFO: Test org.apache.deltaspike.test.jpa.api.transactional.getRollbackOnly.multipleinjection.auto.MultipleEntityManagerInjectionRollbackOnly1Test
Adding Java ClassPath URL as JavaArchive jar:<https://builds.apache.org/job/DeltaSpike%20RAT-Check/ws/deltaspike/core/impl/target/deltaspike-core-impl-0.6-SNAPSHOT.jar!/META-INF/beans.xml>
Jan 2, 2014 7:45:53 AM org.apache.deltaspike.test.utils.ShrinkWrapArchiveUtil getArchives
INFO: Test org.apache.deltaspike.test.jpa.api.transactional.getRollbackOnly.multipleinjection.auto.MultipleEntityManagerInjectionRollbackOnly1Test
Adding Java ClassPath URL as JavaArchive jar:<https://builds.apache.org/job/DeltaSpike%20RAT-Check/ws/deltaspike/modules/jpa/api/target/deltaspike-jpa-module-api-0.6-SNAPSHOT.jar!/META-INF/beans.xml>
Jan 2, 2014 7:45:53 AM org.apache.webbeans.lifecycle.AbstractLifeCycle startApplication
INFO: OpenWebBeans Container is starting...
Jan 2, 2014 7:45:53 AM org.apache.webbeans.xml.WebBeansXMLConfigurator configureInterceptorsElement
WARNING: Interceptor class : org.apache.deltaspike.jpa.impl.transaction.TransactionalInterceptor
is already defined
Jan 2, 2014 7:45:54 AM org.apache.webbeans.config.BeansDeployer validateInjectionPoints
INFO: All injection points were validated successfully.
Jan 2, 2014 7:45:54 AM org.apache.webbeans.lifecycle.AbstractLifeCycle startApplication
INFO: OpenWebBeans Container has started, it took [70] ms.
Running org.apache.deltaspike.test.jpa.api.transactional.getRollbackOnly.multipleinjection.nested.NestedMultiTransactionRollbackOnlyTest
Tests run: 1, Failures: 0, Errors: 0, Skipped: 0, Time elapsed: 0.009 sec
Jan 2, 2014 7:45:54 AM org.apache.deltaspike.test.utils.ShrinkWrapArchiveUtil getArchives
INFO: Test org.apache.deltaspike.test.jpa.api.transactional.getRollbackOnly.multipleinjection.auto.MultipleEntityManagerInjectionRollbackOnly2Test
Adding Java ClassPath URL as JavaArchive <https://builds.apache.org/job/DeltaSpike%20RAT-Check/ws/deltaspike/modules/jpa/impl/target/classes/META-INF/beans.xml>
Jan 2, 2014 7:45:54 AM org.apache.deltaspike.test.utils.ShrinkWrapArchiveUtil getArchives
INFO: Test org.apache.deltaspike.test.jpa.api.transactional.getRollbackOnly.multipleinjection.auto.MultipleEntityManagerInjectionRollbackOnly2Test
Adding Java ClassPath URL as JavaArchive jar:<https://builds.apache.org/job/DeltaSpike%20RAT-Check/ws/deltaspike/core/api/target/deltaspike-core-api-0.6-SNAPSHOT.jar!/META-INF/beans.xml>
Jan 2, 2014 7:45:54 AM org.apache.deltaspike.test.utils.ShrinkWrapArchiveUtil getArchives
INFO: Test org.apache.deltaspike.test.jpa.api.transactional.getRollbackOnly.multipleinjection.auto.MultipleEntityManagerInjectionRollbackOnly2Test
Adding Java ClassPath URL as JavaArchive jar:<https://builds.apache.org/job/DeltaSpike%20RAT-Check/ws/deltaspike/core/impl/target/deltaspike-core-impl-0.6-SNAPSHOT.jar!/META-INF/beans.xml>
Jan 2, 2014 7:45:54 AM org.apache.deltaspike.test.utils.ShrinkWrapArchiveUtil getArchives
INFO: Test org.apache.deltaspike.test.jpa.api.transactional.getRollbackOnly.multipleinjection.auto.MultipleEntityManagerInjectionRollbackOnly2Test
Adding Java ClassPath URL as JavaArchive jar:<https://builds.apache.org/job/DeltaSpike%20RAT-Check/ws/deltaspike/modules/jpa/api/target/deltaspike-jpa-module-api-0.6-SNAPSHOT.jar!/META-INF/beans.xml>
Jan 2, 2014 7:45:54 AM org.apache.webbeans.lifecycle.AbstractLifeCycle startApplication
INFO: OpenWebBeans Container is starting...
Jan 2, 2014 7:45:54 AM org.apache.webbeans.xml.WebBeansXMLConfigurator configureInterceptorsElement
WARNING: Interceptor class : org.apache.deltaspike.jpa.impl.transaction.TransactionalInterceptor
is already defined
Jan 2, 2014 7:45:54 AM org.apache.webbeans.config.BeansDeployer validateInjectionPoints
INFO: All injection points were validated successfully.
Jan 2, 2014 7:45:54 AM org.apache.webbeans.lifecycle.AbstractLifeCycle startApplication
INFO: OpenWebBeans Container has started, it took [70] ms.
Running org.apache.deltaspike.test.jpa.api.transactional.getRollbackOnly.multipleinjection.auto.MultipleEntityManagerInjectionRollbackOnly1Test
Tests run: 1, Failures: 0, Errors: 0, Skipped: 0, Time elapsed: 0.008 sec
Jan 2, 2014 7:45:54 AM org.apache.deltaspike.test.utils.ShrinkWrapArchiveUtil getArchives
INFO: Test org.apache.deltaspike.test.jpa.api.transactional.getRollbackOnly.multipleinjection.auto.MultipleEntityManagerInjectionRollbackOnlyTest
Adding Java ClassPath URL as JavaArchive <https://builds.apache.org/job/DeltaSpike%20RAT-Check/ws/deltaspike/modules/jpa/impl/target/classes/META-INF/beans.xml>
Jan 2, 2014 7:45:54 AM org.apache.deltaspike.test.utils.ShrinkWrapArchiveUtil getArchives
INFO: Test org.apache.deltaspike.test.jpa.api.transactional.getRollbackOnly.multipleinjection.auto.MultipleEntityManagerInjectionRollbackOnlyTest
Adding Java ClassPath URL as JavaArchive jar:<https://builds.apache.org/job/DeltaSpike%20RAT-Check/ws/deltaspike/core/api/target/deltaspike-core-api-0.6-SNAPSHOT.jar!/META-INF/beans.xml>
Jan 2, 2014 7:45:54 AM org.apache.deltaspike.test.utils.ShrinkWrapArchiveUtil getArchives
INFO: Test org.apache.deltaspike.test.jpa.api.transactional.getRollbackOnly.multipleinjection.auto.MultipleEntityManagerInjectionRollbackOnlyTest
Adding Java ClassPath URL as JavaArchive jar:<https://builds.apache.org/job/DeltaSpike%20RAT-Check/ws/deltaspike/core/impl/target/deltaspike-core-impl-0.6-SNAPSHOT.jar!/META-INF/beans.xml>
Jan 2, 2014 7:45:54 AM org.apache.deltaspike.test.utils.ShrinkWrapArchiveUtil getArchives
INFO: Test org.apache.deltaspike.test.jpa.api.transactional.getRollbackOnly.multipleinjection.auto.MultipleEntityManagerInjectionRollbackOnlyTest
Adding Java ClassPath URL as JavaArchive jar:<https://builds.apache.org/job/DeltaSpike%20RAT-Check/ws/deltaspike/modules/jpa/api/target/deltaspike-jpa-module-api-0.6-SNAPSHOT.jar!/META-INF/beans.xml>
Jan 2, 2014 7:45:54 AM org.apache.webbeans.lifecycle.AbstractLifeCycle startApplication
INFO: OpenWebBeans Container is starting...
Jan 2, 2014 7:45:54 AM org.apache.webbeans.xml.WebBeansXMLConfigurator configureInterceptorsElement
WARNING: Interceptor class : org.apache.deltaspike.jpa.impl.transaction.TransactionalInterceptor
is already defined
Jan 2, 2014 7:45:54 AM org.apache.webbeans.config.BeansDeployer validateInjectionPoints
INFO: All injection points were validated successfully.
Jan 2, 2014 7:45:54 AM org.apache.webbeans.lifecycle.AbstractLifeCycle startApplication
INFO: OpenWebBeans Container has started, it took [68] ms.
Running org.apache.deltaspike.test.jpa.api.transactional.getRollbackOnly.multipleinjection.auto.MultipleEntityManagerInjectionRollbackOnly2Test
Tests run: 1, Failures: 0, Errors: 0, Skipped: 0, Time elapsed: 0.006 sec
Jan 2, 2014 7:45:54 AM org.apache.deltaspike.test.utils.ShrinkWrapArchiveUtil getArchives
INFO: Test org.apache.deltaspike.test.jpa.datasource.ConfigurableDataSourceTest Adding Java
ClassPath URL as JavaArchive <https://builds.apache.org/job/DeltaSpike%20RAT-Check/ws/deltaspike/modules/jpa/impl/target/classes/META-INF/beans.xml>
Jan 2, 2014 7:45:54 AM org.apache.deltaspike.test.utils.ShrinkWrapArchiveUtil getArchives
INFO: Test org.apache.deltaspike.test.jpa.datasource.ConfigurableDataSourceTest Adding Java
ClassPath URL as JavaArchive jar:<https://builds.apache.org/job/DeltaSpike%20RAT-Check/ws/deltaspike/core/api/target/deltaspike-core-api-0.6-SNAPSHOT.jar!/META-INF/beans.xml>
Jan 2, 2014 7:45:54 AM org.apache.deltaspike.test.utils.ShrinkWrapArchiveUtil getArchives
INFO: Test org.apache.deltaspike.test.jpa.datasource.ConfigurableDataSourceTest Adding Java
ClassPath URL as JavaArchive jar:<https://builds.apache.org/job/DeltaSpike%20RAT-Check/ws/deltaspike/core/impl/target/deltaspike-core-impl-0.6-SNAPSHOT.jar!/META-INF/beans.xml>
Jan 2, 2014 7:45:54 AM org.apache.deltaspike.test.utils.ShrinkWrapArchiveUtil getArchives
INFO: Test org.apache.deltaspike.test.jpa.datasource.ConfigurableDataSourceTest Adding Java
ClassPath URL as JavaArchive jar:<https://builds.apache.org/job/DeltaSpike%20RAT-Check/ws/deltaspike/modules/jpa/api/target/deltaspike-jpa-module-api-0.6-SNAPSHOT.jar!/META-INF/beans.xml>
Jan 2, 2014 7:45:54 AM org.apache.webbeans.lifecycle.AbstractLifeCycle startApplication
INFO: OpenWebBeans Container is starting...
Jan 2, 2014 7:45:54 AM org.apache.webbeans.xml.WebBeansXMLConfigurator configureInterceptorsElement
WARNING: Interceptor class : org.apache.deltaspike.jpa.impl.transaction.TransactionalInterceptor
is already defined
Jan 2, 2014 7:45:54 AM org.apache.webbeans.config.BeansDeployer validateInjectionPoints
INFO: All injection points were validated successfully.
Jan 2, 2014 7:45:54 AM org.apache.webbeans.lifecycle.AbstractLifeCycle startApplication
INFO: OpenWebBeans Container has started, it took [71] ms.
Running org.apache.deltaspike.test.jpa.api.transactional.getRollbackOnly.multipleinjection.auto.MultipleEntityManagerInjectionRollbackOnlyTest
Tests run: 1, Failures: 0, Errors: 0, Skipped: 0, Time elapsed: 0.005 sec
Running org.apache.deltaspike.test.jpa.datasource.ConfigurableDataSourceTest
Tests run: 2, Failures: 0, Errors: 0, Skipped: 0, Time elapsed: 0.007 sec

Results :

Tests run: 34, Failures: 0, Errors: 0, Skipped: 0

[JENKINS] Recording test results
[INFO] 
[INFO] --- maven-bundle-plugin:2.3.7:bundle (default-bundle) @ deltaspike-jpa-module-impl
---
[WARNING] Bundle org.apache.deltaspike.modules:deltaspike-jpa-module-impl:bundle:0.6-SNAPSHOT
: Did not find matching referal for !org.apache.deltaspike.jpa.impl.*
[INFO] 
[INFO] --- maven-site-plugin:3.1:attach-descriptor (attach-descriptor) @ deltaspike-jpa-module-impl
---
[INFO] 
[INFO] --- maven-jar-plugin:2.4:test-jar (default) @ deltaspike-jpa-module-impl ---
[INFO] Building jar: <https://builds.apache.org/job/DeltaSpike%20RAT-Check/ws/deltaspike/modules/jpa/impl/target/deltaspike-jpa-module-impl-0.6-SNAPSHOT-tests.jar>
[INFO] 
[INFO] --- apache-rat-plugin:0.8:check (default) @ deltaspike-jpa-module-impl ---
[INFO] Exclude: .idea/**/*
[INFO] Exclude: readme/**/*
[INFO] Exclude: **/*.log
[INFO] 
[INFO] --- maven-bundle-plugin:2.3.7:cleanVersions (versions) @ deltaspike-jpa-module-impl
---
[INFO] 
[INFO] --- maven-antrun-plugin:1.6:run (javadoc.resources) @ deltaspike-jpa-module-impl ---
[WARNING] Parameter tasks is deprecated, use target instead
[INFO] Executing tasks

main:
[INFO] Executed tasks
[WARNING] Failed to getClass for org.apache.maven.plugin.source.SourceJarMojo
[INFO] 
[INFO] --- maven-source-plugin:2.1.2:jar (attach-sources) @ deltaspike-jpa-module-impl ---
[INFO] META-INF already added, skipping
[INFO] META-INF/LICENSE already added, skipping
[INFO] META-INF/DISCLAIMER already added, skipping
[INFO] META-INF/DEPENDENCIES already added, skipping
[INFO] META-INF/NOTICE already added, skipping
[INFO] META-INF already added, skipping
[INFO] META-INF already added, skipping
[INFO] META-INF/LICENSE already added, skipping
[INFO] META-INF/DISCLAIMER already added, skipping
[INFO] META-INF/DEPENDENCIES already added, skipping
[INFO] META-INF/NOTICE already added, skipping
[INFO] META-INF already added, skipping
[INFO] META-INF/LICENSE already added, skipping
[INFO] META-INF/DISCLAIMER already added, skipping
[INFO] META-INF/DEPENDENCIES already added, skipping
[INFO] META-INF/NOTICE already added, skipping
[INFO] Building jar: <https://builds.apache.org/job/DeltaSpike%20RAT-Check/ws/deltaspike/modules/jpa/impl/target/deltaspike-jpa-module-impl-0.6-SNAPSHOT-sources.jar>
[INFO] META-INF already added, skipping
[INFO] META-INF/LICENSE already added, skipping
[INFO] META-INF/DISCLAIMER already added, skipping
[INFO] META-INF/DEPENDENCIES already added, skipping
[INFO] META-INF/NOTICE already added, skipping
[INFO] META-INF already added, skipping
[INFO] META-INF already added, skipping
[INFO] META-INF/LICENSE already added, skipping
[INFO] META-INF/DISCLAIMER already added, skipping
[INFO] META-INF/DEPENDENCIES already added, skipping
[INFO] META-INF/NOTICE already added, skipping
[INFO] META-INF already added, skipping
[INFO] META-INF/LICENSE already added, skipping
[INFO] META-INF/DISCLAIMER already added, skipping
[INFO] META-INF/DEPENDENCIES already added, skipping
[INFO] META-INF/NOTICE already added, skipping
[INFO] 
[INFO] --- maven-checkstyle-plugin:2.9.1:check (verify-style) @ deltaspike-jpa-module-impl
---
[INFO] Starting audit...
Audit done.

[INFO] 
[INFO] --- maven-install-plugin:2.3.1:install (default-install) @ deltaspike-jpa-module-impl
---
[INFO] Installing <https://builds.apache.org/job/DeltaSpike%20RAT-Check/ws/deltaspike/modules/jpa/impl/target/deltaspike-jpa-module-impl-0.6-SNAPSHOT.jar>
to /home/jenkins/jenkins-slave/maven-repositories/0/org/apache/deltaspike/modules/deltaspike-jpa-module-impl/0.6-SNAPSHOT/deltaspike-jpa-module-impl-0.6-SNAPSHOT.jar
[INFO] Installing <https://builds.apache.org/job/DeltaSpike%20RAT-Check/ws/deltaspike/modules/jpa/impl/pom.xml>
to /home/jenkins/jenkins-slave/maven-repositories/0/org/apache/deltaspike/modules/deltaspike-jpa-module-impl/0.6-SNAPSHOT/deltaspike-jpa-module-impl-0.6-SNAPSHOT.pom
[INFO] Installing <https://builds.apache.org/job/DeltaSpike%20RAT-Check/ws/deltaspike/modules/jpa/impl/target/deltaspike-jpa-module-impl-0.6-SNAPSHOT-tests.jar>
to /home/jenkins/jenkins-slave/maven-repositories/0/org/apache/deltaspike/modules/deltaspike-jpa-module-impl/0.6-SNAPSHOT/deltaspike-jpa-module-impl-0.6-SNAPSHOT-tests.jar
[INFO] Installing <https://builds.apache.org/job/DeltaSpike%20RAT-Check/ws/deltaspike/modules/jpa/impl/target/deltaspike-jpa-module-impl-0.6-SNAPSHOT-sources.jar>
to /home/jenkins/jenkins-slave/maven-repositories/0/org/apache/deltaspike/modules/deltaspike-jpa-module-impl/0.6-SNAPSHOT/deltaspike-jpa-module-impl-0.6-SNAPSHOT-sources.jar
[INFO] 
[INFO] --- maven-bundle-plugin:2.3.7:install (default-install) @ deltaspike-jpa-module-impl
---
[INFO] Installing org/apache/deltaspike/modules/deltaspike-jpa-module-impl/0.6-SNAPSHOT/deltaspike-jpa-module-impl-0.6-SNAPSHOT.jar
[INFO] Writing OBR metadata
Build timed out (after 30 minutes). Marking the build as failed.
[INFO] ------------------------------------------------------------------------
[INFO] Reactor Summary:
[INFO] 
[INFO] Apache DeltaSpike ................................. SUCCESS [15.793s]
[INFO] Apache DeltaSpike CheckStyle-rules ................ SUCCESS [3.151s]
[INFO] Apache DeltaSpike Parent .......................... SUCCESS [5.960s]
[INFO] Apache DeltaSpike Test-Utils ...................... SUCCESS [6.329s]
[INFO] Apache DeltaSpike Code Parent ..................... SUCCESS [3.053s]
[INFO] Apache DeltaSpike Core ............................ SUCCESS [2.579s]
[INFO] Apache DeltaSpike Core-API ........................ SUCCESS [16.067s]
[INFO] Apache DeltaSpike Core-Implementation ............. SUCCESS [20.661s]
[INFO] Apache DeltaSpike ContainerControl parent ......... SUCCESS [1.675s]
[INFO] Apache DeltaSpike CDI ContainerControl API ........ SUCCESS [3.095s]
[INFO] Apache DeltaSpike CDI ContainerControl TCK ........ SUCCESS [2.754s]
[INFO] Apache DeltaSpike CDI OWB-ContainerControl ........ SUCCESS [4.336s]
[INFO] Apache DeltaSpike CDI Weld-ContainerControl ....... SUCCESS [4.531s]
[INFO] Apache DeltaSpike CDI OpenEJB-ContainerControl .... SUCCESS [10.263s]
[INFO] Apache DeltaSpike Modules ......................... SUCCESS [2.238s]
[INFO] Apache DeltaSpike Security-Module ................. SUCCESS [1.965s]
[INFO] Apache DeltaSpike Security-Module API ............. SUCCESS [3.382s]
[INFO] Apache DeltaSpike Security-Module Impl ............ SUCCESS [6.695s]
[INFO] Apache DeltaSpike JPA-Module ...................... SUCCESS [1.702s]
[INFO] Apache DeltaSpike JPA-Module API .................. SUCCESS [5.903s]
[INFO] Apache DeltaSpike JPA-Module Impl ................. FAILURE [1:53.562s]
[INFO] Apache DeltaSpike Servlet-Module .................. SKIPPED
[INFO] Apache DeltaSpike Servlet-Module API .............. SKIPPED
[INFO] Apache DeltaSpike Servlet-Module Impl ............. SKIPPED
[INFO] Apache DeltaSpike JSF-Module ...................... SKIPPED
[INFO] Apache DeltaSpike JSF-Module API .................. SKIPPED
[INFO] Apache DeltaSpike JSF-Module Impl ................. SKIPPED
[INFO] Apache DeltaSpike Partial-Bean-Module ............. SKIPPED
[INFO] Apache DeltaSpike Partial-Bean-Module API ......... SKIPPED
[INFO] Apache DeltaSpike Partial-Bean-Module Impl ........ SKIPPED
[INFO] Apache DeltaSpike BeanValidation-Module ........... SKIPPED
[INFO] Apache DeltaSpike BeanValidation-Module API ....... SKIPPED
[INFO] Apache DeltaSpike BeanValidation-Module Impl ...... SKIPPED
[INFO] Apache DeltaSpike Data-Module ..................... SKIPPED
[INFO] Apache DeltaSpike Data-Module API ................. SKIPPED
[INFO] Apache DeltaSpike Data-Module Impl ................ SKIPPED
[INFO] Apache DeltaSpike Scheduler-Module ................ SKIPPED
[INFO] Apache DeltaSpike Scheduler-Module API ............ SKIPPED
[INFO] Apache DeltaSpike Scheduler-Module Impl ........... SKIPPED
[INFO] Apache DeltaSpike Test-Control-Module ............. SKIPPED
[INFO] Apache DeltaSpike Test-Control-Module API ......... SKIPPED
[INFO] Apache DeltaSpike Test-Control-Module Impl ........ SKIPPED
[INFO] Apache DeltaSpike Examples ........................ SKIPPED
[INFO] Apache DeltaSpike Java-SE Examples ................ SKIPPED
[INFO] Apache DeltaSpike JSF Examples .................... SKIPPED
[INFO] ------------------------------------------------------------------------
[INFO] BUILD FAILURE
[INFO] ------------------------------------------------------------------------
[INFO] Total time: 29:46.345s
[INFO] Finished at: Thu Jan 02 07:47:38 UTC 2014
[INFO] Final Memory: 51M/418M
[INFO] ------------------------------------------------------------------------
[ERROR] Internal error: java.lang.IllegalStateException: Unable to call isArchivingDisabled.
Invalid object ID 48 -> [Help 1]
org.apache.maven.InternalErrorException: Internal error: java.lang.IllegalStateException:
Unable to call isArchivingDisabled. Invalid object ID 48
	at org.apache.maven.DefaultMaven.execute(DefaultMaven.java:168)
	at org.jvnet.hudson.maven3.launcher.Maven3Launcher.main(Maven3Launcher.java:117)
	at sun.reflect.NativeMethodAccessorImpl.invoke0(Native Method)
	at sun.reflect.NativeMethodAccessorImpl.invoke(NativeMethodAccessorImpl.java:39)
	at sun.reflect.DelegatingMethodAccessorImpl.invoke(DelegatingMethodAccessorImpl.java:25)
	at java.lang.reflect.Method.invoke(Method.java:597)
	at org.codehaus.plexus.classworlds.launcher.Launcher.launchStandard(Launcher.java:329)
	at org.codehaus.plexus.classworlds.launcher.Launcher.launch(Launcher.java:239)
	at org.jvnet.hudson.maven3.agent.Maven3Main.launch(Maven3Main.java:178)
	at sun.reflect.NativeMethodAccessorImpl.invoke0(Native Method)
	at sun.reflect.NativeMethodAccessorImpl.invoke(NativeMethodAccessorImpl.java:39)
	at sun.reflect.DelegatingMethodAccessorImpl.invoke(DelegatingMethodAccessorImpl.java:25)
	at java.lang.reflect.Method.invoke(Method.java:597)
	at hudson.maven.Maven3Builder.call(Maven3Builder.java:134)
	at hudson.maven.Maven3Builder.call(Maven3Builder.java:69)
	at hudson.remoting.UserRequest.perform(UserRequest.java:118)
	at hudson.remoting.UserRequest.perform(UserRequest.java:48)
	at hudson.remoting.Request$2.run(Request.java:328)
	at hudson.remoting.InterceptingExecutorService$1.call(InterceptingExecutorService.java:72)
	at java.util.concurrent.FutureTask$Sync.innerRun(FutureTask.java:303)
	at java.util.concurrent.FutureTask.run(FutureTask.java:138)
	at java.util.concurrent.ThreadPoolExecutor$Worker.runTask(ThreadPoolExecutor.java:895)
	at java.util.concurrent.ThreadPoolExecutor$Worker.run(ThreadPoolExecutor.java:918)
	at java.lang.Thread.run(Thread.java:662)
Caused by: java.lang.IllegalStateException: Unable to call isArchivingDisabled. Invalid object
ID 48
	at hudson.remoting.RemoteInvocationHandler$RPCRequest.perform(RemoteInvocationHandler.java:293)
	at hudson.remoting.RemoteInvocationHandler$RPCRequest.call(RemoteInvocationHandler.java:280)
	at hudson.remoting.RemoteInvocationHandler$RPCRequest.call(RemoteInvocationHandler.java:239)
	at hudson.remoting.UserRequest.perform(UserRequest.java:118)
	at hudson.remoting.UserRequest.perform(UserRequest.java:48)
	at hudson.remoting.Request$2.run(Request.java:328)
	at hudson.remoting.InterceptingExecutorService$1.call(InterceptingExecutorService.java:72)
	at java.util.concurrent.FutureTask.run(FutureTask.java:262)
	at java.util.concurrent.ThreadPoolExecutor.runWorker(ThreadPoolExecutor.java:1145)
	at java.util.concurrent.ThreadPoolExecutor$Worker.run(ThreadPoolExecutor.java:615)
	at java.lang.Thread.run(Thread.java:744)
[ERROR] 
[ERROR] To see the full stack trace of the errors, re-run Maven with the -e switch.
[ERROR] Re-run Maven using the -X switch to enable full debug logging.
[ERROR] 
[ERROR] For more information about the errors and possible solutions, please read the following
articles:
[ERROR] [Help 1] http://cwiki.apache.org/confluence/display/MAVEN/InternalErrorException
channel stopped

Mime
View raw message