deltaspike-commits mailing list archives

Site index · List index
Message view « Date » · « Thread »
Top « Date » · « Thread »
From Apache Jenkins Server <jenk...@builds.apache.org>
Subject Build failed in Jenkins: DeltaSpike RAT-Check #794
Date Mon, 16 Dec 2013 03:06:35 GMT
See <https://builds.apache.org/job/DeltaSpike%20RAT-Check/794/changes>

Changes:

[gpetracek] DELTASPIKE-466 improved external-container handling

[gpetracek] DELTASPIKE-468 optional integration with myfaces-test (first draft)

[john.d.ament] DELTASPIKE-399 Added code to read resources.

------------------------------------------
[...truncated 3268 lines...]
INFO: Test org.apache.deltaspike.test.jpa.api.transactionscoped.defaultnested.DefaultTransactionScopedNestedTransactionTest
Adding Java ClassPath URL as JavaArchive <https://builds.apache.org/job/DeltaSpike%20RAT-Check/ws/deltaspike/modules/jpa/impl/target/classes/META-INF/beans.xml>
Dec 16, 2013 2:51:50 AM org.apache.deltaspike.test.utils.ShrinkWrapArchiveUtil getArchives
INFO: Test org.apache.deltaspike.test.jpa.api.transactionscoped.defaultnested.DefaultTransactionScopedNestedTransactionTest
Adding Java ClassPath URL as JavaArchive jar:<https://builds.apache.org/job/DeltaSpike%20RAT-Check/ws/deltaspike/core/api/target/deltaspike-core-api-0.6-SNAPSHOT.jar!/META-INF/beans.xml>
Dec 16, 2013 2:51:50 AM org.apache.deltaspike.test.utils.ShrinkWrapArchiveUtil getArchives
INFO: Test org.apache.deltaspike.test.jpa.api.transactionscoped.defaultnested.DefaultTransactionScopedNestedTransactionTest
Adding Java ClassPath URL as JavaArchive jar:<https://builds.apache.org/job/DeltaSpike%20RAT-Check/ws/deltaspike/core/impl/target/deltaspike-core-impl-0.6-SNAPSHOT.jar!/META-INF/beans.xml>
Dec 16, 2013 2:51:50 AM org.apache.deltaspike.test.utils.ShrinkWrapArchiveUtil getArchives
INFO: Test org.apache.deltaspike.test.jpa.api.transactionscoped.defaultnested.DefaultTransactionScopedNestedTransactionTest
Adding Java ClassPath URL as JavaArchive jar:<https://builds.apache.org/job/DeltaSpike%20RAT-Check/ws/deltaspike/modules/jpa/api/target/deltaspike-jpa-module-api-0.6-SNAPSHOT.jar!/META-INF/beans.xml>
Dec 16, 2013 2:51:50 AM org.apache.webbeans.lifecycle.AbstractLifeCycle startApplication
INFO: OpenWebBeans Container is starting...
Dec 16, 2013 2:51:50 AM org.apache.webbeans.xml.WebBeansXMLConfigurator configureInterceptorsElement
WARNING: Interceptor class : org.apache.deltaspike.jpa.impl.transaction.TransactionalInterceptor
is already defined
Dec 16, 2013 2:51:50 AM org.apache.webbeans.config.BeansDeployer validateInjectionPoints
INFO: All injection points were validated successfully.
Dec 16, 2013 2:51:50 AM org.apache.webbeans.lifecycle.AbstractLifeCycle startApplication
INFO: OpenWebBeans Container has started, it took [69] ms.
Running org.apache.deltaspike.test.jpa.api.transactionscoped.nested.NestedTransactionScopedTransactionTest
Tests run: 1, Failures: 0, Errors: 0, Skipped: 0, Time elapsed: 0.009 sec
Dec 16, 2013 2:51:50 AM org.apache.deltaspike.test.utils.ShrinkWrapArchiveUtil getArchives
INFO: Test org.apache.deltaspike.test.jpa.api.transactionscoped.defaultinjection.DefaultTransactionScopedEntityManagerInjectionTest
Adding Java ClassPath URL as JavaArchive <https://builds.apache.org/job/DeltaSpike%20RAT-Check/ws/deltaspike/modules/jpa/impl/target/classes/META-INF/beans.xml>
Dec 16, 2013 2:51:50 AM org.apache.deltaspike.test.utils.ShrinkWrapArchiveUtil getArchives
INFO: Test org.apache.deltaspike.test.jpa.api.transactionscoped.defaultinjection.DefaultTransactionScopedEntityManagerInjectionTest
Adding Java ClassPath URL as JavaArchive jar:<https://builds.apache.org/job/DeltaSpike%20RAT-Check/ws/deltaspike/core/api/target/deltaspike-core-api-0.6-SNAPSHOT.jar!/META-INF/beans.xml>
Dec 16, 2013 2:51:50 AM org.apache.deltaspike.test.utils.ShrinkWrapArchiveUtil getArchives
INFO: Test org.apache.deltaspike.test.jpa.api.transactionscoped.defaultinjection.DefaultTransactionScopedEntityManagerInjectionTest
Adding Java ClassPath URL as JavaArchive jar:<https://builds.apache.org/job/DeltaSpike%20RAT-Check/ws/deltaspike/core/impl/target/deltaspike-core-impl-0.6-SNAPSHOT.jar!/META-INF/beans.xml>
Dec 16, 2013 2:51:50 AM org.apache.deltaspike.test.utils.ShrinkWrapArchiveUtil getArchives
INFO: Test org.apache.deltaspike.test.jpa.api.transactionscoped.defaultinjection.DefaultTransactionScopedEntityManagerInjectionTest
Adding Java ClassPath URL as JavaArchive jar:<https://builds.apache.org/job/DeltaSpike%20RAT-Check/ws/deltaspike/modules/jpa/api/target/deltaspike-jpa-module-api-0.6-SNAPSHOT.jar!/META-INF/beans.xml>
Dec 16, 2013 2:51:50 AM org.apache.webbeans.lifecycle.AbstractLifeCycle startApplication
INFO: OpenWebBeans Container is starting...
Dec 16, 2013 2:51:50 AM org.apache.webbeans.xml.WebBeansXMLConfigurator configureInterceptorsElement
WARNING: Interceptor class : org.apache.deltaspike.jpa.impl.transaction.TransactionalInterceptor
is already defined
Dec 16, 2013 2:51:50 AM org.apache.webbeans.config.BeansDeployer validateInjectionPoints
INFO: All injection points were validated successfully.
Dec 16, 2013 2:51:50 AM org.apache.webbeans.lifecycle.AbstractLifeCycle startApplication
INFO: OpenWebBeans Container has started, it took [78] ms.
Running org.apache.deltaspike.test.jpa.api.transactionscoped.defaultnested.DefaultTransactionScopedNestedTransactionTest
Tests run: 1, Failures: 0, Errors: 0, Skipped: 0, Time elapsed: 0.008 sec
Dec 16, 2013 2:51:50 AM org.apache.deltaspike.test.utils.ShrinkWrapArchiveUtil getArchives
INFO: Test org.apache.deltaspike.test.jpa.api.transactionscoped.multipleinjection.nested.NestedMultiTransactionScopedTransactionTest
Adding Java ClassPath URL as JavaArchive <https://builds.apache.org/job/DeltaSpike%20RAT-Check/ws/deltaspike/modules/jpa/impl/target/classes/META-INF/beans.xml>
Dec 16, 2013 2:51:50 AM org.apache.deltaspike.test.utils.ShrinkWrapArchiveUtil getArchives
INFO: Test org.apache.deltaspike.test.jpa.api.transactionscoped.multipleinjection.nested.NestedMultiTransactionScopedTransactionTest
Adding Java ClassPath URL as JavaArchive jar:<https://builds.apache.org/job/DeltaSpike%20RAT-Check/ws/deltaspike/core/api/target/deltaspike-core-api-0.6-SNAPSHOT.jar!/META-INF/beans.xml>
Dec 16, 2013 2:51:50 AM org.apache.deltaspike.test.utils.ShrinkWrapArchiveUtil getArchives
INFO: Test org.apache.deltaspike.test.jpa.api.transactionscoped.multipleinjection.nested.NestedMultiTransactionScopedTransactionTest
Adding Java ClassPath URL as JavaArchive jar:<https://builds.apache.org/job/DeltaSpike%20RAT-Check/ws/deltaspike/core/impl/target/deltaspike-core-impl-0.6-SNAPSHOT.jar!/META-INF/beans.xml>
Dec 16, 2013 2:51:50 AM org.apache.deltaspike.test.utils.ShrinkWrapArchiveUtil getArchives
INFO: Test org.apache.deltaspike.test.jpa.api.transactionscoped.multipleinjection.nested.NestedMultiTransactionScopedTransactionTest
Adding Java ClassPath URL as JavaArchive jar:<https://builds.apache.org/job/DeltaSpike%20RAT-Check/ws/deltaspike/modules/jpa/api/target/deltaspike-jpa-module-api-0.6-SNAPSHOT.jar!/META-INF/beans.xml>
Dec 16, 2013 2:51:50 AM org.apache.webbeans.lifecycle.AbstractLifeCycle startApplication
INFO: OpenWebBeans Container is starting...
Dec 16, 2013 2:51:50 AM org.apache.webbeans.xml.WebBeansXMLConfigurator configureInterceptorsElement
WARNING: Interceptor class : org.apache.deltaspike.jpa.impl.transaction.TransactionalInterceptor
is already defined
Dec 16, 2013 2:51:50 AM org.apache.webbeans.config.BeansDeployer validateInjectionPoints
INFO: All injection points were validated successfully.
Dec 16, 2013 2:51:50 AM org.apache.webbeans.lifecycle.AbstractLifeCycle startApplication
INFO: OpenWebBeans Container has started, it took [77] ms.
Running org.apache.deltaspike.test.jpa.api.transactionscoped.defaultinjection.DefaultTransactionScopedEntityManagerInjectionTest
Tests run: 3, Failures: 0, Errors: 0, Skipped: 0, Time elapsed: 0.014 sec
Dec 16, 2013 2:51:50 AM org.apache.deltaspike.test.utils.ShrinkWrapArchiveUtil getArchives
INFO: Test org.apache.deltaspike.test.jpa.api.transactionscoped.multipleinjection.auto.MultipleTransactionScopedEntityManagerInjectionTest
Adding Java ClassPath URL as JavaArchive <https://builds.apache.org/job/DeltaSpike%20RAT-Check/ws/deltaspike/modules/jpa/impl/target/classes/META-INF/beans.xml>
Dec 16, 2013 2:51:50 AM org.apache.deltaspike.test.utils.ShrinkWrapArchiveUtil getArchives
INFO: Test org.apache.deltaspike.test.jpa.api.transactionscoped.multipleinjection.auto.MultipleTransactionScopedEntityManagerInjectionTest
Adding Java ClassPath URL as JavaArchive jar:<https://builds.apache.org/job/DeltaSpike%20RAT-Check/ws/deltaspike/core/api/target/deltaspike-core-api-0.6-SNAPSHOT.jar!/META-INF/beans.xml>
Dec 16, 2013 2:51:50 AM org.apache.deltaspike.test.utils.ShrinkWrapArchiveUtil getArchives
INFO: Test org.apache.deltaspike.test.jpa.api.transactionscoped.multipleinjection.auto.MultipleTransactionScopedEntityManagerInjectionTest
Adding Java ClassPath URL as JavaArchive jar:<https://builds.apache.org/job/DeltaSpike%20RAT-Check/ws/deltaspike/core/impl/target/deltaspike-core-impl-0.6-SNAPSHOT.jar!/META-INF/beans.xml>
Dec 16, 2013 2:51:50 AM org.apache.deltaspike.test.utils.ShrinkWrapArchiveUtil getArchives
INFO: Test org.apache.deltaspike.test.jpa.api.transactionscoped.multipleinjection.auto.MultipleTransactionScopedEntityManagerInjectionTest
Adding Java ClassPath URL as JavaArchive jar:<https://builds.apache.org/job/DeltaSpike%20RAT-Check/ws/deltaspike/modules/jpa/api/target/deltaspike-jpa-module-api-0.6-SNAPSHOT.jar!/META-INF/beans.xml>
Dec 16, 2013 2:51:50 AM org.apache.webbeans.lifecycle.AbstractLifeCycle startApplication
INFO: OpenWebBeans Container is starting...
Dec 16, 2013 2:51:50 AM org.apache.webbeans.xml.WebBeansXMLConfigurator configureInterceptorsElement
WARNING: Interceptor class : org.apache.deltaspike.jpa.impl.transaction.TransactionalInterceptor
is already defined
Dec 16, 2013 2:51:50 AM org.apache.webbeans.config.BeansDeployer validateInjectionPoints
INFO: All injection points were validated successfully.
Dec 16, 2013 2:51:50 AM org.apache.webbeans.lifecycle.AbstractLifeCycle startApplication
INFO: OpenWebBeans Container has started, it took [88] ms.
Running org.apache.deltaspike.test.jpa.api.transactionscoped.multipleinjection.nested.NestedMultiTransactionScopedTransactionTest
Tests run: 1, Failures: 0, Errors: 0, Skipped: 0, Time elapsed: 0.01 sec
Dec 16, 2013 2:51:50 AM org.apache.deltaspike.test.utils.ShrinkWrapArchiveUtil getArchives
INFO: Test org.apache.deltaspike.test.jpa.api.transactionscoped.multipleinjection.manual.ManualTransactionScopedTransactionTest
Adding Java ClassPath URL as JavaArchive <https://builds.apache.org/job/DeltaSpike%20RAT-Check/ws/deltaspike/modules/jpa/impl/target/classes/META-INF/beans.xml>
Dec 16, 2013 2:51:50 AM org.apache.deltaspike.test.utils.ShrinkWrapArchiveUtil getArchives
INFO: Test org.apache.deltaspike.test.jpa.api.transactionscoped.multipleinjection.manual.ManualTransactionScopedTransactionTest
Adding Java ClassPath URL as JavaArchive jar:<https://builds.apache.org/job/DeltaSpike%20RAT-Check/ws/deltaspike/core/api/target/deltaspike-core-api-0.6-SNAPSHOT.jar!/META-INF/beans.xml>
Dec 16, 2013 2:51:50 AM org.apache.deltaspike.test.utils.ShrinkWrapArchiveUtil getArchives
INFO: Test org.apache.deltaspike.test.jpa.api.transactionscoped.multipleinjection.manual.ManualTransactionScopedTransactionTest
Adding Java ClassPath URL as JavaArchive jar:<https://builds.apache.org/job/DeltaSpike%20RAT-Check/ws/deltaspike/core/impl/target/deltaspike-core-impl-0.6-SNAPSHOT.jar!/META-INF/beans.xml>
Dec 16, 2013 2:51:50 AM org.apache.deltaspike.test.utils.ShrinkWrapArchiveUtil getArchives
INFO: Test org.apache.deltaspike.test.jpa.api.transactionscoped.multipleinjection.manual.ManualTransactionScopedTransactionTest
Adding Java ClassPath URL as JavaArchive jar:<https://builds.apache.org/job/DeltaSpike%20RAT-Check/ws/deltaspike/modules/jpa/api/target/deltaspike-jpa-module-api-0.6-SNAPSHOT.jar!/META-INF/beans.xml>
Dec 16, 2013 2:51:50 AM org.apache.webbeans.lifecycle.AbstractLifeCycle startApplication
INFO: OpenWebBeans Container is starting...
Dec 16, 2013 2:51:50 AM org.apache.webbeans.xml.WebBeansXMLConfigurator configureInterceptorsElement
WARNING: Interceptor class : org.apache.deltaspike.jpa.impl.transaction.TransactionalInterceptor
is already defined
Dec 16, 2013 2:51:50 AM org.apache.webbeans.config.BeansDeployer validateInjectionPoints
INFO: All injection points were validated successfully.
Dec 16, 2013 2:51:50 AM org.apache.webbeans.lifecycle.AbstractLifeCycle startApplication
INFO: OpenWebBeans Container has started, it took [67] ms.
Running org.apache.deltaspike.test.jpa.api.transactionscoped.multipleinjection.auto.MultipleTransactionScopedEntityManagerInjectionTest
Tests run: 1, Failures: 0, Errors: 0, Skipped: 0, Time elapsed: 0.008 sec
Dec 16, 2013 2:51:51 AM org.apache.deltaspike.test.utils.ShrinkWrapArchiveUtil getArchives
INFO: Test org.apache.deltaspike.test.jpa.api.transactionscoped.stereotype.StereotypeTransactionScopedTransactionalTest
Adding Java ClassPath URL as JavaArchive <https://builds.apache.org/job/DeltaSpike%20RAT-Check/ws/deltaspike/modules/jpa/impl/target/classes/META-INF/beans.xml>
Dec 16, 2013 2:51:51 AM org.apache.deltaspike.test.utils.ShrinkWrapArchiveUtil getArchives
INFO: Test org.apache.deltaspike.test.jpa.api.transactionscoped.stereotype.StereotypeTransactionScopedTransactionalTest
Adding Java ClassPath URL as JavaArchive jar:<https://builds.apache.org/job/DeltaSpike%20RAT-Check/ws/deltaspike/core/api/target/deltaspike-core-api-0.6-SNAPSHOT.jar!/META-INF/beans.xml>
Dec 16, 2013 2:51:51 AM org.apache.deltaspike.test.utils.ShrinkWrapArchiveUtil getArchives
INFO: Test org.apache.deltaspike.test.jpa.api.transactionscoped.stereotype.StereotypeTransactionScopedTransactionalTest
Adding Java ClassPath URL as JavaArchive jar:<https://builds.apache.org/job/DeltaSpike%20RAT-Check/ws/deltaspike/core/impl/target/deltaspike-core-impl-0.6-SNAPSHOT.jar!/META-INF/beans.xml>
Dec 16, 2013 2:51:51 AM org.apache.deltaspike.test.utils.ShrinkWrapArchiveUtil getArchives
INFO: Test org.apache.deltaspike.test.jpa.api.transactionscoped.stereotype.StereotypeTransactionScopedTransactionalTest
Adding Java ClassPath URL as JavaArchive jar:<https://builds.apache.org/job/DeltaSpike%20RAT-Check/ws/deltaspike/modules/jpa/api/target/deltaspike-jpa-module-api-0.6-SNAPSHOT.jar!/META-INF/beans.xml>
Dec 16, 2013 2:51:51 AM org.apache.webbeans.lifecycle.AbstractLifeCycle startApplication
INFO: OpenWebBeans Container is starting...
Dec 16, 2013 2:51:51 AM org.apache.webbeans.xml.WebBeansXMLConfigurator configureInterceptorsElement
WARNING: Interceptor class : org.apache.deltaspike.jpa.impl.transaction.TransactionalInterceptor
is already defined
Dec 16, 2013 2:51:51 AM org.apache.webbeans.config.BeansDeployer validateInjectionPoints
INFO: All injection points were validated successfully.
Dec 16, 2013 2:51:51 AM org.apache.webbeans.lifecycle.AbstractLifeCycle startApplication
INFO: OpenWebBeans Container has started, it took [66] ms.
Running org.apache.deltaspike.test.jpa.api.transactionscoped.multipleinjection.manual.ManualTransactionScopedTransactionTest
Tests run: 1, Failures: 0, Errors: 0, Skipped: 0, Time elapsed: 0.009 sec
Dec 16, 2013 2:51:51 AM org.apache.deltaspike.test.utils.ShrinkWrapArchiveUtil getArchives
INFO: Test org.apache.deltaspike.test.jpa.api.entitymanager.EntityManagerFactoryProducerTest
Adding Java ClassPath URL as JavaArchive <https://builds.apache.org/job/DeltaSpike%20RAT-Check/ws/deltaspike/modules/jpa/impl/target/classes/META-INF/beans.xml>
Dec 16, 2013 2:51:51 AM org.apache.deltaspike.test.utils.ShrinkWrapArchiveUtil getArchives
INFO: Test org.apache.deltaspike.test.jpa.api.entitymanager.EntityManagerFactoryProducerTest
Adding Java ClassPath URL as JavaArchive jar:<https://builds.apache.org/job/DeltaSpike%20RAT-Check/ws/deltaspike/core/api/target/deltaspike-core-api-0.6-SNAPSHOT.jar!/META-INF/beans.xml>
Dec 16, 2013 2:51:51 AM org.apache.deltaspike.test.utils.ShrinkWrapArchiveUtil getArchives
INFO: Test org.apache.deltaspike.test.jpa.api.entitymanager.EntityManagerFactoryProducerTest
Adding Java ClassPath URL as JavaArchive jar:<https://builds.apache.org/job/DeltaSpike%20RAT-Check/ws/deltaspike/core/impl/target/deltaspike-core-impl-0.6-SNAPSHOT.jar!/META-INF/beans.xml>
Dec 16, 2013 2:51:51 AM org.apache.deltaspike.test.utils.ShrinkWrapArchiveUtil getArchives
INFO: Test org.apache.deltaspike.test.jpa.api.entitymanager.EntityManagerFactoryProducerTest
Adding Java ClassPath URL as JavaArchive jar:<https://builds.apache.org/job/DeltaSpike%20RAT-Check/ws/deltaspike/modules/jpa/api/target/deltaspike-jpa-module-api-0.6-SNAPSHOT.jar!/META-INF/beans.xml>
Dec 16, 2013 2:51:51 AM org.apache.webbeans.lifecycle.AbstractLifeCycle startApplication
INFO: OpenWebBeans Container is starting...
Dec 16, 2013 2:51:51 AM org.apache.webbeans.xml.WebBeansXMLConfigurator configureInterceptorsElement
WARNING: Interceptor class : org.apache.deltaspike.jpa.impl.transaction.TransactionalInterceptor
is already defined
Dec 16, 2013 2:51:51 AM org.apache.webbeans.config.BeansDeployer validateInjectionPoints
INFO: All injection points were validated successfully.
Dec 16, 2013 2:51:51 AM org.apache.webbeans.lifecycle.AbstractLifeCycle startApplication
INFO: OpenWebBeans Container has started, it took [68] ms.
Running org.apache.deltaspike.test.jpa.api.transactionscoped.stereotype.StereotypeTransactionScopedTransactionalTest
Tests run: 1, Failures: 0, Errors: 0, Skipped: 0, Time elapsed: 0.008 sec
Dec 16, 2013 2:51:51 AM org.apache.deltaspike.test.utils.ShrinkWrapArchiveUtil getArchives
INFO: Test org.apache.deltaspike.test.jpa.datasource.ConfigurableDataSourceTest Adding Java
ClassPath URL as JavaArchive <https://builds.apache.org/job/DeltaSpike%20RAT-Check/ws/deltaspike/modules/jpa/impl/target/classes/META-INF/beans.xml>
Dec 16, 2013 2:51:51 AM org.apache.deltaspike.test.utils.ShrinkWrapArchiveUtil getArchives
INFO: Test org.apache.deltaspike.test.jpa.datasource.ConfigurableDataSourceTest Adding Java
ClassPath URL as JavaArchive jar:<https://builds.apache.org/job/DeltaSpike%20RAT-Check/ws/deltaspike/core/api/target/deltaspike-core-api-0.6-SNAPSHOT.jar!/META-INF/beans.xml>
Dec 16, 2013 2:51:51 AM org.apache.deltaspike.test.utils.ShrinkWrapArchiveUtil getArchives
INFO: Test org.apache.deltaspike.test.jpa.datasource.ConfigurableDataSourceTest Adding Java
ClassPath URL as JavaArchive jar:<https://builds.apache.org/job/DeltaSpike%20RAT-Check/ws/deltaspike/core/impl/target/deltaspike-core-impl-0.6-SNAPSHOT.jar!/META-INF/beans.xml>
Dec 16, 2013 2:51:51 AM org.apache.deltaspike.test.utils.ShrinkWrapArchiveUtil getArchives
INFO: Test org.apache.deltaspike.test.jpa.datasource.ConfigurableDataSourceTest Adding Java
ClassPath URL as JavaArchive jar:<https://builds.apache.org/job/DeltaSpike%20RAT-Check/ws/deltaspike/modules/jpa/api/target/deltaspike-jpa-module-api-0.6-SNAPSHOT.jar!/META-INF/beans.xml>
Dec 16, 2013 2:51:51 AM org.apache.webbeans.lifecycle.AbstractLifeCycle startApplication
INFO: OpenWebBeans Container is starting...
Dec 16, 2013 2:51:51 AM org.apache.webbeans.xml.WebBeansXMLConfigurator configureInterceptorsElement
WARNING: Interceptor class : org.apache.deltaspike.jpa.impl.transaction.TransactionalInterceptor
is already defined
Dec 16, 2013 2:51:51 AM org.apache.webbeans.config.BeansDeployer validateInjectionPoints
INFO: All injection points were validated successfully.
Dec 16, 2013 2:51:51 AM org.apache.webbeans.lifecycle.AbstractLifeCycle startApplication
INFO: OpenWebBeans Container has started, it took [77] ms.
Running org.apache.deltaspike.test.jpa.api.entitymanager.EntityManagerFactoryProducerTest
Dec 16, 2013 2:51:51 AM org.apache.deltaspike.core.api.config.PropertyLoader loadAllProperties
INFO: could not find any property files with name persistence-testPersistenceUnit
Tests run: 1, Failures: 0, Errors: 0, Skipped: 0, Time elapsed: 0.014 sec
Running org.apache.deltaspike.test.jpa.datasource.ConfigurableDataSourceTest
Tests run: 2, Failures: 0, Errors: 0, Skipped: 0, Time elapsed: 0.006 sec

Results :

Tests run: 34, Failures: 0, Errors: 0, Skipped: 0

[INFO] ------------------------------------------------------------------------
[INFO] Reactor Summary:
[INFO] 
[INFO] Apache DeltaSpike ................................. SUCCESS [1:30.175s]
[INFO] Apache DeltaSpike CheckStyle-rules ................ SUCCESS [49.479s]
[INFO] Apache DeltaSpike Parent .......................... SUCCESS [56.271s]
[INFO] Apache DeltaSpike Test-Utils ...................... SUCCESS [1:03.759s]
[INFO] Apache DeltaSpike Code Parent ..................... SUCCESS [34.786s]
[INFO] Apache DeltaSpike Core ............................ SUCCESS [29.390s]
[INFO] Apache DeltaSpike Core-API ........................ SUCCESS [1:29.171s]
[INFO] Apache DeltaSpike Core-Implementation ............. SUCCESS [1:10.819s]
[INFO] Apache DeltaSpike ContainerControl parent ......... SUCCESS [38.702s]
[INFO] Apache DeltaSpike CDI ContainerControl API ........ SUCCESS [56.209s]
[INFO] Apache DeltaSpike CDI ContainerControl TCK ........ SUCCESS [50.319s]
[INFO] Apache DeltaSpike CDI OWB-ContainerControl ........ SUCCESS [44.397s]
[INFO] Apache DeltaSpike CDI Weld-ContainerControl ....... SUCCESS [45.220s]
[INFO] Apache DeltaSpike CDI OpenEJB-ContainerControl .... SUCCESS [2:42.992s]
[INFO] Apache DeltaSpike Modules ......................... SUCCESS [54.729s]
[INFO] Apache DeltaSpike Security-Module ................. SUCCESS [42.580s]
[INFO] Apache DeltaSpike Security-Module API ............. SUCCESS [58.058s]
[INFO] Apache DeltaSpike Security-Module Impl ............ SUCCESS [2:42.540s]
[INFO] Apache DeltaSpike JPA-Module ...................... SUCCESS [37.347s]
[INFO] Apache DeltaSpike JPA-Module API .................. SUCCESS [1:00.341s]
[INFO] Apache DeltaSpike JPA-Module Impl ................. FAILURE [48.005s]
[INFO] Apache DeltaSpike Servlet-Module .................. SKIPPED
[INFO] Apache DeltaSpike Servlet-Module API .............. SKIPPED
[INFO] Apache DeltaSpike Servlet-Module Impl ............. SKIPPED
[INFO] Apache DeltaSpike JSF-Module ...................... SKIPPED
[INFO] Apache DeltaSpike JSF-Module API .................. SKIPPED
[INFO] Apache DeltaSpike JSF-Module Impl ................. SKIPPED
[INFO] Apache DeltaSpike Partial-Bean-Module ............. SKIPPED
[INFO] Apache DeltaSpike Partial-Bean-Module API ......... SKIPPED
[INFO] Apache DeltaSpike Partial-Bean-Module Impl ........ SKIPPED
[INFO] Apache DeltaSpike BeanValidation-Module ........... SKIPPED
[INFO] Apache DeltaSpike BeanValidation-Module API ....... SKIPPED
[INFO] Apache DeltaSpike BeanValidation-Module Impl ...... SKIPPED
[INFO] Apache DeltaSpike Data-Module ..................... SKIPPED
[INFO] Apache DeltaSpike Data-Module API ................. SKIPPED
[INFO] Apache DeltaSpike Data-Module Impl ................ SKIPPED
[INFO] Apache DeltaSpike Test-Control-Module ............. SKIPPED
[INFO] Apache DeltaSpike Test-Control-Module API ......... SKIPPED
[INFO] Apache DeltaSpike Test-Control-Module Impl ........ SKIPPED
[INFO] Apache DeltaSpike Examples ........................ SKIPPED
[INFO] Apache DeltaSpike Java-SE Examples ................ SKIPPED
[INFO] Apache DeltaSpike JSF Examples .................... SKIPPED
[INFO] ------------------------------------------------------------------------
[INFO] BUILD FAILURE
[INFO] ------------------------------------------------------------------------
[INFO] Total time: 28:59.196s
[INFO] Finished at: Mon Dec 16 02:52:34 UTC 2013
[INFO] Final Memory: 48M/419M
[INFO] ------------------------------------------------------------------------
[ERROR] Internal error: java.lang.IllegalStateException: Unable to call isArchivingDisabled.
Invalid object ID 45 -> [Help 1]
org.apache.maven.InternalErrorException: Internal error: java.lang.IllegalStateException:
Unable to call isArchivingDisabled. Invalid object ID 45
	at org.apache.maven.DefaultMaven.execute(DefaultMaven.java:168)
	at org.jvnet.hudson.maven3.launcher.Maven3Launcher.main(Maven3Launcher.java:117)
	at sun.reflect.NativeMethodAccessorImpl.invoke0(Native Method)
	at sun.reflect.NativeMethodAccessorImpl.invoke(NativeMethodAccessorImpl.java:39)
	at sun.reflect.DelegatingMethodAccessorImpl.invoke(DelegatingMethodAccessorImpl.java:25)
	at java.lang.reflect.Method.invoke(Method.java:597)
	at org.codehaus.plexus.classworlds.launcher.Launcher.launchStandard(Launcher.java:329)
	at org.codehaus.plexus.classworlds.launcher.Launcher.launch(Launcher.java:239)
	at org.jvnet.hudson.maven3.agent.Maven3Main.launch(Maven3Main.java:178)
	at sun.reflect.NativeMethodAccessorImpl.invoke0(Native Method)
	at sun.reflect.NativeMethodAccessorImpl.invoke(NativeMethodAccessorImpl.java:39)
	at sun.reflect.DelegatingMethodAccessorImpl.invoke(DelegatingMethodAccessorImpl.java:25)
	at java.lang.reflect.Method.invoke(Method.java:597)
	at hudson.maven.Maven3Builder.call(Maven3Builder.java:134)
	at hudson.maven.Maven3Builder.call(Maven3Builder.java:69)
	at hudson.remoting.UserRequest.perform(UserRequest.java:118)
	at hudson.remoting.UserRequest.perform(UserRequest.java:48)
	at hudson.remoting.Request$2.run(Request.java:328)
	at hudson.remoting.InterceptingExecutorService$1.call(InterceptingExecutorService.java:72)
	at java.util.concurrent.FutureTask$Sync.innerRun(FutureTask.java:303)
	at java.util.concurrent.FutureTask.run(FutureTask.java:138)
	at java.util.concurrent.ThreadPoolExecutor$Worker.runTask(ThreadPoolExecutor.java:895)
	at java.util.concurrent.ThreadPoolExecutor$Worker.run(ThreadPoolExecutor.java:918)
	at java.lang.Thread.run(Thread.java:662)
Caused by: java.lang.IllegalStateException: Unable to call isArchivingDisabled. Invalid object
ID 45
	at hudson.remoting.RemoteInvocationHandler$RPCRequest.perform(RemoteInvocationHandler.java:293)
	at hudson.remoting.RemoteInvocationHandler$RPCRequest.call(RemoteInvocationHandler.java:280)
	at hudson.remoting.RemoteInvocationHandler$RPCRequest.call(RemoteInvocationHandler.java:239)
	at hudson.remoting.UserRequest.perform(UserRequest.java:118)
	at hudson.remoting.UserRequest.perform(UserRequest.java:48)
	at hudson.remoting.Request$2.run(Request.java:328)
	at hudson.remoting.InterceptingExecutorService$1.call(InterceptingExecutorService.java:72)
	at java.util.concurrent.FutureTask.run(FutureTask.java:262)
	at java.util.concurrent.ThreadPoolExecutor.runWorker(ThreadPoolExecutor.java:1145)
	at java.util.concurrent.ThreadPoolExecutor$Worker.run(ThreadPoolExecutor.java:615)
	at java.lang.Thread.run(Thread.java:744)
[ERROR] 
[ERROR] To see the full stack trace of the errors, re-run Maven with the -e switch.
[ERROR] Re-run Maven using the -X switch to enable full debug logging.
[ERROR] 
[ERROR] For more information about the errors and possible solutions, please read the following
articles:
[ERROR] [Help 1] http://cwiki.apache.org/confluence/display/MAVEN/InternalErrorException
channel stopped

Mime
View raw message