deltaspike-commits mailing list archives

Site index · List index
Message view « Date » · « Thread »
Top « Date » · « Thread »
From Apache Jenkins Server <jenk...@builds.apache.org>
Subject Build failed in Jenkins: DeltaSpike RAT-Check #778
Date Wed, 04 Dec 2013 17:31:46 GMT
See <https://builds.apache.org/job/DeltaSpike%20RAT-Check/778/>

------------------------------------------
[...truncated 5125 lines...]
[INFO] Compiling 141 source files to <https://builds.apache.org/job/DeltaSpike%20RAT-Check/ws/deltaspike/modules/data/impl/target/classes>
[INFO] 
[INFO] --- maven-processor-plugin:2.0.7:process-test (process-test) @ deltaspike-data-module-impl
---
[INFO] Source directory: <https://builds.apache.org/job/DeltaSpike%20RAT-Check/ws/deltaspike/modules/data/impl/target/generated-sources/apt-test>
added
[INFO] javac option: -cp
[INFO] javac option: /home/jenkins/jenkins-slave/maven-repositories/0/org/hibernate/hibernate-jpamodelgen/1.2.0.Final/hibernate-jpamodelgen-1.2.0.Final.jar:/home/jenkins/jenkins-slave/maven-repositories/0/org/sonatype/sisu/sisu-inject-bean/1.4.3.1/sisu-inject-bean-1.4.3.1.jar:/home/jenkins/jenkins-slave/maven-repositories/0/org/sonatype/sisu/sisu-guice/2.9.1/sisu-guice-2.9.1-noaop.jar:/home/jenkins/jenkins-slave/maven-repositories/0/org/sonatype/aether/aether-util/1.8/aether-util-1.8.jar:/home/jenkins/jenkins-slave/maven-repositories/0/org/codehaus/plexus/plexus-interpolation/1.14/plexus-interpolation-1.14.jar:/home/jenkins/jenkins-slave/maven-repositories/0/org/codehaus/plexus/plexus-utils/2.0.4/plexus-utils-2.0.4.jar:/home/jenkins/jenkins-slave/maven-repositories/0/org/codehaus/plexus/plexus-component-annotations/1.5.5/plexus-component-annotations-1.5.5.jar:/home/jenkins/jenkins-slave/maven-repositories/0/org/sonatype/plexus/plexus-sec-dispatcher/1.3/plexus-sec-dispatcher-1.3.jar:/home/jenkins/jenkins-slave/maven-repositories/0/org/sonatype/plexus/plexus-cipher/1.4/plexus-cipher-1.4.jar:<https://builds.apache.org/job/DeltaSpike%20RAT-Check/ws/deltaspike/modules/data/impl/src/test/resources>:<https://builds.apache.org/job/DeltaSpike%20RAT-Check/ws/deltaspike/modules/data/impl/target/maven-shared-archive-resources>:<https://builds.apache.org/job/DeltaSpike%20RAT-Check/ws/deltaspike/modules/data/impl/target/test-classes>:<https://builds.apache.org/job/DeltaSpike%20RAT-Check/ws/deltaspike/modules/data/impl/target/classes>:/home/jenkins/jenkins-slave/maven-repositories/0/org/apache/geronimo/specs/geronimo-jpa_2.0_spec/1.1/geronimo-jpa_2.0_spec-1.1.jar:/home/jenkins/jenkins-slave/maven-repositories/0/org/apache/geronimo/specs/geronimo-jta_1.1_spec/1.1.1/geronimo-jta_1.1_spec-1.1.1.jar:<https://builds.apache.org/job/DeltaSpike%20RAT-Check/ws/deltaspike/modules/data/api/target/deltaspike-data-module-api-0.6-SNAPSHOT.jar>:<https://builds.apache.org/job/DeltaSpike%20RAT-Check/ws/deltaspike/core/api/target/deltaspike-core-api-0.6-SNAPSHOT.jar>:<https://builds.apache.org/job/DeltaSpike%20RAT-Check/ws/deltaspike/modules/partial-bean/api/target/deltaspike-partial-bean-module-api-0.6-SNAPSHOT.jar>:<https://builds.apache.org/job/DeltaSpike%20RAT-Check/ws/deltaspike/core/impl/target/deltaspike-core-impl-0.6-SNAPSHOT.jar>:<https://builds.apache.org/job/DeltaSpike%20RAT-Check/ws/deltaspike/modules/partial-bean/impl/target/deltaspike-partial-bean-module-impl-0.6-SNAPSHOT.jar>:/home/jenkins/jenkins-slave/maven-repositories/0/org/jboss/shrinkwrap/resolver/shrinkwrap-resolver-impl-maven/2.0.0/shrinkwrap-resolver-impl-maven-2.0.0.jar:/home/jenkins/jenkins-slave/maven-repositories/0/org/jboss/shrinkwrap/resolver/shrinkwrap-resolver-api-maven/2.0.0/shrinkwrap-resolver-api-maven-2.0.0.jar:/home/jenkins/jenkins-slave/maven-repositories/0/org/jboss/shrinkwrap/resolver/shrinkwrap-resolver-api/2.0.0/shrinkwrap-resolver-api-2.0.0.jar:/home/jenkins/jenkins-slave/maven-repositories/0/org/jboss/shrinkwrap/resolver/shrinkwrap-resolver-spi-maven/2.0.0/shrinkwrap-resolver-spi-maven-2.0.0.jar:/home/jenkins/jenkins-slave/maven-repositories/0/org/jboss/shrinkwrap/resolver/shrinkwrap-resolver-spi/2.0.0/shrinkwrap-resolver-spi-2.0.0.jar:/home/jenkins/jenkins-slave/maven-repositories/0/org/sonatype/aether/aether-api/1.13.1/aether-api-1.13.1.jar:/home/jenkins/jenkins-slave/maven-repositories/0/org/sonatype/aether/aether-impl/1.13.1/aether-impl-1.13.1.jar:/home/jenkins/jenkins-slave/maven-repositories/0/org/sonatype/aether/aether-spi/1.13.1/aether-spi-1.13.1.jar:/home/jenkins/jenkins-slave/maven-repositories/0/org/sonatype/aether/aether-util/1.13.1/aether-util-1.13.1.jar:/home/jenkins/jenkins-slave/maven-repositories/0/org/sonatype/aether/aether-connector-wagon/1.13.1/aether-connector-wagon-1.13.1.jar:/home/jenkins/jenkins-slave/maven-repositories/0/org/apache/maven/maven-aether-provider/3.0.5/maven-aether-provider-3.0.5.jar:/home/jenkins/jenkins-slave/maven-repositories/0/org/apache/maven/maven-model/3.0.5/maven-model-3.0.5.jar:/home/jenkins/jenkins-slave/maven-repositories/0/org/apache/maven/maven-model-builder/3.0.5/maven-model-builder-3.0.5.jar:/home/jenkins/jenkins-slave/maven-repositories/0/org/apache/maven/maven-repository-metadata/3.0.5/maven-repository-metadata-3.0.5.jar:/home/jenkins/jenkins-slave/maven-repositories/0/org/apache/maven/maven-settings/3.0.5/maven-settings-3.0.5.jar:/home/jenkins/jenkins-slave/maven-repositories/0/org/apache/maven/maven-settings-builder/3.0.5/maven-settings-builder-3.0.5.jar:/home/jenkins/jenkins-slave/maven-repositories/0/org/codehaus/plexus/plexus-utils/2.0.6/plexus-utils-2.0.6.jar:/home/jenkins/jenkins-slave/maven-repositories/0/org/sonatype/plexus/plexus-sec-dispatcher/1.4/plexus-sec-dispatcher-1.4.jar:/home/jenkins/jenkins-slave/maven-repositories/0/org/apache/maven/wagon/wagon-provider-api/2.4/wagon-provider-api-2.4.jar:/home/jenkins/jenkins-slave/maven-repositories/0/org/apache/maven/wagon/wagon-file/2.4/wagon-file-2.4.jar:/home/jenkins/jenkins-slave/maven-repositories/0/org/apache/maven/wagon/wagon-http-lightweight/2.4/wagon-http-lightweight-2.4.jar:/home/jenkins/jenkins-slave/maven-repositories/0/org/apache/maven/wagon/wagon-http-shared4/2.4/wagon-http-shared4-2.4.jar:/home/jenkins/jenkins-slave/maven-repositories/0/org/jsoup/jsoup/1.7.1/jsoup-1.7.1.jar:/home/jenkins/jenkins-slave/maven-repositories/0/org/apache/httpcomponents/httpcore/4.2.3/httpcore-4.2.3.jar:/home/jenkins/jenkins-slave/maven-repositories/0/commons-io/commons-io/2.0.1/commons-io-2.0.1.jar:<https://builds.apache.org/job/DeltaSpike%20RAT-Check/ws/deltaspike/test-utils/target/test-utils-0.6-SNAPSHOT.jar>:/home/jenkins/jenkins-slave/maven-repositories/0/org/jboss/shrinkwrap/shrinkwrap-api/1.0.1/shrinkwrap-api-1.0.1.jar:/home/jenkins/jenkins-slave/maven-repositories/0/org/apache/geronimo/specs/geronimo-atinject_1.0_spec/1.0/geronimo-atinject_1.0_spec-1.0.jar:/home/jenkins/jenkins-slave/maven-repositories/0/org/apache/geronimo/specs/geronimo-jcdi_1.0_spec/1.0/geronimo-jcdi_1.0_spec-1.0.jar:/home/jenkins/jenkins-slave/maven-repositories/0/org/apache/geronimo/specs/geronimo-interceptor_1.1_spec/1.0/geronimo-interceptor_1.1_spec-1.0.jar:/home/jenkins/jenkins-slave/maven-repositories/0/org/apache/openwebbeans/openwebbeans-impl/1.1.8/openwebbeans-impl-1.1.8.jar:/home/jenkins/jenkins-slave/maven-repositories/0/javassist/javassist/3.12.0.GA/javassist-3.12.0.GA.jar:/home/jenkins/jenkins-slave/maven-repositories/0/net/sf/scannotation/scannotation/1.0.2/scannotation-1.0.2.jar:/home/jenkins/jenkins-slave/maven-repositories/0/org/apache/openwebbeans/openwebbeans-spi/1.1.8/openwebbeans-spi-1.1.8.jar:/home/jenkins/jenkins-slave/maven-repositories/0/org/apache/openwebbeans/openwebbeans-resource/1.1.8/openwebbeans-resource-1.1.8.jar:/home/jenkins/jenkins-slave/maven-repositories/0/org/apache/openwebbeans/arquillian/owb-arquillian-standalone/1.2.0/owb-arquillian-standalone-1.2.0.jar:/home/jenkins/jenkins-slave/maven-repositories/0/org/jboss/arquillian/container/arquillian-container-spi/1.0.2.Final/arquillian-container-spi-1.0.2.Final.jar:/home/jenkins/jenkins-slave/maven-repositories/0/org/jboss/arquillian/core/arquillian-core-spi/1.0.2.Final/arquillian-core-spi-1.0.2.Final.jar:/home/jenkins/jenkins-slave/maven-repositories/0/org/jboss/arquillian/config/arquillian-config-api/1.0.2.Final/arquillian-config-api-1.0.2.Final.jar:/home/jenkins/jenkins-slave/maven-repositories/0/org/jboss/arquillian/config/arquillian-config-impl-base/1.0.2.Final/arquillian-config-impl-base-1.0.2.Final.jar:/home/jenkins/jenkins-slave/maven-repositories/0/org/jboss/shrinkwrap/descriptors/shrinkwrap-descriptors-api-base/2.0.0-alpha-3/shrinkwrap-descriptors-api-base-2.0.0-alpha-3.jar:/home/jenkins/jenkins-slave/maven-repositories/0/org/jboss/arquillian/test/arquillian-test-spi/1.0.2.Final/arquillian-test-spi-1.0.2.Final.jar:/home/jenkins/jenkins-slave/maven-repositories/0/org/jboss/arquillian/testenricher/arquillian-testenricher-cdi/1.0.2.Final/arquillian-testenricher-cdi-1.0.2.Final.jar:/home/jenkins/jenkins-slave/maven-repositories/0/org/apache/bval/bval-jsr303/0.5/bval-jsr303-0.5.jar:/home/jenkins/jenkins-slave/maven-repositories/0/org/apache/bval/bval-core/0.5/bval-core-0.5.jar:/home/jenkins/jenkins-slave/maven-repositories/0/commons-beanutils/commons-beanutils-core/1.8.3/commons-beanutils-core-1.8.3.jar:/home/jenkins/jenkins-slave/maven-repositories/0/org/apache/commons/commons-lang3/3.1/commons-lang3-3.1.jar:/home/jenkins/jenkins-slave/maven-repositories/0/junit/junit/4.10/junit-4.10.jar:/home/jenkins/jenkins-slave/maven-repositories/0/org/hamcrest/hamcrest-core/1.1/hamcrest-core-1.1.jar:/home/jenkins/jenkins-slave/maven-repositories/0/org/jboss/arquillian/junit/arquillian-junit-container/1.0.2.Final/arquillian-junit-container-1.0.2.Final.jar:/home/jenkins/jenkins-slave/maven-repositories/0/org/jboss/arquillian/junit/arquillian-junit-core/1.0.2.Final/arquillian-junit-core-1.0.2.Final.jar:/home/jenkins/jenkins-slave/maven-repositories/0/org/jboss/arquillian/test/arquillian-test-api/1.0.2.Final/arquillian-test-api-1.0.2.Final.jar:/home/jenkins/jenkins-slave/maven-repositories/0/org/jboss/arquillian/core/arquillian-core-api/1.0.2.Final/arquillian-core-api-1.0.2.Final.jar:/home/jenkins/jenkins-slave/maven-repositories/0/org/jboss/arquillian/container/arquillian-container-test-api/1.0.2.Final/arquillian-container-test-api-1.0.2.Final.jar:/home/jenkins/jenkins-slave/maven-repositories/0/org/jboss/arquillian/container/arquillian-container-test-spi/1.0.2.Final/arquillian-container-test-spi-1.0.2.Final.jar:/home/jenkins/jenkins-slave/maven-repositories/0/org/jboss/arquillian/core/arquillian-core-impl-base/1.0.2.Final/arquillian-core-impl-base-1.0.2.Final.jar:/home/jenkins/jenkins-slave/maven-repositories/0/org/jboss/arquillian/test/arquillian-test-impl-base/1.0.2.Final/arquillian-test-impl-base-1.0.2.Final.jar:/home/jenkins/jenkins-slave/maven-repositories/0/org/jboss/arquillian/container/arquillian-container-impl-base/1.0.2.Final/arquillian-container-impl-base-1.0.2.Final.jar:/home/jenkins/jenkins-slave/maven-repositories/0/org/jboss/shrinkwrap/descriptors/shrinkwrap-descriptors-spi/2.0.0-alpha-3/shrinkwrap-descriptors-spi-2.0.0-alpha-3.jar:/home/jenkins/jenkins-slave/maven-repositories/0/org/jboss/arquillian/container/arquillian-container-test-impl-base/1.0.2.Final/arquillian-container-test-impl-base-1.0.2.Final.jar:/home/jenkins/jenkins-slave/maven-repositories/0/org/jboss/shrinkwrap/shrinkwrap-impl-base/1.0.1/shrinkwrap-impl-base-1.0.1.jar:/home/jenkins/jenkins-slave/maven-repositories/0/org/jboss/shrinkwrap/shrinkwrap-spi/1.0.1/shrinkwrap-spi-1.0.1.jar:
[INFO] javac option: -proc:only
[INFO] javac option: -processor
[INFO] javac option: org.hibernate.jpamodelgen.JPAMetaModelEntityProcessor
[INFO] javac option: -d
[INFO] javac option: <https://builds.apache.org/job/DeltaSpike%20RAT-Check/ws/deltaspike/modules/data/impl/target/test-classes>
[INFO] javac option: -s
[INFO] javac option: <https://builds.apache.org/job/DeltaSpike%20RAT-Check/ws/deltaspike/modules/data/impl/target/generated-sources/apt-test>
[INFO] diagnostic <https://builds.apache.org/job/DeltaSpike%20RAT-Check/ws/deltaspike/modules/data/impl/src/test/java/org/apache/deltaspike/data/test/service/SimpleCriteriaRepository.java>:27:
cannot find symbol
symbol  : class Simple_
location: package org.apache.deltaspike.data.test.domain
[INFO] diagnostic <https://builds.apache.org/job/DeltaSpike%20RAT-Check/ws/deltaspike/modules/data/impl/src/test/java/org/apache/deltaspike/data/test/service/ParentRepository.java>:29:
cannot find symbol
symbol  : class OneToMany_
location: package org.apache.deltaspike.data.test.domain
[INFO] diagnostic <https://builds.apache.org/job/DeltaSpike%20RAT-Check/ws/deltaspike/modules/data/impl/src/test/java/org/apache/deltaspike/data/test/service/ParentRepository.java>:31:
cannot find symbol
symbol  : class OneToOne_
location: package org.apache.deltaspike.data.test.domain
[INFO] diagnostic <https://builds.apache.org/job/DeltaSpike%20RAT-Check/ws/deltaspike/modules/data/impl/src/test/java/org/apache/deltaspike/data/test/service/ParentRepository.java>:33:
cannot find symbol
symbol  : class Parent_
location: package org.apache.deltaspike.data.test.domain
[INFO] diagnostic <https://builds.apache.org/job/DeltaSpike%20RAT-Check/ws/deltaspike/modules/data/impl/src/test/java/org/apache/deltaspike/data/impl/mapping/MappedRepositoryTest.java>:34:
cannot find symbol
symbol  : class Simple_
location: package org.apache.deltaspike.data.test.domain
[INFO] diagnostic <https://builds.apache.org/job/DeltaSpike%20RAT-Check/ws/deltaspike/modules/data/impl/src/test/java/org/apache/deltaspike/data/impl/QueryResultTest.java>:42:
cannot find symbol
symbol  : class Simple_
location: package org.apache.deltaspike.data.test.domain
[INFO] diagnostic <https://builds.apache.org/job/DeltaSpike%20RAT-Check/ws/deltaspike/modules/data/impl/src/test/java/org/apache/deltaspike/data/impl/handler/EntityRepositoryHandlerTest.java>:36:
cannot find symbol
symbol  : class Simple_
location: package org.apache.deltaspike.data.test.domain
[INFO] diagnostic Note: Hibernate JPA 2 Static-Metamodel Generator 1.2.0.Final
[INFO] 
[INFO] --- maven-resources-plugin:2.5:testResources (default-testResources) @ deltaspike-data-module-impl
---
[debug] execute contextualize
[INFO] Using 'UTF-8' encoding to copy filtered resources.
[INFO] Copying 6 resources
[INFO] Copying 4 resources
[INFO] Copying 4 resources
[INFO] 
[INFO] --- maven-compiler-plugin:2.5:testCompile (default-testCompile) @ deltaspike-data-module-impl
---
[INFO] Compiling 84 source files to <https://builds.apache.org/job/DeltaSpike%20RAT-Check/ws/deltaspike/modules/data/impl/target/test-classes>
[INFO] 
[INFO] --- maven-surefire-plugin:2.11:test (default-test) @ deltaspike-data-module-impl ---
[INFO] Surefire report directory: <https://builds.apache.org/job/DeltaSpike%20RAT-Check/ws/deltaspike/modules/data/impl/target/surefire-reports>
[INFO] Using configured provider org.apache.maven.surefire.junitcore.JUnitCoreProvider

-------------------------------------------------------
 T E S T S
-------------------------------------------------------
Concurrency config is parallel='none', perCoreThreadCount=true, threadCount=2, useUnlimitedThreads=false
Running org.apache.deltaspike.data.impl.builder.part.QueryRootTest
Tests run: 7, Failures: 0, Errors: 0, Skipped: 0, Time elapsed: 0.032 sec
Running org.apache.deltaspike.data.impl.util.EntityUtilsTest
Tests run: 2, Failures: 0, Errors: 0, Skipped: 0, Time elapsed: 0.009 sec
Running org.apache.deltaspike.data.impl.property.PropertyFromMethodTest
Tests run: 13, Failures: 0, Errors: 0, Skipped: 0, Time elapsed: 0.004 sec
Running org.apache.deltaspike.data.impl.property.query.PropertyQueryTest
Tests run: 3, Failures: 0, Errors: 0, Skipped: 0, Time elapsed: 0.002 sec
Running org.apache.deltaspike.data.impl.property.PropertyFromFieldTest
Tests run: 1, Failures: 0, Errors: 0, Skipped: 0, Time elapsed: 0.002 sec
Running org.apache.deltaspike.data.impl.audit.TimestampsProviderTest
Tests run: 4, Failures: 0, Errors: 0, Skipped: 0, Time elapsed: 0.03 sec
Running org.apache.deltaspike.data.impl.meta.unit.DescriptorHierarchyBuilderTest
Tests run: 1, Failures: 0, Errors: 0, Skipped: 0, Time elapsed: 0.004 sec
Running org.apache.deltaspike.data.impl.meta.verifier.EntityVerifierTest
Tests run: 2, Failures: 0, Errors: 0, Skipped: 0, Time elapsed: 0.002 sec
Running org.apache.deltaspike.data.impl.meta.extractor.AnnotationMetadataExtractorTest
Tests run: 3, Failures: 0, Errors: 0, Skipped: 0, Time elapsed: 0.001 sec
Running org.apache.deltaspike.data.impl.meta.extractor.TypeMetadataExtractorTest
Tests run: 2, Failures: 0, Errors: 0, Skipped: 0, Time elapsed: 0.002 sec

Results :

Tests run: 38, Failures: 0, Errors: 0, Skipped: 0

[JENKINS] Recording test results
[INFO] 
[INFO] --- maven-bundle-plugin:2.3.7:bundle (default-bundle) @ deltaspike-data-module-impl
---
[WARNING] Bundle org.apache.deltaspike.modules:deltaspike-data-module-impl:bundle:0.6-SNAPSHOT
: Did not find matching referal for !org.apache.deltaspike.data.impl.*
[INFO] 
[INFO] --- maven-site-plugin:3.1:attach-descriptor (attach-descriptor) @ deltaspike-data-module-impl
---
[INFO] 
[INFO] --- maven-jar-plugin:2.4:test-jar (default) @ deltaspike-data-module-impl ---
[INFO] Building jar: <https://builds.apache.org/job/DeltaSpike%20RAT-Check/ws/deltaspike/modules/data/impl/target/deltaspike-data-module-impl-0.6-SNAPSHOT-tests.jar>
[INFO] 
[INFO] --- apache-rat-plugin:0.8:check (default) @ deltaspike-data-module-impl ---
[INFO] Exclude: .idea/**/*
[INFO] Exclude: readme/**/*
[INFO] Exclude: **/*.log
[INFO] 
[INFO] --- maven-bundle-plugin:2.3.7:cleanVersions (versions) @ deltaspike-data-module-impl
---
[INFO] 
[INFO] --- maven-antrun-plugin:1.6:run (javadoc.resources) @ deltaspike-data-module-impl ---
[WARNING] Parameter tasks is deprecated, use target instead
[INFO] Executing tasks

main:
[INFO] Executed tasks
[WARNING] Failed to getClass for org.apache.maven.plugin.source.SourceJarMojo
[INFO] 
[INFO] --- maven-source-plugin:2.1.2:jar (attach-sources) @ deltaspike-data-module-impl ---
[INFO] META-INF already added, skipping
[INFO] META-INF/DISCLAIMER already added, skipping
[INFO] META-INF/LICENSE already added, skipping
[INFO] META-INF/NOTICE already added, skipping
[INFO] META-INF/DEPENDENCIES already added, skipping
[INFO] META-INF already added, skipping
[INFO] META-INF already added, skipping
[INFO] META-INF/DISCLAIMER already added, skipping
[INFO] META-INF/LICENSE already added, skipping
[INFO] META-INF/NOTICE already added, skipping
[INFO] META-INF/DEPENDENCIES already added, skipping
[INFO] META-INF already added, skipping
[INFO] META-INF/DISCLAIMER already added, skipping
[INFO] META-INF/LICENSE already added, skipping
[INFO] META-INF/NOTICE already added, skipping
[INFO] META-INF/DEPENDENCIES already added, skipping
[INFO] Building jar: <https://builds.apache.org/job/DeltaSpike%20RAT-Check/ws/deltaspike/modules/data/impl/target/deltaspike-data-module-impl-0.6-SNAPSHOT-sources.jar>
[INFO] META-INF already added, skipping
[INFO] META-INF/DISCLAIMER already added, skipping
[INFO] META-INF/LICENSE already added, skipping
[INFO] META-INF/NOTICE already added, skipping
[INFO] META-INF/DEPENDENCIES already added, skipping
[INFO] META-INF already added, skipping
[INFO] META-INF already added, skipping
[INFO] META-INF/DISCLAIMER already added, skipping
[INFO] META-INF/LICENSE already added, skipping
[INFO] META-INF/NOTICE already added, skipping
[INFO] META-INF/DEPENDENCIES already added, skipping
[INFO] META-INF already added, skipping
[INFO] META-INF/DISCLAIMER already added, skipping
[INFO] META-INF/LICENSE already added, skipping
[INFO] META-INF/NOTICE already added, skipping
[INFO] META-INF/DEPENDENCIES already added, skipping
[INFO] 
[INFO] --- maven-checkstyle-plugin:2.9.1:check (verify-style) @ deltaspike-data-module-impl
---
[INFO] Starting audit...
Audit done.

[INFO] 
[INFO] --- maven-install-plugin:2.3.1:install (default-install) @ deltaspike-data-module-impl
---
[INFO] Installing <https://builds.apache.org/job/DeltaSpike%20RAT-Check/ws/deltaspike/modules/data/impl/target/deltaspike-data-module-impl-0.6-SNAPSHOT.jar>
to /home/jenkins/jenkins-slave/maven-repositories/0/org/apache/deltaspike/modules/deltaspike-data-module-impl/0.6-SNAPSHOT/deltaspike-data-module-impl-0.6-SNAPSHOT.jar
[INFO] Installing <https://builds.apache.org/job/DeltaSpike%20RAT-Check/ws/deltaspike/modules/data/impl/pom.xml>
to /home/jenkins/jenkins-slave/maven-repositories/0/org/apache/deltaspike/modules/deltaspike-data-module-impl/0.6-SNAPSHOT/deltaspike-data-module-impl-0.6-SNAPSHOT.pom
[INFO] Installing <https://builds.apache.org/job/DeltaSpike%20RAT-Check/ws/deltaspike/modules/data/impl/target/deltaspike-data-module-impl-0.6-SNAPSHOT-tests.jar>
to /home/jenkins/jenkins-slave/maven-repositories/0/org/apache/deltaspike/modules/deltaspike-data-module-impl/0.6-SNAPSHOT/deltaspike-data-module-impl-0.6-SNAPSHOT-tests.jar
[INFO] Installing <https://builds.apache.org/job/DeltaSpike%20RAT-Check/ws/deltaspike/modules/data/impl/target/deltaspike-data-module-impl-0.6-SNAPSHOT-sources.jar>
to /home/jenkins/jenkins-slave/maven-repositories/0/org/apache/deltaspike/modules/deltaspike-data-module-impl/0.6-SNAPSHOT/deltaspike-data-module-impl-0.6-SNAPSHOT-sources.jar
[INFO] 
[INFO] --- maven-bundle-plugin:2.3.7:install (default-install) @ deltaspike-data-module-impl
---
[INFO] Installing org/apache/deltaspike/modules/deltaspike-data-module-impl/0.6-SNAPSHOT/deltaspike-data-module-impl-0.6-SNAPSHOT.jar
[INFO] Writing OBR metadata
Build timed out (after 30 minutes). Marking the build as failed.
[INFO] ------------------------------------------------------------------------
[INFO] Reactor Summary:
[INFO] 
[INFO] Apache DeltaSpike ................................. SUCCESS [35.578s]
[INFO] Apache DeltaSpike CheckStyle-rules ................ SUCCESS [13.181s]
[INFO] Apache DeltaSpike Parent .......................... SUCCESS [17.163s]
[INFO] Apache DeltaSpike Test-Utils ...................... SUCCESS [20.160s]
[INFO] Apache DeltaSpike Code Parent ..................... SUCCESS [14.939s]
[INFO] Apache DeltaSpike Core ............................ SUCCESS [18.756s]
[INFO] Apache DeltaSpike Core-API ........................ SUCCESS [27.066s]
[INFO] Apache DeltaSpike Core-Implementation ............. SUCCESS [29.611s]
[INFO] Apache DeltaSpike ContainerControl parent ......... SUCCESS [17.526s]
[INFO] Apache DeltaSpike CDI ContainerControl API ........ SUCCESS [13.820s]
[INFO] Apache DeltaSpike CDI ContainerControl TCK ........ SUCCESS [16.802s]
[INFO] Apache DeltaSpike CDI OWB-ContainerControl ........ SUCCESS [16.492s]
[INFO] Apache DeltaSpike CDI Weld-ContainerControl ....... SUCCESS [25.542s]
[INFO] Apache DeltaSpike CDI OpenEJB-ContainerControl .... SUCCESS [23.997s]
[INFO] Apache DeltaSpike Modules ......................... SUCCESS [14.987s]
[INFO] Apache DeltaSpike Security-Module ................. SUCCESS [15.373s]
[INFO] Apache DeltaSpike Security-Module API ............. SUCCESS [15.286s]
[INFO] Apache DeltaSpike Security-Module Impl ............ SUCCESS [19.308s]
[INFO] Apache DeltaSpike JPA-Module ...................... SUCCESS [17.094s]
[INFO] Apache DeltaSpike JPA-Module API .................. SUCCESS [18.741s]
[INFO] Apache DeltaSpike JPA-Module Impl ................. SUCCESS [30.337s]
[INFO] Apache DeltaSpike Servlet-Module .................. SUCCESS [11.669s]
[INFO] Apache DeltaSpike Servlet-Module API .............. SUCCESS [9.424s]
[INFO] Apache DeltaSpike Servlet-Module Impl ............. SUCCESS [11.418s]
[INFO] Apache DeltaSpike JSF-Module ...................... SUCCESS [21.694s]
[INFO] Apache DeltaSpike JSF-Module API .................. SUCCESS [14.821s]
[INFO] Apache DeltaSpike JSF-Module Impl ................. SUCCESS [23.092s]
[INFO] Apache DeltaSpike Partial-Bean-Module ............. SUCCESS [11.029s]
[INFO] Apache DeltaSpike Partial-Bean-Module API ......... SUCCESS [13.318s]
[INFO] Apache DeltaSpike Partial-Bean-Module Impl ........ SUCCESS [16.978s]
[INFO] Apache DeltaSpike BeanValidation-Module ........... SUCCESS [8.631s]
[INFO] Apache DeltaSpike BeanValidation-Module API ....... SUCCESS [7.894s]
[INFO] Apache DeltaSpike BeanValidation-Module Impl ...... SUCCESS [14.420s]
[INFO] Apache DeltaSpike Data-Module ..................... SUCCESS [7.866s]
[INFO] Apache DeltaSpike Data-Module API ................. SUCCESS [12.657s]
[INFO] Apache DeltaSpike Data-Module Impl ................ SUCCESS [21.839s]
[INFO] Apache DeltaSpike Examples ........................ FAILURE [3.503s]
[INFO] Apache DeltaSpike Java-SE Examples ................ SKIPPED
[INFO] Apache DeltaSpike JSF Examples .................... SKIPPED
[INFO] ------------------------------------------------------------------------
[INFO] BUILD FAILURE
[INFO] ------------------------------------------------------------------------
[INFO] Total time: 29:12.649s
[INFO] Finished at: Wed Dec 04 17:31:04 UTC 2013
[INFO] Final Memory: 66M/393M
[INFO] ------------------------------------------------------------------------
[ERROR] Internal error: java.lang.IllegalStateException: Unable to call isArchivingDisabled.
Invalid object ID 43 -> [Help 1]
org.apache.maven.InternalErrorException: Internal error: java.lang.IllegalStateException:
Unable to call isArchivingDisabled. Invalid object ID 43
	at org.apache.maven.DefaultMaven.execute(DefaultMaven.java:168)
	at org.jvnet.hudson.maven3.launcher.Maven3Launcher.main(Maven3Launcher.java:117)
	at sun.reflect.NativeMethodAccessorImpl.invoke0(Native Method)
	at sun.reflect.NativeMethodAccessorImpl.invoke(NativeMethodAccessorImpl.java:39)
	at sun.reflect.DelegatingMethodAccessorImpl.invoke(DelegatingMethodAccessorImpl.java:25)
	at java.lang.reflect.Method.invoke(Method.java:597)
	at org.codehaus.plexus.classworlds.launcher.Launcher.launchStandard(Launcher.java:329)
	at org.codehaus.plexus.classworlds.launcher.Launcher.launch(Launcher.java:239)
	at org.jvnet.hudson.maven3.agent.Maven3Main.launch(Maven3Main.java:178)
	at sun.reflect.NativeMethodAccessorImpl.invoke0(Native Method)
	at sun.reflect.NativeMethodAccessorImpl.invoke(NativeMethodAccessorImpl.java:39)
	at sun.reflect.DelegatingMethodAccessorImpl.invoke(DelegatingMethodAccessorImpl.java:25)
	at java.lang.reflect.Method.invoke(Method.java:597)
	at hudson.maven.Maven3Builder.call(Maven3Builder.java:134)
	at hudson.maven.Maven3Builder.call(Maven3Builder.java:69)
	at hudson.remoting.UserRequest.perform(UserRequest.java:118)
	at hudson.remoting.UserRequest.perform(UserRequest.java:48)
	at hudson.remoting.Request$2.run(Request.java:328)
	at hudson.remoting.InterceptingExecutorService$1.call(InterceptingExecutorService.java:72)
	at java.util.concurrent.FutureTask$Sync.innerRun(FutureTask.java:303)
	at java.util.concurrent.FutureTask.run(FutureTask.java:138)
	at java.util.concurrent.ThreadPoolExecutor$Worker.runTask(ThreadPoolExecutor.java:895)
	at java.util.concurrent.ThreadPoolExecutor$Worker.run(ThreadPoolExecutor.java:918)
	at java.lang.Thread.run(Thread.java:662)
Caused by: java.lang.IllegalStateException: Unable to call isArchivingDisabled. Invalid object
ID 43
	at hudson.remoting.RemoteInvocationHandler$RPCRequest.perform(RemoteInvocationHandler.java:293)
	at hudson.remoting.RemoteInvocationHandler$RPCRequest.call(RemoteInvocationHandler.java:280)
	at hudson.remoting.RemoteInvocationHandler$RPCRequest.call(RemoteInvocationHandler.java:239)
	at hudson.remoting.UserRequest.perform(UserRequest.java:118)
	at hudson.remoting.UserRequest.perform(UserRequest.java:48)
	at hudson.remoting.Request$2.run(Request.java:328)
	at hudson.remoting.InterceptingExecutorService$1.call(InterceptingExecutorService.java:72)
	at java.util.concurrent.FutureTask$Sync.innerRun(FutureTask.java:334)
	at java.util.concurrent.FutureTask.run(FutureTask.java:166)
	at java.util.concurrent.ThreadPoolExecutor.runWorker(ThreadPoolExecutor.java:1145)
	at java.util.concurrent.ThreadPoolExecutor$Worker.run(ThreadPoolExecutor.java:615)
	at java.lang.Thread.run(Thread.java:724)
[ERROR] 
[ERROR] To see the full stack trace of the errors, re-run Maven with the -e switch.
[ERROR] Re-run Maven using the -X switch to enable full debug logging.
[ERROR] 
[ERROR] For more information about the errors and possible solutions, please read the following
articles:
[ERROR] [Help 1] http://cwiki.apache.org/confluence/display/MAVEN/InternalErrorException
channel stopped

Mime
View raw message