deltaspike-commits mailing list archives

Site index · List index
Message view « Date » · « Thread »
Top « Date » · « Thread »
From Apache Jenkins Server <jenk...@builds.apache.org>
Subject Build failed in Jenkins: DeltaSpike RAT-Check #800
Date Thu, 19 Dec 2013 04:23:28 GMT
See <https://builds.apache.org/job/DeltaSpike%20RAT-Check/800/>

------------------------------------------
[...truncated 1867 lines...]
[INFO] Using configured provider org.apache.maven.surefire.junitcore.JUnitCoreProvider

-------------------------------------------------------
 T E S T S
-------------------------------------------------------
Concurrency config is parallel='none', perCoreThreadCount=true, threadCount=2, useUnlimitedThreads=false
Running org.apache.deltaspike.cdise.tck.ContainerCtrlTckTest
29 [main] INFO org.jboss.weld.Version - WELD-000900 1.1.10 (Final)
158 [main] INFO org.jboss.weld.Bootstrap - WELD-000101 Transactional services not available.
Injection of @Inject UserTransaction not available. Transactional observers will be invoked
synchronously.
447 [main] WARN org.jboss.weld.interceptor.util.InterceptionTypeRegistry - Class 'javax.ejb.PostActivate'
not found, interception based on it is not enabled
447 [main] WARN org.jboss.weld.interceptor.util.InterceptionTypeRegistry - Class 'javax.ejb.PrePassivate'
not found, interception based on it is not enabled
627 [main] INFO org.jboss.weld.Bootstrap - WELD-000101 Transactional services not available.
Injection of @Inject UserTransaction not available. Transactional observers will be invoked
synchronously.
715 [main] INFO org.jboss.weld.Bootstrap - WELD-000101 Transactional services not available.
Injection of @Inject UserTransaction not available. Transactional observers will be invoked
synchronously.
799 [main] INFO org.jboss.weld.Bootstrap - WELD-000101 Transactional services not available.
Injection of @Inject UserTransaction not available. Transactional observers will be invoked
synchronously.
Tests run: 4, Failures: 0, Errors: 0, Skipped: 0, Time elapsed: 0.917 sec

Results :

Tests run: 4, Failures: 0, Errors: 0, Skipped: 0

[INFO] 
[INFO] --- maven-jar-plugin:2.4:jar (default-jar) @ deltaspike-cdictrl-weld ---
[INFO] Building jar: <https://builds.apache.org/job/DeltaSpike%20RAT-Check/ws/deltaspike/cdictrl/impl-weld/target/deltaspike-cdictrl-weld-0.6-SNAPSHOT.jar>
[INFO] 
[INFO] --- maven-site-plugin:3.1:attach-descriptor (attach-descriptor) @ deltaspike-cdictrl-weld
---
[INFO] 
[INFO] --- apache-rat-plugin:0.8:check (default) @ deltaspike-cdictrl-weld ---
[INFO] Exclude: .idea/**/*
[INFO] Exclude: readme/**/*
[INFO] Exclude: **/*.log
[INFO] 
[INFO] --- maven-bundle-plugin:2.3.7:cleanVersions (versions) @ deltaspike-cdictrl-weld ---
[INFO] 
[INFO] --- maven-antrun-plugin:1.6:run (javadoc.resources) @ deltaspike-cdictrl-weld ---
[WARNING] Parameter tasks is deprecated, use target instead
[INFO] Executing tasks

main:
[INFO] Executed tasks
[WARNING] Failed to getClass for org.apache.maven.plugin.source.SourceJarMojo
[INFO] 
[INFO] --- maven-source-plugin:2.1.2:jar (attach-sources) @ deltaspike-cdictrl-weld ---
[INFO] META-INF already added, skipping
[INFO] META-INF/NOTICE already added, skipping
[INFO] META-INF/LICENSE already added, skipping
[INFO] META-INF/DEPENDENCIES already added, skipping
[INFO] META-INF/DISCLAIMER already added, skipping
[INFO] META-INF already added, skipping
[INFO] META-INF already added, skipping
[INFO] META-INF/NOTICE already added, skipping
[INFO] META-INF/LICENSE already added, skipping
[INFO] META-INF/DEPENDENCIES already added, skipping
[INFO] META-INF/DISCLAIMER already added, skipping
[INFO] META-INF already added, skipping
[INFO] META-INF/NOTICE already added, skipping
[INFO] META-INF/LICENSE already added, skipping
[INFO] META-INF/DEPENDENCIES already added, skipping
[INFO] META-INF/DISCLAIMER already added, skipping
[INFO] Building jar: <https://builds.apache.org/job/DeltaSpike%20RAT-Check/ws/deltaspike/cdictrl/impl-weld/target/deltaspike-cdictrl-weld-0.6-SNAPSHOT-sources.jar>
[INFO] META-INF already added, skipping
[INFO] META-INF/NOTICE already added, skipping
[INFO] META-INF/LICENSE already added, skipping
[INFO] META-INF/DEPENDENCIES already added, skipping
[INFO] META-INF/DISCLAIMER already added, skipping
[INFO] META-INF already added, skipping
[INFO] META-INF already added, skipping
[INFO] META-INF/NOTICE already added, skipping
[INFO] META-INF/LICENSE already added, skipping
[INFO] META-INF/DEPENDENCIES already added, skipping
[INFO] META-INF/DISCLAIMER already added, skipping
[INFO] META-INF already added, skipping
[INFO] META-INF/NOTICE already added, skipping
[INFO] META-INF/LICENSE already added, skipping
[INFO] META-INF/DEPENDENCIES already added, skipping
[INFO] META-INF/DISCLAIMER already added, skipping
[INFO] 
[INFO] --- maven-checkstyle-plugin:2.9.1:check (verify-style) @ deltaspike-cdictrl-weld ---
[INFO] Starting audit...
Audit done.

[INFO] 
[INFO] --- maven-install-plugin:2.3.1:install (default-install) @ deltaspike-cdictrl-weld
---
[INFO] Installing <https://builds.apache.org/job/DeltaSpike%20RAT-Check/ws/deltaspike/cdictrl/impl-weld/target/deltaspike-cdictrl-weld-0.6-SNAPSHOT.jar>
to /home/jenkins/jenkins-slave/maven-repositories/1/org/apache/deltaspike/cdictrl/deltaspike-cdictrl-weld/0.6-SNAPSHOT/deltaspike-cdictrl-weld-0.6-SNAPSHOT.jar
[INFO] Installing <https://builds.apache.org/job/DeltaSpike%20RAT-Check/ws/deltaspike/cdictrl/impl-weld/pom.xml>
to /home/jenkins/jenkins-slave/maven-repositories/1/org/apache/deltaspike/cdictrl/deltaspike-cdictrl-weld/0.6-SNAPSHOT/deltaspike-cdictrl-weld-0.6-SNAPSHOT.pom
[INFO] Installing <https://builds.apache.org/job/DeltaSpike%20RAT-Check/ws/deltaspike/cdictrl/impl-weld/target/deltaspike-cdictrl-weld-0.6-SNAPSHOT-sources.jar>
to /home/jenkins/jenkins-slave/maven-repositories/1/org/apache/deltaspike/cdictrl/deltaspike-cdictrl-weld/0.6-SNAPSHOT/deltaspike-cdictrl-weld-0.6-SNAPSHOT-sources.jar
[INFO]                                                                         
[INFO] ------------------------------------------------------------------------
[INFO] Building Apache DeltaSpike CDI OpenEJB-ContainerControl 0.6-SNAPSHOT
[INFO] ------------------------------------------------------------------------
[INFO] 
[INFO] --- maven-clean-plugin:2.5:clean (default-clean) @ deltaspike-cdictrl-openejb ---
[INFO] 
[INFO] --- apache-rat-plugin:0.8:check (default) @ deltaspike-cdictrl-openejb ---
[INFO] Exclude: .idea/**/*
[INFO] Exclude: readme/**/*
[INFO] Exclude: **/*.log
[INFO] 
[INFO] --- maven-bundle-plugin:2.3.7:cleanVersions (versions) @ deltaspike-cdictrl-openejb
---
[INFO] 
[INFO] --- maven-antrun-plugin:1.6:run (javadoc.resources) @ deltaspike-cdictrl-openejb ---
[WARNING] Parameter tasks is deprecated, use target instead
[INFO] Executing tasks

main:
[INFO] Executed tasks
[INFO] 
[INFO] --- maven-dependency-plugin:2.4:unpack (unpack-context) @ deltaspike-cdictrl-openejb
---
[INFO] Configured Artifact: org.apache.deltaspike.cdictrl:deltaspike-cdictrl-owb:0.6-SNAPSHOT:jar
[INFO] Unpacking <https://builds.apache.org/job/DeltaSpike%20RAT-Check/ws/deltaspike/cdictrl/impl-owb/target/deltaspike-cdictrl-owb-0.6-SNAPSHOT.jar>
to <https://builds.apache.org/job/DeltaSpike%20RAT-Check/ws/deltaspike/cdictrl/impl-openejb/target/classes>
with includes "" and excludes "**\/META-INF\/**,**\/OpenWebBeansContainerControl.class"
[INFO] 
[INFO] --- maven-remote-resources-plugin:1.3:process (process-remote-resources) @ deltaspike-cdictrl-openejb
---
[INFO] 
[INFO] --- maven-remote-resources-plugin:1.3:process (default) @ deltaspike-cdictrl-openejb
---
[INFO] 
[INFO] --- maven-resources-plugin:2.5:resources (default-resources) @ deltaspike-cdictrl-openejb
---
[debug] execute contextualize
[INFO] Using 'UTF-8' encoding to copy filtered resources.
[INFO] Copying 2 resources
[INFO] Copying 4 resources
[INFO] Copying 4 resources
[INFO] 
[INFO] --- maven-compiler-plugin:2.5:compile (default-compile) @ deltaspike-cdictrl-openejb
---
[INFO] Compiling 1 source file to <https://builds.apache.org/job/DeltaSpike%20RAT-Check/ws/deltaspike/cdictrl/impl-openejb/target/classes>
[INFO] 
[INFO] --- maven-resources-plugin:2.5:testResources (default-testResources) @ deltaspike-cdictrl-openejb
---
[debug] execute contextualize
[INFO] Using 'UTF-8' encoding to copy filtered resources.
[INFO] skip non existing resourceDirectory <https://builds.apache.org/job/DeltaSpike%20RAT-Check/ws/deltaspike/cdictrl/impl-openejb/src/test/resources>
[INFO] Copying 4 resources
[INFO] Copying 4 resources
[INFO] 
[INFO] --- maven-compiler-plugin:2.5:testCompile (default-testCompile) @ deltaspike-cdictrl-openejb
---
[INFO] Compiling 2 source files to <https://builds.apache.org/job/DeltaSpike%20RAT-Check/ws/deltaspike/cdictrl/impl-openejb/target/test-classes>
[INFO] 
[INFO] --- maven-dependency-plugin:2.4:unpack (unpack) @ deltaspike-cdictrl-openejb ---
[INFO] Configured Artifact: org.apache.deltaspike.test:deltaspike-cdictrl-tck:0.6-SNAPSHOT:jar
[INFO] Unpacking <https://builds.apache.org/job/DeltaSpike%20RAT-Check/ws/deltaspike/cdictrl/tck/target/deltaspike-cdictrl-tck-0.6-SNAPSHOT.jar>
to <https://builds.apache.org/job/DeltaSpike%20RAT-Check/ws/deltaspike/cdictrl/impl-openejb/target/test-classes>
with includes "" and excludes ""
[INFO] 
[INFO] --- maven-surefire-plugin:2.11:test (default-test) @ deltaspike-cdictrl-openejb ---
[INFO] Surefire report directory: <https://builds.apache.org/job/DeltaSpike%20RAT-Check/ws/deltaspike/cdictrl/impl-openejb/target/surefire-reports>
[INFO] Using configured provider org.apache.maven.surefire.junitcore.JUnitCoreProvider

-------------------------------------------------------
 T E S T S
-------------------------------------------------------
Concurrency config is parallel='none', perCoreThreadCount=true, threadCount=2, useUnlimitedThreads=false
Build timed out (after 30 minutes). Marking the build as failed.

Results :

Tests run: 0, Failures: 0, Errors: 0, Skipped: 0

[INFO] ------------------------------------------------------------------------
[INFO] Reactor Summary:
[INFO] 
[INFO] Apache DeltaSpike ................................. SUCCESS [32.591s]
[INFO] Apache DeltaSpike CheckStyle-rules ................ SUCCESS [20.861s]
[INFO] Apache DeltaSpike Parent .......................... SUCCESS [25.701s]
[INFO] Apache DeltaSpike Test-Utils ...................... SUCCESS [23.394s]
[INFO] Apache DeltaSpike Code Parent ..................... SUCCESS [26.116s]
[INFO] Apache DeltaSpike Core ............................ SUCCESS [18.416s]
[INFO] Apache DeltaSpike Core-API ........................ SUCCESS [31.503s]
[INFO] Apache DeltaSpike Core-Implementation ............. SUCCESS [36.688s]
[INFO] Apache DeltaSpike ContainerControl parent ......... SUCCESS [18.677s]
[INFO] Apache DeltaSpike CDI ContainerControl API ........ SUCCESS [18.637s]
[INFO] Apache DeltaSpike CDI ContainerControl TCK ........ SUCCESS [25.831s]
[INFO] Apache DeltaSpike CDI OWB-ContainerControl ........ SUCCESS [26.461s]
[INFO] Apache DeltaSpike CDI Weld-ContainerControl ....... SUCCESS [23.419s]
[INFO] Apache DeltaSpike CDI OpenEJB-ContainerControl .... FAILURE [24.158s]
[INFO] Apache DeltaSpike Modules ......................... SKIPPED
[INFO] Apache DeltaSpike Security-Module ................. SKIPPED
[INFO] Apache DeltaSpike Security-Module API ............. SKIPPED
[INFO] Apache DeltaSpike Security-Module Impl ............ SKIPPED
[INFO] Apache DeltaSpike JPA-Module ...................... SKIPPED
[INFO] Apache DeltaSpike JPA-Module API .................. SKIPPED
[INFO] Apache DeltaSpike JPA-Module Impl ................. SKIPPED
[INFO] Apache DeltaSpike Servlet-Module .................. SKIPPED
[INFO] Apache DeltaSpike Servlet-Module API .............. SKIPPED
[INFO] Apache DeltaSpike Servlet-Module Impl ............. SKIPPED
[INFO] Apache DeltaSpike JSF-Module ...................... SKIPPED
[INFO] Apache DeltaSpike JSF-Module API .................. SKIPPED
[INFO] Apache DeltaSpike JSF-Module Impl ................. SKIPPED
[INFO] Apache DeltaSpike Partial-Bean-Module ............. SKIPPED
[INFO] Apache DeltaSpike Partial-Bean-Module API ......... SKIPPED
[INFO] Apache DeltaSpike Partial-Bean-Module Impl ........ SKIPPED
[INFO] Apache DeltaSpike BeanValidation-Module ........... SKIPPED
[INFO] Apache DeltaSpike BeanValidation-Module API ....... SKIPPED
[INFO] Apache DeltaSpike BeanValidation-Module Impl ...... SKIPPED
[INFO] Apache DeltaSpike Data-Module ..................... SKIPPED
[INFO] Apache DeltaSpike Data-Module API ................. SKIPPED
[INFO] Apache DeltaSpike Data-Module Impl ................ SKIPPED
[INFO] Apache DeltaSpike Test-Control-Module ............. SKIPPED
[INFO] Apache DeltaSpike Test-Control-Module API ......... SKIPPED
[INFO] Apache DeltaSpike Test-Control-Module Impl ........ SKIPPED
[INFO] Apache DeltaSpike Examples ........................ SKIPPED
[INFO] Apache DeltaSpike Java-SE Examples ................ SKIPPED
[INFO] Apache DeltaSpike JSF Examples .................... SKIPPED
[INFO] ------------------------------------------------------------------------
[INFO] BUILD FAILURE
[INFO] ------------------------------------------------------------------------
[INFO] Total time: 28:55.063s
[INFO] Finished at: Thu Dec 19 03:55:43 UTC 2013
[INFO] Final Memory: 43M/131M
[INFO] ------------------------------------------------------------------------
[ERROR] Internal error: java.lang.IllegalStateException: Unable to call isArchivingDisabled.
Invalid object ID 45 -> [Help 1]
org.apache.maven.InternalErrorException: Internal error: java.lang.IllegalStateException:
Unable to call isArchivingDisabled. Invalid object ID 45
	at org.apache.maven.DefaultMaven.execute(DefaultMaven.java:168)
	at org.jvnet.hudson.maven3.launcher.Maven3Launcher.main(Maven3Launcher.java:117)
	at sun.reflect.NativeMethodAccessorImpl.invoke0(Native Method)
	at sun.reflect.NativeMethodAccessorImpl.invoke(NativeMethodAccessorImpl.java:39)
	at sun.reflect.DelegatingMethodAccessorImpl.invoke(DelegatingMethodAccessorImpl.java:25)
	at java.lang.reflect.Method.invoke(Method.java:597)
	at org.codehaus.plexus.classworlds.launcher.Launcher.launchStandard(Launcher.java:329)
	at org.codehaus.plexus.classworlds.launcher.Launcher.launch(Launcher.java:239)
	at org.jvnet.hudson.maven3.agent.Maven3Main.launch(Maven3Main.java:178)
	at sun.reflect.NativeMethodAccessorImpl.invoke0(Native Method)
	at sun.reflect.NativeMethodAccessorImpl.invoke(NativeMethodAccessorImpl.java:39)
	at sun.reflect.DelegatingMethodAccessorImpl.invoke(DelegatingMethodAccessorImpl.java:25)
	at java.lang.reflect.Method.invoke(Method.java:597)
	at hudson.maven.Maven3Builder.call(Maven3Builder.java:134)
	at hudson.maven.Maven3Builder.call(Maven3Builder.java:69)
	at hudson.remoting.UserRequest.perform(UserRequest.java:118)
	at hudson.remoting.UserRequest.perform(UserRequest.java:48)
	at hudson.remoting.Request$2.run(Request.java:328)
	at hudson.remoting.InterceptingExecutorService$1.call(InterceptingExecutorService.java:72)
	at java.util.concurrent.FutureTask$Sync.innerRun(FutureTask.java:303)
	at java.util.concurrent.FutureTask.run(FutureTask.java:138)
	at java.util.concurrent.ThreadPoolExecutor$Worker.runTask(ThreadPoolExecutor.java:895)
	at java.util.concurrent.ThreadPoolExecutor$Worker.run(ThreadPoolExecutor.java:918)
	at java.lang.Thread.run(Thread.java:662)
Caused by: java.lang.IllegalStateException: Unable to call isArchivingDisabled. Invalid object
ID 45
	at hudson.remoting.RemoteInvocationHandler$RPCRequest.perform(RemoteInvocationHandler.java:293)
	at hudson.remoting.RemoteInvocationHandler$RPCRequest.call(RemoteInvocationHandler.java:280)
	at hudson.remoting.RemoteInvocationHandler$RPCRequest.call(RemoteInvocationHandler.java:239)
	at hudson.remoting.UserRequest.perform(UserRequest.java:118)
	at hudson.remoting.UserRequest.perform(UserRequest.java:48)
	at hudson.remoting.Request$2.run(Request.java:328)
	at hudson.remoting.InterceptingExecutorService$1.call(InterceptingExecutorService.java:72)
	at java.util.concurrent.FutureTask.run(FutureTask.java:262)
	at java.util.concurrent.ThreadPoolExecutor.runWorker(ThreadPoolExecutor.java:1145)
	at java.util.concurrent.ThreadPoolExecutor$Worker.run(ThreadPoolExecutor.java:615)
	at java.lang.Thread.run(Thread.java:744)
[ERROR] 
[ERROR] To see the full stack trace of the errors, re-run Maven with the -e switch.
[ERROR] Re-run Maven using the -X switch to enable full debug logging.
[ERROR] 
[ERROR] For more information about the errors and possible solutions, please read the following
articles:
[ERROR] [Help 1] http://cwiki.apache.org/confluence/display/MAVEN/InternalErrorException
channel stopped

Mime
View raw message