deltaspike-commits mailing list archives

Site index · List index
Message view « Date » · « Thread »
Top « Date » · « Thread »
From Apache Jenkins Server <jenk...@builds.apache.org>
Subject Build failed in Jenkins: DeltaSpike Weld 1.1.15 #8
Date Fri, 22 Nov 2013 17:36:41 GMT
See <https://builds.apache.org/job/DeltaSpike%20Weld%201.1.15/8/changes>

Changes:

[struberg] DELTASPIKE-442 improve PersistenceConfigurationProvider

[Thomas.Hug] DELTASPIKE-443 Mapping API, documentation and implementation.

[rmannibucau] DELTASPIKE-444 adding SimpleQueryInOutMapperBase

[rmannibucau] DELTASPIKE-447 updagring to tomee 1.6.0

[struberg] DELTASPIKE-445 add a few other known project stage config locations

------------------------------------------
[...truncated 387 lines...]
Audit done.

[INFO] 
[INFO] --- maven-install-plugin:2.3.1:install (default-install) @ core-project ---
[INFO] Installing <https://builds.apache.org/job/DeltaSpike%20Weld%201.1.15/ws/deltaspike/core/pom.xml>
to /home/jenkins/jenkins-slave/maven-repositories/1/org/apache/deltaspike/core/core-project/0.6-SNAPSHOT/core-project-0.6-SNAPSHOT.pom
[INFO] Installing <https://builds.apache.org/job/DeltaSpike%20Weld%201.1.15/ws/deltaspike/core/target/core-project-0.6-SNAPSHOT-tests.jar>
to /home/jenkins/jenkins-slave/maven-repositories/1/org/apache/deltaspike/core/core-project/0.6-SNAPSHOT/core-project-0.6-SNAPSHOT-tests.jar
[INFO]                                                                         
[INFO] ------------------------------------------------------------------------
[INFO] Building Apache DeltaSpike Core-API 0.6-SNAPSHOT
[INFO] ------------------------------------------------------------------------
[INFO] 
[INFO] --- maven-clean-plugin:2.5:clean (default-clean) @ deltaspike-core-api ---
[INFO] 
[INFO] --- maven-bundle-plugin:2.3.7:cleanVersions (versions) @ deltaspike-core-api ---
[INFO] 
[INFO] --- maven-antrun-plugin:1.6:run (javadoc.resources) @ deltaspike-core-api ---
[WARNING] Parameter tasks is deprecated, use target instead
[INFO] Executing tasks

main:
[INFO] Executed tasks
[INFO] 
[INFO] --- maven-remote-resources-plugin:1.3:process (process-remote-resources) @ deltaspike-core-api
---
[INFO] 
[INFO] --- maven-remote-resources-plugin:1.3:process (default) @ deltaspike-core-api ---
[INFO] 
[INFO] --- maven-resources-plugin:2.5:resources (default-resources) @ deltaspike-core-api
---
[debug] execute contextualize
[INFO] Using 'UTF-8' encoding to copy filtered resources.
[INFO] Copying 2 resources
[INFO] Copying 4 resources
[INFO] Copying 4 resources
[INFO] 
[INFO] --- maven-compiler-plugin:2.5:compile (default-compile) @ deltaspike-core-api ---
[INFO] Compiling 136 source files to <https://builds.apache.org/job/DeltaSpike%20Weld%201.1.15/ws/deltaspike/core/api/target/classes>
[INFO] 
[INFO] --- maven-resources-plugin:2.5:testResources (default-testResources) @ deltaspike-core-api
---
[debug] execute contextualize
[INFO] Using 'UTF-8' encoding to copy filtered resources.
[INFO] Copying 5 resources
[INFO] Copying 4 resources
[INFO] Copying 4 resources
[INFO] 
[INFO] --- maven-compiler-plugin:2.5:testCompile (default-testCompile) @ deltaspike-core-api
---
[INFO] Compiling 14 source files to <https://builds.apache.org/job/DeltaSpike%20Weld%201.1.15/ws/deltaspike/core/api/target/test-classes>
[INFO] 
[INFO] --- maven-surefire-plugin:2.11:test (default-test) @ deltaspike-core-api ---
[INFO] Surefire report directory: <https://builds.apache.org/job/DeltaSpike%20Weld%201.1.15/ws/deltaspike/core/api/target/surefire-reports>
[INFO] Using configured provider org.apache.maven.surefire.junitcore.JUnitCoreProvider

-------------------------------------------------------
 T E S T S
-------------------------------------------------------
Concurrency config is parallel='none', perCoreThreadCount=true, threadCount=2, useUnlimitedThreads=false
Running org.apache.deltaspike.test.api.config.PropertyLoaderTest
Nov 22, 2013 5:35:59 PM org.apache.deltaspike.core.api.config.PropertyLoader loadAllProperties
INFO: could not find any property files with name notexistingProperty
Nov 22, 2013 5:35:59 PM org.apache.deltaspike.core.api.config.PropertyLoader loadAllProperties
INFO: could not find any property files with name notexistingProperty
Tests run: 3, Failures: 0, Errors: 0, Skipped: 0, Time elapsed: 0.032 sec
Running org.apache.deltaspike.test.api.config.ConfigResolverTest
Tests run: 6, Failures: 0, Errors: 0, Skipped: 0, Time elapsed: 0.007 sec
Running org.apache.deltaspike.test.api.metadata.AnnotatedTypeBuilderTest
Tests run: 3, Failures: 0, Errors: 0, Skipped: 0, Time elapsed: 0.035 sec
Running org.apache.deltaspike.test.api.util.StringUtilsTest
Tests run: 1, Failures: 0, Errors: 0, Skipped: 0, Time elapsed: 0 sec
Running org.apache.deltaspike.test.api.util.metadata.AnnotationInstanceProviderTest
Tests run: 19, Failures: 0, Errors: 0, Skipped: 0, Time elapsed: 0.017 sec
Running org.apache.deltaspike.test.api.util.ExceptionUtilsTest
Tests run: 4, Failures: 0, Errors: 0, Skipped: 0, Time elapsed: 0.003 sec

Results :

Tests run: 36, Failures: 0, Errors: 0, Skipped: 0

[JENKINS] Recording test results
[INFO] 
[INFO] --- maven-bundle-plugin:2.3.7:bundle (default-bundle) @ deltaspike-core-api ---
[WARNING] Bundle org.apache.deltaspike.core:deltaspike-core-api:bundle:0.6-SNAPSHOT : Did
not find matching referal for !org.apache.deltaspike.core.*
[INFO] 
[INFO] --- maven-site-plugin:3.1:attach-descriptor (attach-descriptor) @ deltaspike-core-api
---
[INFO] 
[INFO] --- maven-jar-plugin:2.4:test-jar (default) @ deltaspike-core-api ---
[INFO] Building jar: <https://builds.apache.org/job/DeltaSpike%20Weld%201.1.15/ws/deltaspike/core/api/target/deltaspike-core-api-0.6-SNAPSHOT-tests.jar>
[INFO] 
[INFO] --- maven-bundle-plugin:2.3.7:cleanVersions (versions) @ deltaspike-core-api ---
[INFO] 
[INFO] --- maven-antrun-plugin:1.6:run (javadoc.resources) @ deltaspike-core-api ---
[WARNING] Parameter tasks is deprecated, use target instead
[INFO] Executing tasks

main:
[INFO] Executed tasks
[WARNING] Failed to getClass for org.apache.maven.plugin.source.SourceJarMojo
[INFO] 
[INFO] --- maven-source-plugin:2.1.2:jar (attach-sources) @ deltaspike-core-api ---
[INFO] META-INF already added, skipping
[INFO] META-INF/DEPENDENCIES already added, skipping
[INFO] META-INF/DISCLAIMER already added, skipping
[INFO] META-INF/NOTICE already added, skipping
[INFO] META-INF/LICENSE already added, skipping
[INFO] META-INF already added, skipping
[INFO] META-INF already added, skipping
[INFO] META-INF/DEPENDENCIES already added, skipping
[INFO] META-INF/DISCLAIMER already added, skipping
[INFO] META-INF/NOTICE already added, skipping
[INFO] META-INF/LICENSE already added, skipping
[INFO] META-INF already added, skipping
[INFO] META-INF/DEPENDENCIES already added, skipping
[INFO] META-INF/DISCLAIMER already added, skipping
[INFO] META-INF/NOTICE already added, skipping
[INFO] META-INF/LICENSE already added, skipping
[INFO] Building jar: <https://builds.apache.org/job/DeltaSpike%20Weld%201.1.15/ws/deltaspike/core/api/target/deltaspike-core-api-0.6-SNAPSHOT-sources.jar>
[INFO] META-INF already added, skipping
[INFO] META-INF/DEPENDENCIES already added, skipping
[INFO] META-INF/DISCLAIMER already added, skipping
[INFO] META-INF/NOTICE already added, skipping
[INFO] META-INF/LICENSE already added, skipping
[INFO] META-INF already added, skipping
[INFO] META-INF already added, skipping
[INFO] META-INF/DEPENDENCIES already added, skipping
[INFO] META-INF/DISCLAIMER already added, skipping
[INFO] META-INF/NOTICE already added, skipping
[INFO] META-INF/LICENSE already added, skipping
[INFO] META-INF already added, skipping
[INFO] META-INF/DEPENDENCIES already added, skipping
[INFO] META-INF/DISCLAIMER already added, skipping
[INFO] META-INF/NOTICE already added, skipping
[INFO] META-INF/LICENSE already added, skipping
[INFO] 
[INFO] --- maven-checkstyle-plugin:2.9.1:check (verify-style) @ deltaspike-core-api ---
[INFO] Starting audit...
<https://builds.apache.org/job/DeltaSpike%20Weld%201.1.15/ws/deltaspike/core/api/src/main/java/org/apache/deltaspike/core/util/ProjectStageProducer.java>:60:
array initialization lcurly at indentation level 12 not at correct indentation, 4
<https://builds.apache.org/job/DeltaSpike%20Weld%201.1.15/ws/deltaspike/core/api/src/main/java/org/apache/deltaspike/core/util/ProjectStageProducer.java>:61:
array initialization child at indentation level 20 not at correct indentation, 8
<https://builds.apache.org/job/DeltaSpike%20Weld%201.1.15/ws/deltaspike/core/api/src/main/java/org/apache/deltaspike/core/util/ProjectStageProducer.java>:62:
array initialization child at indentation level 20 not at correct indentation, 8
<https://builds.apache.org/job/DeltaSpike%20Weld%201.1.15/ws/deltaspike/core/api/src/main/java/org/apache/deltaspike/core/util/ProjectStageProducer.java>:63:
array initialization child at indentation level 20 not at correct indentation, 8
<https://builds.apache.org/job/DeltaSpike%20Weld%201.1.15/ws/deltaspike/core/api/src/main/java/org/apache/deltaspike/core/util/ProjectStageProducer.java>:64:
array initialization rcurly at indentation level 12 not at correct indentation, 4
Audit done.

[INFO] There are 5 checkstyle errors.
[INFO] ------------------------------------------------------------------------
[INFO] Reactor Summary:
[INFO] 
[INFO] Apache DeltaSpike ................................. SUCCESS [3.159s]
[INFO] Apache DeltaSpike CheckStyle-rules ................ SUCCESS [1.397s]
[INFO] Apache DeltaSpike Parent .......................... SUCCESS [3.789s]
[INFO] Apache DeltaSpike Test-Utils ...................... SUCCESS [3.530s]
[INFO] Apache DeltaSpike Code Parent ..................... SUCCESS [4.479s]
[INFO] Apache DeltaSpike Core ............................ SUCCESS [1.370s]
[INFO] Apache DeltaSpike Core-API ........................ FAILURE [5.156s]
[INFO] Apache DeltaSpike Core-Implementation ............. SKIPPED
[INFO] Apache DeltaSpike ContainerControl parent ......... SKIPPED
[INFO] Apache DeltaSpike CDI ContainerControl API ........ SKIPPED
[INFO] Apache DeltaSpike CDI ContainerControl TCK ........ SKIPPED
[INFO] Apache DeltaSpike CDI OWB-ContainerControl ........ SKIPPED
[INFO] Apache DeltaSpike CDI Weld-ContainerControl ....... SKIPPED
[INFO] Apache DeltaSpike CDI OpenEJB-ContainerControl .... SKIPPED
[INFO] Apache DeltaSpike Modules ......................... SKIPPED
[INFO] Apache DeltaSpike Security-Module ................. SKIPPED
[INFO] Apache DeltaSpike Security-Module API ............. SKIPPED
[INFO] Apache DeltaSpike Security-Module Impl ............ SKIPPED
[INFO] Apache DeltaSpike JPA-Module ...................... SKIPPED
[INFO] Apache DeltaSpike JPA-Module API .................. SKIPPED
[INFO] Apache DeltaSpike JPA-Module Impl ................. SKIPPED
[INFO] Apache DeltaSpike Servlet-Module .................. SKIPPED
[INFO] Apache DeltaSpike Servlet-Module API .............. SKIPPED
[INFO] Apache DeltaSpike Servlet-Module Impl ............. SKIPPED
[INFO] Apache DeltaSpike JSF-Module ...................... SKIPPED
[INFO] Apache DeltaSpike JSF-Module API .................. SKIPPED
[INFO] Apache DeltaSpike JSF-Module Impl ................. SKIPPED
[INFO] Apache DeltaSpike Partial-Bean-Module ............. SKIPPED
[INFO] Apache DeltaSpike Partial-Bean-Module API ......... SKIPPED
[INFO] Apache DeltaSpike Partial-Bean-Module Impl ........ SKIPPED
[INFO] Apache DeltaSpike BeanValidation-Module ........... SKIPPED
[INFO] Apache DeltaSpike BeanValidation-Module API ....... SKIPPED
[INFO] Apache DeltaSpike BeanValidation-Module Impl ...... SKIPPED
[INFO] Apache DeltaSpike Data-Module ..................... SKIPPED
[INFO] Apache DeltaSpike Data-Module API ................. SKIPPED
[INFO] Apache DeltaSpike Data-Module Impl ................ SKIPPED
[INFO] Apache DeltaSpike Examples ........................ SKIPPED
[INFO] Apache DeltaSpike Java-SE Examples ................ SKIPPED
[INFO] Apache DeltaSpike JSF Examples .................... SKIPPED
[INFO] ------------------------------------------------------------------------
[INFO] BUILD FAILURE
[INFO] ------------------------------------------------------------------------
[INFO] Total time: 43.839s
[INFO] Finished at: Fri Nov 22 17:36:04 UTC 2013
[INFO] Final Memory: 36M/175M
[INFO] ------------------------------------------------------------------------
Waiting for Jenkins to finish collecting data
[ERROR] Failed to execute goal org.apache.maven.plugins:maven-checkstyle-plugin:2.9.1:check
(verify-style) on project deltaspike-core-api: You have 5 Checkstyle violations. -> [Help
1]
[ERROR] 
[ERROR] To see the full stack trace of the errors, re-run Maven with the -e switch.
[ERROR] Re-run Maven using the -X switch to enable full debug logging.
[ERROR] 
[ERROR] For more information about the errors and possible solutions, please read the following
articles:
[ERROR] [Help 1] http://cwiki.apache.org/confluence/display/MAVEN/MojoFailureException
[ERROR] 
[JENKINS] Archiving <https://builds.apache.org/job/DeltaSpike%20Weld%201.1.15/ws/deltaspike/modules/partial-bean/api/pom.xml>
to org.apache.deltaspike.modules/deltaspike-partial-bean-module-api/0.6-SNAPSHOT/deltaspike-partial-bean-module-api-0.6-SNAPSHOT.pom
[ERROR] After correcting the problems, you can resume the build with the command
[ERROR]   mvn <goals> -rf :deltaspike-core-api
[JENKINS] Archiving <https://builds.apache.org/job/DeltaSpike%20Weld%201.1.15/ws/deltaspike/parent/pom.xml>
to org.apache.deltaspike/parent/0.6-SNAPSHOT/parent-0.6-SNAPSHOT.pom
[JENKINS] Archiving <https://builds.apache.org/job/DeltaSpike%20Weld%201.1.15/ws/deltaspike/examples/jse-examples/pom.xml>
to org.apache.deltaspike.examples/deltaspike-jse-example/0.6-SNAPSHOT/deltaspike-jse-example-0.6-SNAPSHOT.pom
[JENKINS] Archiving <https://builds.apache.org/job/DeltaSpike%20Weld%201.1.15/ws/deltaspike/modules/bean-validation/api/pom.xml>
to org.apache.deltaspike.modules/deltaspike-bean-validation-module-api/0.6-SNAPSHOT/deltaspike-bean-validation-module-api-0.6-SNAPSHOT.pom
[JENKINS] Archiving <https://builds.apache.org/job/DeltaSpike%20Weld%201.1.15/ws/deltaspike/core/pom.xml>
to org.apache.deltaspike.core/core-project/0.6-SNAPSHOT/core-project-0.6-SNAPSHOT.pom
[JENKINS] Archiving <https://builds.apache.org/job/DeltaSpike%20Weld%201.1.15/ws/deltaspike/core/target/core-project-0.6-SNAPSHOT-tests.jar>
to org.apache.deltaspike.core/core-project/0.6-SNAPSHOT/core-project-0.6-SNAPSHOT-tests.jar
[JENKINS] Archiving <https://builds.apache.org/job/DeltaSpike%20Weld%201.1.15/ws/deltaspike/test-utils/pom.xml>
to org.apache.deltaspike.test/test-utils/0.6-SNAPSHOT/test-utils-0.6-SNAPSHOT.pom
[JENKINS] Archiving <https://builds.apache.org/job/DeltaSpike%20Weld%201.1.15/ws/deltaspike/test-utils/target/test-utils-0.6-SNAPSHOT.jar>
to org.apache.deltaspike.test/test-utils/0.6-SNAPSHOT/test-utils-0.6-SNAPSHOT.jar
[JENKINS] Archiving <https://builds.apache.org/job/DeltaSpike%20Weld%201.1.15/ws/deltaspike/test-utils/target/test-utils-0.6-SNAPSHOT-sources.jar>
to org.apache.deltaspike.test/test-utils/0.6-SNAPSHOT/test-utils-0.6-SNAPSHOT-sources.jar
[JENKINS] Archiving <https://builds.apache.org/job/DeltaSpike%20Weld%201.1.15/ws/deltaspike/modules/data/impl/pom.xml>
to org.apache.deltaspike.modules/deltaspike-data-module-impl/0.6-SNAPSHOT/deltaspike-data-module-impl-0.6-SNAPSHOT.pom
[JENKINS] Archiving <https://builds.apache.org/job/DeltaSpike%20Weld%201.1.15/ws/deltaspike/core/api/pom.xml>
to org.apache.deltaspike.core/deltaspike-core-api/0.6-SNAPSHOT/deltaspike-core-api-0.6-SNAPSHOT.pom
[JENKINS] Archiving <https://builds.apache.org/job/DeltaSpike%20Weld%201.1.15/ws/deltaspike/core/api/target/deltaspike-core-api-0.6-SNAPSHOT.jar>
to org.apache.deltaspike.core/deltaspike-core-api/0.6-SNAPSHOT/deltaspike-core-api-0.6-SNAPSHOT.jar
[JENKINS] Archiving <https://builds.apache.org/job/DeltaSpike%20Weld%201.1.15/ws/deltaspike/core/api/target/deltaspike-core-api-0.6-SNAPSHOT-tests.jar>
to org.apache.deltaspike.core/deltaspike-core-api/0.6-SNAPSHOT/deltaspike-core-api-0.6-SNAPSHOT-tests.jar
[JENKINS] Archiving <https://builds.apache.org/job/DeltaSpike%20Weld%201.1.15/ws/deltaspike/core/api/target/deltaspike-core-api-0.6-SNAPSHOT-sources.jar>
to org.apache.deltaspike.core/deltaspike-core-api/0.6-SNAPSHOT/deltaspike-core-api-0.6-SNAPSHOT-sources.jar
[JENKINS] Archiving <https://builds.apache.org/job/DeltaSpike%20Weld%201.1.15/ws/deltaspike/modules/data/api/pom.xml>
to org.apache.deltaspike.modules/deltaspike-data-module-api/0.6-SNAPSHOT/deltaspike-data-module-api-0.6-SNAPSHOT.pom
[JENKINS] Archiving <https://builds.apache.org/job/DeltaSpike%20Weld%201.1.15/ws/deltaspike/modules/security/impl/pom.xml>
to org.apache.deltaspike.modules/deltaspike-security-module-impl/0.6-SNAPSHOT/deltaspike-security-module-impl-0.6-SNAPSHOT.pom
[JENKINS] Archiving <https://builds.apache.org/job/DeltaSpike%20Weld%201.1.15/ws/deltaspike/core/impl/pom.xml>
to org.apache.deltaspike.core/deltaspike-core-impl/0.6-SNAPSHOT/deltaspike-core-impl-0.6-SNAPSHOT.pom
[JENKINS] Archiving <https://builds.apache.org/job/DeltaSpike%20Weld%201.1.15/ws/deltaspike/modules/pom.xml>
to org.apache.deltaspike.modules/modules-project/0.6-SNAPSHOT/modules-project-0.6-SNAPSHOT.pom
[JENKINS] Archiving <https://builds.apache.org/job/DeltaSpike%20Weld%201.1.15/ws/deltaspike/examples/jsf-examples/pom.xml>
to org.apache.deltaspike.examples/deltaspike-jsf-example/0.6-SNAPSHOT/deltaspike-jsf-example-0.6-SNAPSHOT.pom
[JENKINS] Archiving <https://builds.apache.org/job/DeltaSpike%20Weld%201.1.15/ws/deltaspike/cdictrl/api/pom.xml>
to org.apache.deltaspike.cdictrl/deltaspike-cdictrl-api/0.6-SNAPSHOT/deltaspike-cdictrl-api-0.6-SNAPSHOT.pom
[JENKINS] Archiving <https://builds.apache.org/job/DeltaSpike%20Weld%201.1.15/ws/deltaspike/checkstyle-rules/pom.xml>
to org.apache.deltaspike/checkstyle-rules/0.6-SNAPSHOT/checkstyle-rules-0.6-SNAPSHOT.pom
[JENKINS] Archiving <https://builds.apache.org/job/DeltaSpike%20Weld%201.1.15/ws/deltaspike/checkstyle-rules/target/checkstyle-rules-0.6-SNAPSHOT.jar>
to org.apache.deltaspike/checkstyle-rules/0.6-SNAPSHOT/checkstyle-rules-0.6-SNAPSHOT.jar
[JENKINS] Archiving <https://builds.apache.org/job/DeltaSpike%20Weld%201.1.15/ws/deltaspike/parent/code/pom.xml>
to org.apache.deltaspike/parent-code/0.6-SNAPSHOT/parent-code-0.6-SNAPSHOT.pom
[JENKINS] Archiving <https://builds.apache.org/job/DeltaSpike%20Weld%201.1.15/ws/deltaspike/parent/code/target/parent-code-0.6-SNAPSHOT-tests.jar>
to org.apache.deltaspike/parent-code/0.6-SNAPSHOT/parent-code-0.6-SNAPSHOT-tests.jar
[JENKINS] Archiving <https://builds.apache.org/job/DeltaSpike%20Weld%201.1.15/ws/deltaspike/modules/partial-bean/pom.xml>
to org.apache.deltaspike.modules/partial-bean-module-project/0.6-SNAPSHOT/partial-bean-module-project-0.6-SNAPSHOT.pom
[JENKINS] Archiving <https://builds.apache.org/job/DeltaSpike%20Weld%201.1.15/ws/deltaspike/modules/jsf/impl/pom.xml>
to org.apache.deltaspike.modules/deltaspike-jsf-module-impl/0.6-SNAPSHOT/deltaspike-jsf-module-impl-0.6-SNAPSHOT.pom
[JENKINS] Archiving <https://builds.apache.org/job/DeltaSpike%20Weld%201.1.15/ws/deltaspike/examples/pom.xml>
to org.apache.deltaspike.examples/examples-project/0.6-SNAPSHOT/examples-project-0.6-SNAPSHOT.pom
[JENKINS] Archiving <https://builds.apache.org/job/DeltaSpike%20Weld%201.1.15/ws/deltaspike/modules/jsf/pom.xml>
to org.apache.deltaspike.modules/jsf-module-project/0.6-SNAPSHOT/jsf-module-project-0.6-SNAPSHOT.pom
[JENKINS] Archiving <https://builds.apache.org/job/DeltaSpike%20Weld%201.1.15/ws/deltaspike/cdictrl/impl-openejb/pom.xml>
to org.apache.deltaspike.cdictrl/deltaspike-cdictrl-openejb/0.6-SNAPSHOT/deltaspike-cdictrl-openejb-0.6-SNAPSHOT.pom
[JENKINS] Archiving <https://builds.apache.org/job/DeltaSpike%20Weld%201.1.15/ws/deltaspike/cdictrl/tck/pom.xml>
to org.apache.deltaspike.test/deltaspike-cdictrl-tck/0.6-SNAPSHOT/deltaspike-cdictrl-tck-0.6-SNAPSHOT.pom
[JENKINS] Archiving <https://builds.apache.org/job/DeltaSpike%20Weld%201.1.15/ws/deltaspike/modules/jsf/api/pom.xml>
to org.apache.deltaspike.modules/deltaspike-jsf-module-api/0.6-SNAPSHOT/deltaspike-jsf-module-api-0.6-SNAPSHOT.pom
[JENKINS] Archiving <https://builds.apache.org/job/DeltaSpike%20Weld%201.1.15/ws/deltaspike/modules/security/pom.xml>
to org.apache.deltaspike.modules/security-module-project/0.6-SNAPSHOT/security-module-project-0.6-SNAPSHOT.pom
[JENKINS] Archiving <https://builds.apache.org/job/DeltaSpike%20Weld%201.1.15/ws/deltaspike/modules/bean-validation/pom.xml>
to org.apache.deltaspike.modules/bean-validation-module-project/0.6-SNAPSHOT/bean-validation-module-project-0.6-SNAPSHOT.pom
[JENKINS] Archiving <https://builds.apache.org/job/DeltaSpike%20Weld%201.1.15/ws/deltaspike/modules/partial-bean/impl/pom.xml>
to org.apache.deltaspike.modules/deltaspike-partial-bean-module-impl/0.6-SNAPSHOT/deltaspike-partial-bean-module-impl-0.6-SNAPSHOT.pom
[JENKINS] Archiving <https://builds.apache.org/job/DeltaSpike%20Weld%201.1.15/ws/deltaspike/cdictrl/impl-weld/pom.xml>
to org.apache.deltaspike.cdictrl/deltaspike-cdictrl-weld/0.6-SNAPSHOT/deltaspike-cdictrl-weld-0.6-SNAPSHOT.pom
[JENKINS] Archiving <https://builds.apache.org/job/DeltaSpike%20Weld%201.1.15/ws/deltaspike/modules/servlet/impl/pom.xml>
to org.apache.deltaspike.modules/deltaspike-servlet-module-impl/0.6-SNAPSHOT/deltaspike-servlet-module-impl-0.6-SNAPSHOT.pom
[JENKINS] Archiving <https://builds.apache.org/job/DeltaSpike%20Weld%201.1.15/ws/deltaspike/modules/jpa/api/pom.xml>
to org.apache.deltaspike.modules/deltaspike-jpa-module-api/0.6-SNAPSHOT/deltaspike-jpa-module-api-0.6-SNAPSHOT.pom
[JENKINS] Archiving <https://builds.apache.org/job/DeltaSpike%20Weld%201.1.15/ws/deltaspike/modules/bean-validation/impl/pom.xml>
to org.apache.deltaspike.modules/deltaspike-bean-validation-module-impl/0.6-SNAPSHOT/deltaspike-bean-validation-module-impl-0.6-SNAPSHOT.pom
[JENKINS] Archiving <https://builds.apache.org/job/DeltaSpike%20Weld%201.1.15/ws/deltaspike/cdictrl/impl-owb/pom.xml>
to org.apache.deltaspike.cdictrl/deltaspike-cdictrl-owb/0.6-SNAPSHOT/deltaspike-cdictrl-owb-0.6-SNAPSHOT.pom
[JENKINS] Archiving <https://builds.apache.org/job/DeltaSpike%20Weld%201.1.15/ws/deltaspike/modules/servlet/api/pom.xml>
to org.apache.deltaspike.modules/deltaspike-servlet-module-api/0.6-SNAPSHOT/deltaspike-servlet-module-api-0.6-SNAPSHOT.pom
[JENKINS] Archiving <https://builds.apache.org/job/DeltaSpike%20Weld%201.1.15/ws/deltaspike/modules/jpa/pom.xml>
to org.apache.deltaspike.modules/jpa-module-project/0.6-SNAPSHOT/jpa-module-project-0.6-SNAPSHOT.pom
[JENKINS] Archiving <https://builds.apache.org/job/DeltaSpike%20Weld%201.1.15/ws/deltaspike/modules/jpa/impl/pom.xml>
to org.apache.deltaspike.modules/deltaspike-jpa-module-impl/0.6-SNAPSHOT/deltaspike-jpa-module-impl-0.6-SNAPSHOT.pom
[JENKINS] Archiving <https://builds.apache.org/job/DeltaSpike%20Weld%201.1.15/ws/deltaspike/modules/data/pom.xml>
to org.apache.deltaspike.modules/data-module-project/0.6-SNAPSHOT/data-module-project-0.6-SNAPSHOT.pom
[JENKINS] Archiving <https://builds.apache.org/job/DeltaSpike%20Weld%201.1.15/ws/deltaspike/cdictrl/pom.xml>
to org.apache.deltaspike.cdictrl/cdictrl-project/0.6-SNAPSHOT/cdictrl-project-0.6-SNAPSHOT.pom
[JENKINS] Archiving <https://builds.apache.org/job/DeltaSpike%20Weld%201.1.15/ws/deltaspike/modules/servlet/pom.xml>
to org.apache.deltaspike.modules/servlet-module-project/0.6-SNAPSHOT/servlet-module-project-0.6-SNAPSHOT.pom
[JENKINS] Archiving <https://builds.apache.org/job/DeltaSpike%20Weld%201.1.15/ws/deltaspike/pom.xml>
to org.apache.deltaspike/deltaspike-project/0.6-SNAPSHOT/deltaspike-project-0.6-SNAPSHOT.pom
[JENKINS] Archiving <https://builds.apache.org/job/DeltaSpike%20Weld%201.1.15/ws/deltaspike/modules/security/api/pom.xml>
to org.apache.deltaspike.modules/deltaspike-security-module-api/0.6-SNAPSHOT/deltaspike-security-module-api-0.6-SNAPSHOT.pom
Sending e-mails to: commits@deltaspike.apache.org null@apache.org
channel stopped

Mime
View raw message