deltaspike-commits mailing list archives

Site index · List index
Message view « Date » · « Thread »
Top « Date » · « Thread »
From Apache Jenkins Server <jenk...@builds.apache.org>
Subject Build failed in Jenkins: DeltaSpike_TomEE_1.6.0-SNAPSHOT #123
Date Sat, 23 Nov 2013 07:07:43 GMT
See <https://builds.apache.org/job/DeltaSpike_TomEE_1.6.0-SNAPSHOT/123/changes>

Changes:

[rmannibucau] DELTASPIKE-447 updagring to tomee 1.6.0

[struberg] DELTASPIKE-445 add a few other known project stage config locations

------------------------------------------
[...truncated 251 lines...]
[INFO] META-INF/DISCLAIMER already added, skipping
[INFO] META-INF/LICENSE already added, skipping
[INFO] META-INF/NOTICE already added, skipping
[INFO] META-INF/DEPENDENCIES already added, skipping
[INFO] META-INF already added, skipping
[INFO] META-INF/DISCLAIMER already added, skipping
[INFO] META-INF/LICENSE already added, skipping
[INFO] META-INF/NOTICE already added, skipping
[INFO] META-INF/DEPENDENCIES already added, skipping
[INFO] Building jar: <https://builds.apache.org/job/DeltaSpike_TomEE_1.6.0-SNAPSHOT/ws/deltaspike/test-utils/target/test-utils-0.6-SNAPSHOT-sources.jar>
[INFO] META-INF already added, skipping
[INFO] META-INF/DISCLAIMER already added, skipping
[INFO] META-INF/LICENSE already added, skipping
[INFO] META-INF/NOTICE already added, skipping
[INFO] META-INF/DEPENDENCIES already added, skipping
[INFO] META-INF already added, skipping
[INFO] META-INF already added, skipping
[INFO] META-INF/DISCLAIMER already added, skipping
[INFO] META-INF/LICENSE already added, skipping
[INFO] META-INF/NOTICE already added, skipping
[INFO] META-INF/DEPENDENCIES already added, skipping
[INFO] META-INF already added, skipping
[INFO] META-INF/DISCLAIMER already added, skipping
[INFO] META-INF/LICENSE already added, skipping
[INFO] META-INF/NOTICE already added, skipping
[INFO] META-INF/DEPENDENCIES already added, skipping
[INFO] 
[INFO] --- maven-checkstyle-plugin:2.9.1:check (verify-style) @ test-utils ---
[INFO] Starting audit...
Audit done.

[INFO] 
[INFO] --- maven-install-plugin:2.3.1:install (default-install) @ test-utils ---
[INFO] Installing <https://builds.apache.org/job/DeltaSpike_TomEE_1.6.0-SNAPSHOT/ws/deltaspike/test-utils/target/test-utils-0.6-SNAPSHOT.jar>
to /home/jenkins/jenkins-slave/maven-repositories/0/org/apache/deltaspike/test/test-utils/0.6-SNAPSHOT/test-utils-0.6-SNAPSHOT.jar
[INFO] Installing <https://builds.apache.org/job/DeltaSpike_TomEE_1.6.0-SNAPSHOT/ws/deltaspike/test-utils/pom.xml>
to /home/jenkins/jenkins-slave/maven-repositories/0/org/apache/deltaspike/test/test-utils/0.6-SNAPSHOT/test-utils-0.6-SNAPSHOT.pom
[INFO] Installing <https://builds.apache.org/job/DeltaSpike_TomEE_1.6.0-SNAPSHOT/ws/deltaspike/test-utils/target/test-utils-0.6-SNAPSHOT-sources.jar>
to /home/jenkins/jenkins-slave/maven-repositories/0/org/apache/deltaspike/test/test-utils/0.6-SNAPSHOT/test-utils-0.6-SNAPSHOT-sources.jar
[INFO]                                                                         
[INFO] ------------------------------------------------------------------------
[INFO] Building Apache DeltaSpike Code Parent 0.6-SNAPSHOT
[INFO] ------------------------------------------------------------------------
Downloading: https://repository.apache.org/content/repositories/releases/org/jboss/shrinkwrap/shrinkwrap-api/1.1.2/shrinkwrap-api-1.1.2.pom
Downloading: https://repository.apache.org/content/repositories/snapshots/org/jboss/shrinkwrap/shrinkwrap-api/1.1.2/shrinkwrap-api-1.1.2.pom
Downloading: http://repo.maven.apache.org/maven2/org/jboss/shrinkwrap/shrinkwrap-api/1.1.2/shrinkwrap-api-1.1.2.pom
Downloaded: http://repo.maven.apache.org/maven2/org/jboss/shrinkwrap/shrinkwrap-api/1.1.2/shrinkwrap-api-1.1.2.pom
(4 KB at 91.7 KB/sec)
Downloading: https://repository.apache.org/content/repositories/releases/org/jboss/shrinkwrap/shrinkwrap-parent/1.1.2/shrinkwrap-parent-1.1.2.pom
Downloading: https://repository.apache.org/content/repositories/snapshots/org/jboss/shrinkwrap/shrinkwrap-parent/1.1.2/shrinkwrap-parent-1.1.2.pom
Downloading: http://repo.maven.apache.org/maven2/org/jboss/shrinkwrap/shrinkwrap-parent/1.1.2/shrinkwrap-parent-1.1.2.pom
Downloaded: http://repo.maven.apache.org/maven2/org/jboss/shrinkwrap/shrinkwrap-parent/1.1.2/shrinkwrap-parent-1.1.2.pom
(11 KB at 1187.4 KB/sec)
Downloading: http://repository.apache.org/snapshots/org/apache/openejb/apache-tomee/1.6.0-SNAPSHOT/maven-metadata.xml
Downloading: https://repository.apache.org/content/repositories/snapshots/org/apache/openejb/apache-tomee/1.6.0-SNAPSHOT/maven-metadata.xml
Downloading: https://repository.apache.org/content/repositories/releases/org/apache/openejb/apache-tomee/1.6.0-SNAPSHOT/maven-metadata.xml
Downloading: https://repository.apache.org/content/repositories/releases/org/apache/openejb/apache-tomee/1.6.0-SNAPSHOT/apache-tomee-1.6.0-SNAPSHOT.pom
Downloading: https://repository.apache.org/content/repositories/snapshots/org/apache/openejb/apache-tomee/1.6.0-SNAPSHOT/apache-tomee-1.6.0-SNAPSHOT.pom
Downloading: http://repository.apache.org/snapshots/org/apache/openejb/apache-tomee/1.6.0-SNAPSHOT/apache-tomee-1.6.0-SNAPSHOT.pom
[WARNING] The POM for org.apache.openejb:apache-tomee:zip:webprofile:1.6.0-SNAPSHOT is missing,
no dependency information available
Downloading: https://repository.apache.org/content/repositories/releases/org/apache/openejb/arquillian-tomee-remote/1.6.0-SNAPSHOT/maven-metadata.xml
Downloading: http://repository.apache.org/snapshots/org/apache/openejb/arquillian-tomee-remote/1.6.0-SNAPSHOT/maven-metadata.xml
Downloading: https://repository.apache.org/content/repositories/snapshots/org/apache/openejb/arquillian-tomee-remote/1.6.0-SNAPSHOT/maven-metadata.xml
Downloaded: https://repository.apache.org/content/repositories/snapshots/org/apache/openejb/arquillian-tomee-remote/1.6.0-SNAPSHOT/maven-metadata.xml
(1005 B at 3.6 KB/sec)
Downloaded: http://repository.apache.org/snapshots/org/apache/openejb/arquillian-tomee-remote/1.6.0-SNAPSHOT/maven-metadata.xml
(1005 B at 0.4 KB/sec)
Downloading: https://repository.apache.org/content/repositories/releases/org/apache/openejb/arquillian-tomee-remote/1.6.0-SNAPSHOT/arquillian-tomee-remote-1.6.0-20131123.041303-1.pom
Downloading: https://repository.apache.org/content/repositories/snapshots/org/apache/openejb/arquillian-tomee-remote/1.6.0-SNAPSHOT/arquillian-tomee-remote-1.6.0-20131123.041303-1.pom
Downloaded: https://repository.apache.org/content/repositories/snapshots/org/apache/openejb/arquillian-tomee-remote/1.6.0-SNAPSHOT/arquillian-tomee-remote-1.6.0-20131123.041303-1.pom
(7 KB at 6.1 KB/sec)
Downloading: https://repository.apache.org/content/repositories/releases/org/apache/openejb/arquillian/1.6.0-SNAPSHOT/maven-metadata.xml
Downloading: http://repository.apache.org/snapshots/org/apache/openejb/arquillian/1.6.0-SNAPSHOT/maven-metadata.xml
Downloading: https://repository.apache.org/content/repositories/snapshots/org/apache/openejb/arquillian/1.6.0-SNAPSHOT/maven-metadata.xml
Downloading: https://repository.apache.org/content/repositories/releases/org/apache/openejb/arquillian/1.6.0-SNAPSHOT/arquillian-1.6.0-SNAPSHOT.pom
Downloading: https://repository.apache.org/content/repositories/snapshots/org/apache/openejb/arquillian/1.6.0-SNAPSHOT/arquillian-1.6.0-SNAPSHOT.pom
Downloading: http://repository.apache.org/snapshots/org/apache/openejb/arquillian/1.6.0-SNAPSHOT/arquillian-1.6.0-SNAPSHOT.pom
Downloading: https://repository.apache.org/content/repositories/releases/org/jboss/arquillian/junit/arquillian-junit-container/1.1.1.Final/arquillian-junit-container-1.1.1.Final.pom
Downloading: https://repository.apache.org/content/repositories/snapshots/org/jboss/arquillian/junit/arquillian-junit-container/1.1.1.Final/arquillian-junit-container-1.1.1.Final.pom
Downloading: http://repo.maven.apache.org/maven2/org/jboss/arquillian/junit/arquillian-junit-container/1.1.1.Final/arquillian-junit-container-1.1.1.Final.pom
Downloaded: http://repo.maven.apache.org/maven2/org/jboss/arquillian/junit/arquillian-junit-container/1.1.1.Final/arquillian-junit-container-1.1.1.Final.pom
(4 KB at 371.8 KB/sec)
Downloading: https://repository.apache.org/content/repositories/releases/org/jboss/arquillian/arquillian-build/1.1.1.Final/arquillian-build-1.1.1.Final.pom
Downloading: https://repository.apache.org/content/repositories/snapshots/org/jboss/arquillian/arquillian-build/1.1.1.Final/arquillian-build-1.1.1.Final.pom
Downloading: http://repo.maven.apache.org/maven2/org/jboss/arquillian/arquillian-build/1.1.1.Final/arquillian-build-1.1.1.Final.pom
Downloaded: http://repo.maven.apache.org/maven2/org/jboss/arquillian/arquillian-build/1.1.1.Final/arquillian-build-1.1.1.Final.pom
(4 KB at 467.4 KB/sec)
Downloading: https://repository.apache.org/content/repositories/releases/org/jboss/arquillian/arquillian-parent/1.1.1.Final/arquillian-parent-1.1.1.Final.pom
Downloading: https://repository.apache.org/content/repositories/snapshots/org/jboss/arquillian/arquillian-parent/1.1.1.Final/arquillian-parent-1.1.1.Final.pom
Downloading: http://repo.maven.apache.org/maven2/org/jboss/arquillian/arquillian-parent/1.1.1.Final/arquillian-parent-1.1.1.Final.pom
Downloaded: http://repo.maven.apache.org/maven2/org/jboss/arquillian/arquillian-parent/1.1.1.Final/arquillian-parent-1.1.1.Final.pom
(6 KB at 727.3 KB/sec)
Downloading: https://repository.apache.org/content/repositories/releases/org/jboss/arquillian/junit/arquillian-junit-core/1.1.1.Final/arquillian-junit-core-1.1.1.Final.pom
Downloading: https://repository.apache.org/content/repositories/snapshots/org/jboss/arquillian/junit/arquillian-junit-core/1.1.1.Final/arquillian-junit-core-1.1.1.Final.pom
Downloading: http://repo.maven.apache.org/maven2/org/jboss/arquillian/junit/arquillian-junit-core/1.1.1.Final/arquillian-junit-core-1.1.1.Final.pom
Downloaded: http://repo.maven.apache.org/maven2/org/jboss/arquillian/junit/arquillian-junit-core/1.1.1.Final/arquillian-junit-core-1.1.1.Final.pom
(3 KB at 314.6 KB/sec)
Downloading: https://repository.apache.org/content/repositories/releases/org/jboss/arquillian/test/arquillian-test-spi/1.1.1.Final/arquillian-test-spi-1.1.1.Final.pom
Downloading: https://repository.apache.org/content/repositories/snapshots/org/jboss/arquillian/test/arquillian-test-spi/1.1.1.Final/arquillian-test-spi-1.1.1.Final.pom
Downloading: http://repo.maven.apache.org/maven2/org/jboss/arquillian/test/arquillian-test-spi/1.1.1.Final/arquillian-test-spi-1.1.1.Final.pom
Downloaded: http://repo.maven.apache.org/maven2/org/jboss/arquillian/test/arquillian-test-spi/1.1.1.Final/arquillian-test-spi-1.1.1.Final.pom
(2 KB at 109.0 KB/sec)
Downloading: https://repository.apache.org/content/repositories/releases/org/jboss/arquillian/core/arquillian-core-spi/1.1.1.Final/arquillian-core-spi-1.1.1.Final.pom
Downloading: https://repository.apache.org/content/repositories/snapshots/org/jboss/arquillian/core/arquillian-core-spi/1.1.1.Final/arquillian-core-spi-1.1.1.Final.pom
Downloading: http://repo.maven.apache.org/maven2/org/jboss/arquillian/core/arquillian-core-spi/1.1.1.Final/arquillian-core-spi-1.1.1.Final.pom
Downloaded: http://repo.maven.apache.org/maven2/org/jboss/arquillian/core/arquillian-core-spi/1.1.1.Final/arquillian-core-spi-1.1.1.Final.pom
(2 KB at 163.9 KB/sec)
Downloading: https://repository.apache.org/content/repositories/releases/org/jboss/arquillian/core/arquillian-core-api/1.1.1.Final/arquillian-core-api-1.1.1.Final.pom
Downloading: https://repository.apache.org/content/repositories/snapshots/org/jboss/arquillian/core/arquillian-core-api/1.1.1.Final/arquillian-core-api-1.1.1.Final.pom
Downloading: http://repo.maven.apache.org/maven2/org/jboss/arquillian/core/arquillian-core-api/1.1.1.Final/arquillian-core-api-1.1.1.Final.pom
Downloaded: http://repo.maven.apache.org/maven2/org/jboss/arquillian/core/arquillian-core-api/1.1.1.Final/arquillian-core-api-1.1.1.Final.pom
(2 KB at 158.3 KB/sec)
Downloading: https://repository.apache.org/content/repositories/releases/org/jboss/arquillian/test/arquillian-test-api/1.1.1.Final/arquillian-test-api-1.1.1.Final.pom
Downloading: https://repository.apache.org/content/repositories/snapshots/org/jboss/arquillian/test/arquillian-test-api/1.1.1.Final/arquillian-test-api-1.1.1.Final.pom
Downloading: http://repo.maven.apache.org/maven2/org/jboss/arquillian/test/arquillian-test-api/1.1.1.Final/arquillian-test-api-1.1.1.Final.pom
Downloaded: http://repo.maven.apache.org/maven2/org/jboss/arquillian/test/arquillian-test-api/1.1.1.Final/arquillian-test-api-1.1.1.Final.pom
(2 KB at 165.4 KB/sec)
Downloading: https://repository.apache.org/content/repositories/releases/org/jboss/arquillian/container/arquillian-container-test-api/1.1.1.Final/arquillian-container-test-api-1.1.1.Final.pom
Downloading: https://repository.apache.org/content/repositories/snapshots/org/jboss/arquillian/container/arquillian-container-test-api/1.1.1.Final/arquillian-container-test-api-1.1.1.Final.pom
Downloading: http://repo.maven.apache.org/maven2/org/jboss/arquillian/container/arquillian-container-test-api/1.1.1.Final/arquillian-container-test-api-1.1.1.Final.pom
Downloaded: http://repo.maven.apache.org/maven2/org/jboss/arquillian/container/arquillian-container-test-api/1.1.1.Final/arquillian-container-test-api-1.1.1.Final.pom
(2 KB at 165.4 KB/sec)
Downloading: https://repository.apache.org/content/repositories/releases/org/jboss/arquillian/container/arquillian-container-test-spi/1.1.1.Final/arquillian-container-test-spi-1.1.1.Final.pom
Downloading: https://repository.apache.org/content/repositories/snapshots/org/jboss/arquillian/container/arquillian-container-test-spi/1.1.1.Final/arquillian-container-test-spi-1.1.1.Final.pom
Downloading: http://repo.maven.apache.org/maven2/org/jboss/arquillian/container/arquillian-container-test-spi/1.1.1.Final/arquillian-container-test-spi-1.1.1.Final.pom
Downloaded: http://repo.maven.apache.org/maven2/org/jboss/arquillian/container/arquillian-container-test-spi/1.1.1.Final/arquillian-container-test-spi-1.1.1.Final.pom
(2 KB at 226.6 KB/sec)
Downloading: https://repository.apache.org/content/repositories/releases/org/jboss/arquillian/container/arquillian-container-spi/1.1.1.Final/arquillian-container-spi-1.1.1.Final.pom
Downloading: https://repository.apache.org/content/repositories/snapshots/org/jboss/arquillian/container/arquillian-container-spi/1.1.1.Final/arquillian-container-spi-1.1.1.Final.pom
Downloading: http://repo.maven.apache.org/maven2/org/jboss/arquillian/container/arquillian-container-spi/1.1.1.Final/arquillian-container-spi-1.1.1.Final.pom
Downloaded: http://repo.maven.apache.org/maven2/org/jboss/arquillian/container/arquillian-container-spi/1.1.1.Final/arquillian-container-spi-1.1.1.Final.pom
(3 KB at 340.7 KB/sec)
Downloading: https://repository.apache.org/content/repositories/releases/org/jboss/arquillian/config/arquillian-config-api/1.1.1.Final/arquillian-config-api-1.1.1.Final.pom
Downloading: https://repository.apache.org/content/repositories/snapshots/org/jboss/arquillian/config/arquillian-config-api/1.1.1.Final/arquillian-config-api-1.1.1.Final.pom
Downloading: http://repo.maven.apache.org/maven2/org/jboss/arquillian/config/arquillian-config-api/1.1.1.Final/arquillian-config-api-1.1.1.Final.pom
Downloaded: http://repo.maven.apache.org/maven2/org/jboss/arquillian/config/arquillian-config-api/1.1.1.Final/arquillian-config-api-1.1.1.Final.pom
(2 KB at 15.6 KB/sec)
Downloading: https://repository.apache.org/content/repositories/releases/org/jboss/arquillian/config/arquillian-config-impl-base/1.1.1.Final/arquillian-config-impl-base-1.1.1.Final.pom
Downloading: https://repository.apache.org/content/repositories/snapshots/org/jboss/arquillian/config/arquillian-config-impl-base/1.1.1.Final/arquillian-config-impl-base-1.1.1.Final.pom
Downloading: http://repo.maven.apache.org/maven2/org/jboss/arquillian/config/arquillian-config-impl-base/1.1.1.Final/arquillian-config-impl-base-1.1.1.Final.pom
Downloaded: http://repo.maven.apache.org/maven2/org/jboss/arquillian/config/arquillian-config-impl-base/1.1.1.Final/arquillian-config-impl-base-1.1.1.Final.pom
(3 KB at 276.5 KB/sec)
Downloading: https://repository.apache.org/content/repositories/releases/org/jboss/arquillian/core/arquillian-core-impl-base/1.1.1.Final/arquillian-core-impl-base-1.1.1.Final.pom
Downloading: https://repository.apache.org/content/repositories/snapshots/org/jboss/arquillian/core/arquillian-core-impl-base/1.1.1.Final/arquillian-core-impl-base-1.1.1.Final.pom
Downloading: http://repo.maven.apache.org/maven2/org/jboss/arquillian/core/arquillian-core-impl-base/1.1.1.Final/arquillian-core-impl-base-1.1.1.Final.pom
Downloaded: http://repo.maven.apache.org/maven2/org/jboss/arquillian/core/arquillian-core-impl-base/1.1.1.Final/arquillian-core-impl-base-1.1.1.Final.pom
(2 KB at 246.1 KB/sec)
Downloading: https://repository.apache.org/content/repositories/releases/org/jboss/arquillian/test/arquillian-test-impl-base/1.1.1.Final/arquillian-test-impl-base-1.1.1.Final.pom
Downloading: https://repository.apache.org/content/repositories/snapshots/org/jboss/arquillian/test/arquillian-test-impl-base/1.1.1.Final/arquillian-test-impl-base-1.1.1.Final.pom
Downloading: http://repo.maven.apache.org/maven2/org/jboss/arquillian/test/arquillian-test-impl-base/1.1.1.Final/arquillian-test-impl-base-1.1.1.Final.pom
Downloaded: http://repo.maven.apache.org/maven2/org/jboss/arquillian/test/arquillian-test-impl-base/1.1.1.Final/arquillian-test-impl-base-1.1.1.Final.pom
(3 KB at 280.9 KB/sec)
Downloading: https://repository.apache.org/content/repositories/releases/org/jboss/arquillian/container/arquillian-container-impl-base/1.1.1.Final/arquillian-container-impl-base-1.1.1.Final.pom
Downloading: https://repository.apache.org/content/repositories/snapshots/org/jboss/arquillian/container/arquillian-container-impl-base/1.1.1.Final/arquillian-container-impl-base-1.1.1.Final.pom
Downloading: http://repo.maven.apache.org/maven2/org/jboss/arquillian/container/arquillian-container-impl-base/1.1.1.Final/arquillian-container-impl-base-1.1.1.Final.pom
Downloaded: http://repo.maven.apache.org/maven2/org/jboss/arquillian/container/arquillian-container-impl-base/1.1.1.Final/arquillian-container-impl-base-1.1.1.Final.pom
(4 KB at 478.5 KB/sec)
Downloading: https://repository.apache.org/content/repositories/releases/org/jboss/arquillian/container/arquillian-container-test-impl-base/1.1.1.Final/arquillian-container-test-impl-base-1.1.1.Final.pom
Downloading: https://repository.apache.org/content/repositories/snapshots/org/jboss/arquillian/container/arquillian-container-test-impl-base/1.1.1.Final/arquillian-container-test-impl-base-1.1.1.Final.pom
Downloading: http://repo.maven.apache.org/maven2/org/jboss/arquillian/container/arquillian-container-test-impl-base/1.1.1.Final/arquillian-container-test-impl-base-1.1.1.Final.pom
Downloaded: http://repo.maven.apache.org/maven2/org/jboss/arquillian/container/arquillian-container-test-impl-base/1.1.1.Final/arquillian-container-test-impl-base-1.1.1.Final.pom
(4 KB at 502.9 KB/sec)
Downloading: https://repository.apache.org/content/repositories/releases/org/jboss/shrinkwrap/shrinkwrap-impl-base/1.1.2/shrinkwrap-impl-base-1.1.2.pom
Downloading: https://repository.apache.org/content/repositories/snapshots/org/jboss/shrinkwrap/shrinkwrap-impl-base/1.1.2/shrinkwrap-impl-base-1.1.2.pom
Downloading: http://repo.maven.apache.org/maven2/org/jboss/shrinkwrap/shrinkwrap-impl-base/1.1.2/shrinkwrap-impl-base-1.1.2.pom
Downloaded: http://repo.maven.apache.org/maven2/org/jboss/shrinkwrap/shrinkwrap-impl-base/1.1.2/shrinkwrap-impl-base-1.1.2.pom
(4 KB at 389.8 KB/sec)
Downloading: https://repository.apache.org/content/repositories/releases/org/jboss/shrinkwrap/shrinkwrap-spi/1.1.2/shrinkwrap-spi-1.1.2.pom
Downloading: https://repository.apache.org/content/repositories/snapshots/org/jboss/shrinkwrap/shrinkwrap-spi/1.1.2/shrinkwrap-spi-1.1.2.pom
Downloading: http://repo.maven.apache.org/maven2/org/jboss/shrinkwrap/shrinkwrap-spi/1.1.2/shrinkwrap-spi-1.1.2.pom
Downloaded: http://repo.maven.apache.org/maven2/org/jboss/shrinkwrap/shrinkwrap-spi/1.1.2/shrinkwrap-spi-1.1.2.pom
(2 KB at 176.6 KB/sec)
[INFO] ------------------------------------------------------------------------
[INFO] Reactor Summary:
[INFO] 
[INFO] Apache DeltaSpike ................................. SUCCESS [15.438s]
[INFO] Apache DeltaSpike CheckStyle-rules ................ SUCCESS [9.669s]
[INFO] Apache DeltaSpike Parent .......................... SUCCESS [9.376s]
[INFO] Apache DeltaSpike Test-Utils ...................... SUCCESS [5.642s]
[INFO] Apache DeltaSpike Code Parent ..................... FAILURE [12.090s]
[INFO] Apache DeltaSpike Core ............................ SKIPPED
[INFO] Apache DeltaSpike Core-API ........................ SKIPPED
[INFO] Apache DeltaSpike Core-Implementation ............. SKIPPED
[INFO] Apache DeltaSpike ContainerControl parent ......... SKIPPED
[INFO] Apache DeltaSpike CDI ContainerControl API ........ SKIPPED
[INFO] Apache DeltaSpike CDI ContainerControl TCK ........ SKIPPED
[INFO] Apache DeltaSpike CDI OWB-ContainerControl ........ SKIPPED
[INFO] Apache DeltaSpike CDI Weld-ContainerControl ....... SKIPPED
[INFO] Apache DeltaSpike CDI OpenEJB-ContainerControl .... SKIPPED
[INFO] Apache DeltaSpike Modules ......................... SKIPPED
[INFO] Apache DeltaSpike Security-Module ................. SKIPPED
[INFO] Apache DeltaSpike Security-Module API ............. SKIPPED
[INFO] Apache DeltaSpike Security-Module Impl ............ SKIPPED
[INFO] Apache DeltaSpike JPA-Module ...................... SKIPPED
[INFO] Apache DeltaSpike JPA-Module API .................. SKIPPED
[INFO] Apache DeltaSpike JPA-Module Impl ................. SKIPPED
[INFO] Apache DeltaSpike Servlet-Module .................. SKIPPED
[INFO] Apache DeltaSpike Servlet-Module API .............. SKIPPED
[INFO] Apache DeltaSpike Servlet-Module Impl ............. SKIPPED
[INFO] Apache DeltaSpike JSF-Module ...................... SKIPPED
[INFO] Apache DeltaSpike JSF-Module API .................. SKIPPED
[INFO] Apache DeltaSpike JSF-Module Impl ................. SKIPPED
[INFO] Apache DeltaSpike Partial-Bean-Module ............. SKIPPED
[INFO] Apache DeltaSpike Partial-Bean-Module API ......... SKIPPED
[INFO] Apache DeltaSpike Partial-Bean-Module Impl ........ SKIPPED
[INFO] Apache DeltaSpike BeanValidation-Module ........... SKIPPED
[INFO] Apache DeltaSpike BeanValidation-Module API ....... SKIPPED
[INFO] Apache DeltaSpike BeanValidation-Module Impl ...... SKIPPED
[INFO] Apache DeltaSpike Data-Module ..................... SKIPPED
[INFO] Apache DeltaSpike Data-Module API ................. SKIPPED
[INFO] Apache DeltaSpike Data-Module Impl ................ SKIPPED
[INFO] Apache DeltaSpike Examples ........................ SKIPPED
[INFO] Apache DeltaSpike Java-SE Examples ................ SKIPPED
[INFO] Apache DeltaSpike JSF Examples .................... SKIPPED
[INFO] ------------------------------------------------------------------------
[INFO] BUILD FAILURE
[INFO] ------------------------------------------------------------------------
[INFO] Total time: 7:36.995s
[INFO] Finished at: Sat Nov 23 05:52:10 UTC 2013
[INFO] Final Memory: 30M/96M
[INFO] ------------------------------------------------------------------------
Waiting for Jenkins to finish collecting data
[ERROR] Failed to execute goal on project parent-code: Could not resolve dependencies for
project org.apache.deltaspike:parent-code:pom:0.6-SNAPSHOT: Failed to collect dependencies
for [org.apache.deltaspike.test:test-utils:jar:0.6-SNAPSHOT (test), org.apache.openejb:javaee-api:jar:6.0-5
(provided), org.apache.openejb:apache-tomee:zip:webprofile:1.6.0-SNAPSHOT (test), org.apache.openejb:arquillian-tomee-remote:jar:1.6.0-SNAPSHOT
(test), commons-logging:commons-logging:jar:1.1.1 (test), junit:junit:jar:4.10 (test), org.jboss.arquillian.junit:arquillian-junit-container:jar:1.1.1.Final
(test)]: Failed to read artifact descriptor for org.apache.openejb:arquillian-tomee-remote:jar:1.6.0-SNAPSHOT:
Could not find artifact org.apache.openejb:arquillian:pom:1.6.0-SNAPSHOT in Apache Repository
(https://repository.apache.org/content/repositories/releases) -> [Help 1]
[JENKINS] Archiving <https://builds.apache.org/job/DeltaSpike_TomEE_1.6.0-SNAPSHOT/ws/deltaspike/modules/partial-bean/api/pom.xml>
to org.apache.deltaspike.modules/deltaspike-partial-bean-module-api/0.6-SNAPSHOT/deltaspike-partial-bean-module-api-0.6-SNAPSHOT.pom
[ERROR] 
[ERROR] To see the full stack trace of the errors, re-run Maven with the -e switch.
[ERROR] Re-run Maven using the -X switch to enable full debug logging.
[ERROR] 
[ERROR] For more information about the errors and possible solutions, please read the following
articles:
[ERROR] [Help 1] http://cwiki.apache.org/confluence/display/MAVEN/DependencyResolutionException
[ERROR] 
[ERROR] After correcting the problems, you can resume the build with the command
[ERROR]   mvn <goals> -rf :parent-code
[JENKINS] Archiving <https://builds.apache.org/job/DeltaSpike_TomEE_1.6.0-SNAPSHOT/ws/deltaspike/parent/pom.xml>
to org.apache.deltaspike/parent/0.6-SNAPSHOT/parent-0.6-SNAPSHOT.pom
[JENKINS] Archiving <https://builds.apache.org/job/DeltaSpike_TomEE_1.6.0-SNAPSHOT/ws/deltaspike/examples/jse-examples/pom.xml>
to org.apache.deltaspike.examples/deltaspike-jse-example/0.6-SNAPSHOT/deltaspike-jse-example-0.6-SNAPSHOT.pom
[JENKINS] Archiving <https://builds.apache.org/job/DeltaSpike_TomEE_1.6.0-SNAPSHOT/ws/deltaspike/modules/bean-validation/api/pom.xml>
to org.apache.deltaspike.modules/deltaspike-bean-validation-module-api/0.6-SNAPSHOT/deltaspike-bean-validation-module-api-0.6-SNAPSHOT.pom
[JENKINS] Archiving <https://builds.apache.org/job/DeltaSpike_TomEE_1.6.0-SNAPSHOT/ws/deltaspike/core/pom.xml>
to org.apache.deltaspike.core/core-project/0.6-SNAPSHOT/core-project-0.6-SNAPSHOT.pom
[JENKINS] Archiving <https://builds.apache.org/job/DeltaSpike_TomEE_1.6.0-SNAPSHOT/ws/deltaspike/test-utils/pom.xml>
to org.apache.deltaspike.test/test-utils/0.6-SNAPSHOT/test-utils-0.6-SNAPSHOT.pom
[JENKINS] Archiving <https://builds.apache.org/job/DeltaSpike_TomEE_1.6.0-SNAPSHOT/ws/deltaspike/test-utils/target/test-utils-0.6-SNAPSHOT.jar>
to org.apache.deltaspike.test/test-utils/0.6-SNAPSHOT/test-utils-0.6-SNAPSHOT.jar
[JENKINS] Archiving <https://builds.apache.org/job/DeltaSpike_TomEE_1.6.0-SNAPSHOT/ws/deltaspike/test-utils/target/test-utils-0.6-SNAPSHOT-sources.jar>
to org.apache.deltaspike.test/test-utils/0.6-SNAPSHOT/test-utils-0.6-SNAPSHOT-sources.jar
[JENKINS] Archiving <https://builds.apache.org/job/DeltaSpike_TomEE_1.6.0-SNAPSHOT/ws/deltaspike/modules/data/impl/pom.xml>
to org.apache.deltaspike.modules/deltaspike-data-module-impl/0.6-SNAPSHOT/deltaspike-data-module-impl-0.6-SNAPSHOT.pom
[JENKINS] Archiving <https://builds.apache.org/job/DeltaSpike_TomEE_1.6.0-SNAPSHOT/ws/deltaspike/core/api/pom.xml>
to org.apache.deltaspike.core/deltaspike-core-api/0.6-SNAPSHOT/deltaspike-core-api-0.6-SNAPSHOT.pom
[JENKINS] Archiving <https://builds.apache.org/job/DeltaSpike_TomEE_1.6.0-SNAPSHOT/ws/deltaspike/modules/data/api/pom.xml>
to org.apache.deltaspike.modules/deltaspike-data-module-api/0.6-SNAPSHOT/deltaspike-data-module-api-0.6-SNAPSHOT.pom
[JENKINS] Archiving <https://builds.apache.org/job/DeltaSpike_TomEE_1.6.0-SNAPSHOT/ws/deltaspike/modules/security/impl/pom.xml>
to org.apache.deltaspike.modules/deltaspike-security-module-impl/0.6-SNAPSHOT/deltaspike-security-module-impl-0.6-SNAPSHOT.pom
[JENKINS] Archiving <https://builds.apache.org/job/DeltaSpike_TomEE_1.6.0-SNAPSHOT/ws/deltaspike/core/impl/pom.xml>
to org.apache.deltaspike.core/deltaspike-core-impl/0.6-SNAPSHOT/deltaspike-core-impl-0.6-SNAPSHOT.pom
[JENKINS] Archiving <https://builds.apache.org/job/DeltaSpike_TomEE_1.6.0-SNAPSHOT/ws/deltaspike/modules/pom.xml>
to org.apache.deltaspike.modules/modules-project/0.6-SNAPSHOT/modules-project-0.6-SNAPSHOT.pom
[JENKINS] Archiving <https://builds.apache.org/job/DeltaSpike_TomEE_1.6.0-SNAPSHOT/ws/deltaspike/examples/jsf-examples/pom.xml>
to org.apache.deltaspike.examples/deltaspike-jsf-example/0.6-SNAPSHOT/deltaspike-jsf-example-0.6-SNAPSHOT.pom
[JENKINS] Archiving <https://builds.apache.org/job/DeltaSpike_TomEE_1.6.0-SNAPSHOT/ws/deltaspike/cdictrl/api/pom.xml>
to org.apache.deltaspike.cdictrl/deltaspike-cdictrl-api/0.6-SNAPSHOT/deltaspike-cdictrl-api-0.6-SNAPSHOT.pom
[JENKINS] Archiving <https://builds.apache.org/job/DeltaSpike_TomEE_1.6.0-SNAPSHOT/ws/deltaspike/checkstyle-rules/pom.xml>
to org.apache.deltaspike/checkstyle-rules/0.6-SNAPSHOT/checkstyle-rules-0.6-SNAPSHOT.pom
[JENKINS] Archiving <https://builds.apache.org/job/DeltaSpike_TomEE_1.6.0-SNAPSHOT/ws/deltaspike/checkstyle-rules/target/checkstyle-rules-0.6-SNAPSHOT.jar>
to org.apache.deltaspike/checkstyle-rules/0.6-SNAPSHOT/checkstyle-rules-0.6-SNAPSHOT.jar
[JENKINS] Archiving <https://builds.apache.org/job/DeltaSpike_TomEE_1.6.0-SNAPSHOT/ws/deltaspike/parent/code/pom.xml>
to org.apache.deltaspike/parent-code/0.6-SNAPSHOT/parent-code-0.6-SNAPSHOT.pom
[JENKINS] Archiving <https://builds.apache.org/job/DeltaSpike_TomEE_1.6.0-SNAPSHOT/ws/deltaspike/modules/partial-bean/pom.xml>
to org.apache.deltaspike.modules/partial-bean-module-project/0.6-SNAPSHOT/partial-bean-module-project-0.6-SNAPSHOT.pom
[JENKINS] Archiving <https://builds.apache.org/job/DeltaSpike_TomEE_1.6.0-SNAPSHOT/ws/deltaspike/modules/jsf/impl/pom.xml>
to org.apache.deltaspike.modules/deltaspike-jsf-module-impl/0.6-SNAPSHOT/deltaspike-jsf-module-impl-0.6-SNAPSHOT.pom
[JENKINS] Archiving <https://builds.apache.org/job/DeltaSpike_TomEE_1.6.0-SNAPSHOT/ws/deltaspike/examples/pom.xml>
to org.apache.deltaspike.examples/examples-project/0.6-SNAPSHOT/examples-project-0.6-SNAPSHOT.pom
[JENKINS] Archiving <https://builds.apache.org/job/DeltaSpike_TomEE_1.6.0-SNAPSHOT/ws/deltaspike/modules/jsf/pom.xml>
to org.apache.deltaspike.modules/jsf-module-project/0.6-SNAPSHOT/jsf-module-project-0.6-SNAPSHOT.pom
[JENKINS] Archiving <https://builds.apache.org/job/DeltaSpike_TomEE_1.6.0-SNAPSHOT/ws/deltaspike/cdictrl/impl-openejb/pom.xml>
to org.apache.deltaspike.cdictrl/deltaspike-cdictrl-openejb/0.6-SNAPSHOT/deltaspike-cdictrl-openejb-0.6-SNAPSHOT.pom
[JENKINS] Archiving <https://builds.apache.org/job/DeltaSpike_TomEE_1.6.0-SNAPSHOT/ws/deltaspike/cdictrl/tck/pom.xml>
to org.apache.deltaspike.test/deltaspike-cdictrl-tck/0.6-SNAPSHOT/deltaspike-cdictrl-tck-0.6-SNAPSHOT.pom
[JENKINS] Archiving <https://builds.apache.org/job/DeltaSpike_TomEE_1.6.0-SNAPSHOT/ws/deltaspike/modules/jsf/api/pom.xml>
to org.apache.deltaspike.modules/deltaspike-jsf-module-api/0.6-SNAPSHOT/deltaspike-jsf-module-api-0.6-SNAPSHOT.pom
[JENKINS] Archiving <https://builds.apache.org/job/DeltaSpike_TomEE_1.6.0-SNAPSHOT/ws/deltaspike/modules/security/pom.xml>
to org.apache.deltaspike.modules/security-module-project/0.6-SNAPSHOT/security-module-project-0.6-SNAPSHOT.pom
[JENKINS] Archiving <https://builds.apache.org/job/DeltaSpike_TomEE_1.6.0-SNAPSHOT/ws/deltaspike/modules/bean-validation/pom.xml>
to org.apache.deltaspike.modules/bean-validation-module-project/0.6-SNAPSHOT/bean-validation-module-project-0.6-SNAPSHOT.pom
[JENKINS] Archiving <https://builds.apache.org/job/DeltaSpike_TomEE_1.6.0-SNAPSHOT/ws/deltaspike/modules/partial-bean/impl/pom.xml>
to org.apache.deltaspike.modules/deltaspike-partial-bean-module-impl/0.6-SNAPSHOT/deltaspike-partial-bean-module-impl-0.6-SNAPSHOT.pom
[JENKINS] Archiving <https://builds.apache.org/job/DeltaSpike_TomEE_1.6.0-SNAPSHOT/ws/deltaspike/cdictrl/impl-weld/pom.xml>
to org.apache.deltaspike.cdictrl/deltaspike-cdictrl-weld/0.6-SNAPSHOT/deltaspike-cdictrl-weld-0.6-SNAPSHOT.pom
[JENKINS] Archiving <https://builds.apache.org/job/DeltaSpike_TomEE_1.6.0-SNAPSHOT/ws/deltaspike/modules/servlet/impl/pom.xml>
to org.apache.deltaspike.modules/deltaspike-servlet-module-impl/0.6-SNAPSHOT/deltaspike-servlet-module-impl-0.6-SNAPSHOT.pom
[JENKINS] Archiving <https://builds.apache.org/job/DeltaSpike_TomEE_1.6.0-SNAPSHOT/ws/deltaspike/modules/jpa/api/pom.xml>
to org.apache.deltaspike.modules/deltaspike-jpa-module-api/0.6-SNAPSHOT/deltaspike-jpa-module-api-0.6-SNAPSHOT.pom
[JENKINS] Archiving <https://builds.apache.org/job/DeltaSpike_TomEE_1.6.0-SNAPSHOT/ws/deltaspike/modules/bean-validation/impl/pom.xml>
to org.apache.deltaspike.modules/deltaspike-bean-validation-module-impl/0.6-SNAPSHOT/deltaspike-bean-validation-module-impl-0.6-SNAPSHOT.pom
[JENKINS] Archiving <https://builds.apache.org/job/DeltaSpike_TomEE_1.6.0-SNAPSHOT/ws/deltaspike/cdictrl/impl-owb/pom.xml>
to org.apache.deltaspike.cdictrl/deltaspike-cdictrl-owb/0.6-SNAPSHOT/deltaspike-cdictrl-owb-0.6-SNAPSHOT.pom
[JENKINS] Archiving <https://builds.apache.org/job/DeltaSpike_TomEE_1.6.0-SNAPSHOT/ws/deltaspike/modules/servlet/api/pom.xml>
to org.apache.deltaspike.modules/deltaspike-servlet-module-api/0.6-SNAPSHOT/deltaspike-servlet-module-api-0.6-SNAPSHOT.pom
[JENKINS] Archiving <https://builds.apache.org/job/DeltaSpike_TomEE_1.6.0-SNAPSHOT/ws/deltaspike/modules/jpa/pom.xml>
to org.apache.deltaspike.modules/jpa-module-project/0.6-SNAPSHOT/jpa-module-project-0.6-SNAPSHOT.pom
[JENKINS] Archiving <https://builds.apache.org/job/DeltaSpike_TomEE_1.6.0-SNAPSHOT/ws/deltaspike/modules/jpa/impl/pom.xml>
to org.apache.deltaspike.modules/deltaspike-jpa-module-impl/0.6-SNAPSHOT/deltaspike-jpa-module-impl-0.6-SNAPSHOT.pom
[JENKINS] Archiving <https://builds.apache.org/job/DeltaSpike_TomEE_1.6.0-SNAPSHOT/ws/deltaspike/modules/data/pom.xml>
to org.apache.deltaspike.modules/data-module-project/0.6-SNAPSHOT/data-module-project-0.6-SNAPSHOT.pom
[JENKINS] Archiving <https://builds.apache.org/job/DeltaSpike_TomEE_1.6.0-SNAPSHOT/ws/deltaspike/cdictrl/pom.xml>
to org.apache.deltaspike.cdictrl/cdictrl-project/0.6-SNAPSHOT/cdictrl-project-0.6-SNAPSHOT.pom
[JENKINS] Archiving <https://builds.apache.org/job/DeltaSpike_TomEE_1.6.0-SNAPSHOT/ws/deltaspike/modules/servlet/pom.xml>
to org.apache.deltaspike.modules/servlet-module-project/0.6-SNAPSHOT/servlet-module-project-0.6-SNAPSHOT.pom
[JENKINS] Archiving <https://builds.apache.org/job/DeltaSpike_TomEE_1.6.0-SNAPSHOT/ws/deltaspike/pom.xml>
to org.apache.deltaspike/deltaspike-project/0.6-SNAPSHOT/deltaspike-project-0.6-SNAPSHOT.pom
[JENKINS] Archiving <https://builds.apache.org/job/DeltaSpike_TomEE_1.6.0-SNAPSHOT/ws/deltaspike/modules/security/api/pom.xml>
to org.apache.deltaspike.modules/deltaspike-security-module-api/0.6-SNAPSHOT/deltaspike-security-module-api-0.6-SNAPSHOT.pom
Sending e-mails to: deltaspike-commits@incubator.apache.org null@apache.org
channel stopped

Mime
View raw message