deltaspike-commits mailing list archives

Site index · List index
Message view « Date » · « Thread »
Top « Date » · « Thread »
From Apache Jenkins Server <jenk...@builds.apache.org>
Subject Build failed in Jenkins: DeltaSpike OWB 1.1.4 (JDK 1.7) #53
Date Sat, 03 Aug 2013 07:21:34 GMT
See <https://builds.apache.org/job/DeltaSpike%20OWB%201.1.4%20(JDK%201.7)/53/changes>

Changes:

[struberg] make sure our MessageBundle mesages are fully Serializable

------------------------------------------
[...truncated 2039 lines...]
INFO: All injection points were validated successfully.
Aug 03, 2013 7:20:47 AM org.apache.webbeans.lifecycle.StandaloneLifeCycle startApplication
INFO: OpenWebBeans Container has started, it took [31] ms.
Aug 03, 2013 7:20:47 AM org.apache.webbeans.lifecycle.StandaloneLifeCycle startApplication
INFO: OpenWebBeans Container is starting...
Aug 03, 2013 7:20:47 AM org.apache.webbeans.corespi.se.DefaultScannerService addWebBeansXmlLocation
INFO: added beans.xml marker: <https://builds.apache.org/job/DeltaSpike%20OWB%201.1.4%20(JDK%201.7)/ws/deltaspike/cdictrl/impl-owb/target/test-classes/META-INF/beans.xml>
Aug 03, 2013 7:20:47 AM org.apache.webbeans.corespi.se.DefaultScannerService addWebBeansXmlLocation
INFO: added beans.xml marker: <https://builds.apache.org/job/DeltaSpike%20OWB%201.1.4%20(JDK%201.7)/ws/deltaspike/cdictrl/impl-owb/target/classes/META-INF/beans.xml>
Aug 03, 2013 7:20:47 AM org.apache.webbeans.corespi.se.DefaultScannerService addWebBeansXmlLocation
INFO: added beans.xml marker: jar:<https://builds.apache.org/job/DeltaSpike%20OWB%201.1.4%20(JDK%201.7)/ws/deltaspike/cdictrl/tck/target/deltaspike-cdictrl-tck-0.5-SNAPSHOT.jar!/META-INF/beans.xml>
Aug 03, 2013 7:20:47 AM org.apache.webbeans.config.BeansDeployer validateInjectionPoints
INFO: All injection points were validated successfully.
Aug 03, 2013 7:20:47 AM org.apache.webbeans.lifecycle.StandaloneLifeCycle startApplication
INFO: OpenWebBeans Container has started, it took [28] ms.
Tests run: 4, Failures: 0, Errors: 0, Skipped: 0, Time elapsed: 0.531 sec

Results :

Tests run: 4, Failures: 0, Errors: 0, Skipped: 0

Aug 03, 2013 7:20:47 AM org.apache.maven.cli.event.ExecutionEventLogger logReactorSummary
INFO: ------------------------------------------------------------------------
Aug 03, 2013 7:20:47 AM org.apache.maven.cli.event.ExecutionEventLogger logReactorSummary
INFO: Reactor Summary:
Aug 03, 2013 7:20:47 AM org.apache.maven.cli.event.ExecutionEventLogger logReactorSummary
INFO: 
Aug 03, 2013 7:20:47 AM org.apache.maven.cli.event.ExecutionEventLogger logReactorSummary
INFO: Apache DeltaSpike ................................. SUCCESS [15.063s]
Aug 03, 2013 7:20:47 AM org.apache.maven.cli.event.ExecutionEventLogger logReactorSummary
INFO: Apache DeltaSpike CheckStyle-rules ................ SUCCESS [2.745s]
Aug 03, 2013 7:20:47 AM org.apache.maven.cli.event.ExecutionEventLogger logReactorSummary
INFO: Apache DeltaSpike Parent .......................... SUCCESS [6.790s]
Aug 03, 2013 7:20:47 AM org.apache.maven.cli.event.ExecutionEventLogger logReactorSummary
INFO: Apache DeltaSpike Test-Utils ...................... SUCCESS [6.501s]
Aug 03, 2013 7:20:47 AM org.apache.maven.cli.event.ExecutionEventLogger logReactorSummary
INFO: Apache DeltaSpike Code Parent ..................... SUCCESS [3.663s]
Aug 03, 2013 7:20:47 AM org.apache.maven.cli.event.ExecutionEventLogger logReactorSummary
INFO: Apache DeltaSpike Core ............................ SUCCESS [1.967s]
Aug 03, 2013 7:20:47 AM org.apache.maven.cli.event.ExecutionEventLogger logReactorSummary
INFO: Apache DeltaSpike Core-API ........................ SUCCESS [13.685s]
Aug 03, 2013 7:20:47 AM org.apache.maven.cli.event.ExecutionEventLogger logReactorSummary
INFO: Apache DeltaSpike Core-Implementation ............. SUCCESS [14.767s]
Aug 03, 2013 7:20:47 AM org.apache.maven.cli.event.ExecutionEventLogger logReactorSummary
INFO: Apache DeltaSpike ContainerControl parent ......... SUCCESS [1.688s]
Aug 03, 2013 7:20:47 AM org.apache.maven.cli.event.ExecutionEventLogger logReactorSummary
INFO: Apache DeltaSpike CDI ContainerControl API ........ SUCCESS [2.864s]
Aug 03, 2013 7:20:47 AM org.apache.maven.cli.event.ExecutionEventLogger logReactorSummary
INFO: Apache DeltaSpike CDI ContainerControl TCK ........ SUCCESS [2.719s]
Aug 03, 2013 7:20:47 AM org.apache.maven.cli.event.ExecutionEventLogger logReactorSummary
INFO: Apache DeltaSpike CDI OWB-ContainerControl ........ FAILURE [3.051s]
Aug 03, 2013 7:20:47 AM org.apache.maven.cli.event.ExecutionEventLogger logReactorSummary
INFO: Apache DeltaSpike CDI Weld-ContainerControl ....... SKIPPED
Aug 03, 2013 7:20:47 AM org.apache.maven.cli.event.ExecutionEventLogger logReactorSummary
INFO: Apache DeltaSpike CDI OpenEJB-ContainerControl .... SKIPPED
Aug 03, 2013 7:20:47 AM org.apache.maven.cli.event.ExecutionEventLogger logReactorSummary
INFO: Apache DeltaSpike Modules ......................... SKIPPED
Aug 03, 2013 7:20:47 AM org.apache.maven.cli.event.ExecutionEventLogger logReactorSummary
INFO: Apache DeltaSpike Security-Module ................. SKIPPED
Aug 03, 2013 7:20:47 AM org.apache.maven.cli.event.ExecutionEventLogger logReactorSummary
INFO: Apache DeltaSpike Security-Module API ............. SKIPPED
Aug 03, 2013 7:20:47 AM org.apache.maven.cli.event.ExecutionEventLogger logReactorSummary
INFO: Apache DeltaSpike Security-Module Impl ............ SKIPPED
Aug 03, 2013 7:20:47 AM org.apache.maven.cli.event.ExecutionEventLogger logReactorSummary
INFO: Apache DeltaSpike JPA-Module ...................... SKIPPED
Aug 03, 2013 7:20:47 AM org.apache.maven.cli.event.ExecutionEventLogger logReactorSummary
INFO: Apache DeltaSpike JPA-Module API .................. SKIPPED
Aug 03, 2013 7:20:47 AM org.apache.maven.cli.event.ExecutionEventLogger logReactorSummary
INFO: Apache DeltaSpike JPA-Module Impl ................. SKIPPED
Aug 03, 2013 7:20:47 AM org.apache.maven.cli.event.ExecutionEventLogger logReactorSummary
INFO: Apache DeltaSpike Servlet-Module .................. SKIPPED
Aug 03, 2013 7:20:47 AM org.apache.maven.cli.event.ExecutionEventLogger logReactorSummary
INFO: Apache DeltaSpike Servlet-Module API .............. SKIPPED
Aug 03, 2013 7:20:47 AM org.apache.maven.cli.event.ExecutionEventLogger logReactorSummary
INFO: Apache DeltaSpike Servlet-Module Impl ............. SKIPPED
Aug 03, 2013 7:20:47 AM org.apache.maven.cli.event.ExecutionEventLogger logReactorSummary
INFO: Apache DeltaSpike JSF-Module ...................... SKIPPED
Aug 03, 2013 7:20:47 AM org.apache.maven.cli.event.ExecutionEventLogger logReactorSummary
INFO: Apache DeltaSpike JSF-Module API .................. SKIPPED
Aug 03, 2013 7:20:47 AM org.apache.maven.cli.event.ExecutionEventLogger logReactorSummary
INFO: Apache DeltaSpike JSF-Module Impl ................. SKIPPED
Aug 03, 2013 7:20:47 AM org.apache.maven.cli.event.ExecutionEventLogger logReactorSummary
INFO: Apache DeltaSpike Partial-Bean-Module ............. SKIPPED
Aug 03, 2013 7:20:47 AM org.apache.maven.cli.event.ExecutionEventLogger logReactorSummary
INFO: Apache DeltaSpike Partial-Bean-Module API ......... SKIPPED
Aug 03, 2013 7:20:47 AM org.apache.maven.cli.event.ExecutionEventLogger logReactorSummary
INFO: Apache DeltaSpike Partial-Bean-Module Impl ........ SKIPPED
Aug 03, 2013 7:20:47 AM org.apache.maven.cli.event.ExecutionEventLogger logReactorSummary
INFO: Apache DeltaSpike BeanValidation-Module ........... SKIPPED
Aug 03, 2013 7:20:47 AM org.apache.maven.cli.event.ExecutionEventLogger logReactorSummary
INFO: Apache DeltaSpike BeanValidation-Module API ....... SKIPPED
Aug 03, 2013 7:20:47 AM org.apache.maven.cli.event.ExecutionEventLogger logReactorSummary
INFO: Apache DeltaSpike BeanValidation-Module Impl ...... SKIPPED
Aug 03, 2013 7:20:47 AM org.apache.maven.cli.event.ExecutionEventLogger logReactorSummary
INFO: Apache DeltaSpike Data-Module ..................... SKIPPED
Aug 03, 2013 7:20:47 AM org.apache.maven.cli.event.ExecutionEventLogger logReactorSummary
INFO: Apache DeltaSpike Data-Module API ................. SKIPPED
Aug 03, 2013 7:20:47 AM org.apache.maven.cli.event.ExecutionEventLogger logReactorSummary
INFO: Apache DeltaSpike Data-Module Impl ................ SKIPPED
Aug 03, 2013 7:20:47 AM org.apache.maven.cli.event.ExecutionEventLogger logReactorSummary
INFO: Apache DeltaSpike Examples ........................ SKIPPED
Aug 03, 2013 7:20:47 AM org.apache.maven.cli.event.ExecutionEventLogger logReactorSummary
INFO: Apache DeltaSpike Java-SE Examples ................ SKIPPED
Aug 03, 2013 7:20:47 AM org.apache.maven.cli.event.ExecutionEventLogger logReactorSummary
INFO: Apache DeltaSpike JSF Examples .................... SKIPPED
Aug 03, 2013 7:20:47 AM org.apache.maven.cli.event.ExecutionEventLogger logResult
INFO: ------------------------------------------------------------------------
Aug 03, 2013 7:20:47 AM org.apache.maven.cli.event.ExecutionEventLogger logResult
INFO: BUILD FAILURE
Aug 03, 2013 7:20:47 AM org.apache.maven.cli.event.ExecutionEventLogger logStats
INFO: ------------------------------------------------------------------------
Aug 03, 2013 7:20:47 AM org.apache.maven.cli.event.ExecutionEventLogger logStats
INFO: Total time: 1:19.704s
Aug 03, 2013 7:20:47 AM org.apache.maven.cli.event.ExecutionEventLogger logStats
INFO: Finished at: Sat Aug 03 07:20:47 UTC 2013
Aug 03, 2013 7:20:47 AM org.apache.maven.cli.event.ExecutionEventLogger logStats
INFO: Final Memory: 42M/213M
Aug 03, 2013 7:20:47 AM org.apache.maven.cli.event.ExecutionEventLogger sessionEnded
INFO: ------------------------------------------------------------------------
[JENKINS] Archiving <https://builds.apache.org/job/DeltaSpike%20OWB%201.1.4%20(JDK%201.7)/ws/deltaspike/pom.xml>
to /home/hudson/hudson/jobs/DeltaSpike OWB 1.1.4 (JDK 1.7)/modules/org.apache.deltaspike$deltaspike-project/builds/2013-08-03_07-19-15/archive/org.apache.deltaspike/deltaspike-project/0.5-SNAPSHOT/deltaspike-project-0.5-SNAPSHOT.pom
[JENKINS] Archiving <https://builds.apache.org/job/DeltaSpike%20OWB%201.1.4%20(JDK%201.7)/ws/deltaspike/modules/partial-bean/impl/pom.xml>
to /home/hudson/hudson/jobs/DeltaSpike OWB 1.1.4 (JDK 1.7)/modules/org.apache.deltaspike.modules$deltaspike-partial-bean-module-impl/builds/2013-08-03_07-19-15/archive/org.apache.deltaspike.modules/deltaspike-partial-bean-module-impl/0.5-SNAPSHOT/deltaspike-partial-bean-module-impl-0.5-SNAPSHOT.pom
[JENKINS] Archiving <https://builds.apache.org/job/DeltaSpike%20OWB%201.1.4%20(JDK%201.7)/ws/deltaspike/cdictrl/impl-openejb/pom.xml>
to /home/hudson/hudson/jobs/DeltaSpike OWB 1.1.4 (JDK 1.7)/modules/org.apache.deltaspike.cdictrl$deltaspike-cdictrl-openejb/builds/2013-08-03_07-19-15/archive/org.apache.deltaspike.cdictrl/deltaspike-cdictrl-openejb/0.5-SNAPSHOT/deltaspike-cdictrl-openejb-0.5-SNAPSHOT.pom
[JENKINS] Archiving <https://builds.apache.org/job/DeltaSpike%20OWB%201.1.4%20(JDK%201.7)/ws/deltaspike/cdictrl/api/pom.xml>
to /home/hudson/hudson/jobs/DeltaSpike OWB 1.1.4 (JDK 1.7)/modules/org.apache.deltaspike.cdictrl$deltaspike-cdictrl-api/builds/2013-08-03_07-19-15/archive/org.apache.deltaspike.cdictrl/deltaspike-cdictrl-api/0.5-SNAPSHOT/deltaspike-cdictrl-api-0.5-SNAPSHOT.pom
[JENKINS] Archiving <https://builds.apache.org/job/DeltaSpike%20OWB%201.1.4%20(JDK%201.7)/ws/deltaspike/cdictrl/api/target/deltaspike-cdictrl-api-0.5-SNAPSHOT.jar>
to /home/hudson/hudson/jobs/DeltaSpike OWB 1.1.4 (JDK 1.7)/modules/org.apache.deltaspike.cdictrl$deltaspike-cdictrl-api/builds/2013-08-03_07-19-15/archive/org.apache.deltaspike.cdictrl/deltaspike-cdictrl-api/0.5-SNAPSHOT/deltaspike-cdictrl-api-0.5-SNAPSHOT.jar
[JENKINS] Archiving <https://builds.apache.org/job/DeltaSpike%20OWB%201.1.4%20(JDK%201.7)/ws/deltaspike/cdictrl/api/target/deltaspike-cdictrl-api-0.5-SNAPSHOT-sources.jar>
to /home/hudson/hudson/jobs/DeltaSpike OWB 1.1.4 (JDK 1.7)/modules/org.apache.deltaspike.cdictrl$deltaspike-cdictrl-api/builds/2013-08-03_07-19-15/archive/org.apache.deltaspike.cdictrl/deltaspike-cdictrl-api/0.5-SNAPSHOT/deltaspike-cdictrl-api-0.5-SNAPSHOT-sources.jar
[JENKINS] Archiving <https://builds.apache.org/job/DeltaSpike%20OWB%201.1.4%20(JDK%201.7)/ws/deltaspike/test-utils/pom.xml>
to /home/hudson/hudson/jobs/DeltaSpike OWB 1.1.4 (JDK 1.7)/modules/org.apache.deltaspike.test$test-utils/builds/2013-08-03_07-19-15/archive/org.apache.deltaspike.test/test-utils/0.5-SNAPSHOT/test-utils-0.5-SNAPSHOT.pom
[JENKINS] Archiving <https://builds.apache.org/job/DeltaSpike%20OWB%201.1.4%20(JDK%201.7)/ws/deltaspike/test-utils/target/test-utils-0.5-SNAPSHOT.jar>
to /home/hudson/hudson/jobs/DeltaSpike OWB 1.1.4 (JDK 1.7)/modules/org.apache.deltaspike.test$test-utils/builds/2013-08-03_07-19-15/archive/org.apache.deltaspike.test/test-utils/0.5-SNAPSHOT/test-utils-0.5-SNAPSHOT.jar
[JENKINS] Archiving <https://builds.apache.org/job/DeltaSpike%20OWB%201.1.4%20(JDK%201.7)/ws/deltaspike/test-utils/target/test-utils-0.5-SNAPSHOT-sources.jar>
to /home/hudson/hudson/jobs/DeltaSpike OWB 1.1.4 (JDK 1.7)/modules/org.apache.deltaspike.test$test-utils/builds/2013-08-03_07-19-15/archive/org.apache.deltaspike.test/test-utils/0.5-SNAPSHOT/test-utils-0.5-SNAPSHOT-sources.jar
[JENKINS] Archiving <https://builds.apache.org/job/DeltaSpike%20OWB%201.1.4%20(JDK%201.7)/ws/deltaspike/core/impl/pom.xml>
to /home/hudson/hudson/jobs/DeltaSpike OWB 1.1.4 (JDK 1.7)/modules/org.apache.deltaspike.core$deltaspike-core-impl/builds/2013-08-03_07-19-15/archive/org.apache.deltaspike.core/deltaspike-core-impl/0.5-SNAPSHOT/deltaspike-core-impl-0.5-SNAPSHOT.pom
[JENKINS] Archiving <https://builds.apache.org/job/DeltaSpike%20OWB%201.1.4%20(JDK%201.7)/ws/deltaspike/core/impl/target/deltaspike-core-impl-0.5-SNAPSHOT.jar>
to /home/hudson/hudson/jobs/DeltaSpike OWB 1.1.4 (JDK 1.7)/modules/org.apache.deltaspike.core$deltaspike-core-impl/builds/2013-08-03_07-19-15/archive/org.apache.deltaspike.core/deltaspike-core-impl/0.5-SNAPSHOT/deltaspike-core-impl-0.5-SNAPSHOT.jar
[JENKINS] Archiving <https://builds.apache.org/job/DeltaSpike%20OWB%201.1.4%20(JDK%201.7)/ws/deltaspike/core/impl/target/deltaspike-core-impl-0.5-SNAPSHOT-tests.jar>
to /home/hudson/hudson/jobs/DeltaSpike OWB 1.1.4 (JDK 1.7)/modules/org.apache.deltaspike.core$deltaspike-core-impl/builds/2013-08-03_07-19-15/archive/org.apache.deltaspike.core/deltaspike-core-impl/0.5-SNAPSHOT/deltaspike-core-impl-0.5-SNAPSHOT-tests.jar
[JENKINS] Archiving <https://builds.apache.org/job/DeltaSpike%20OWB%201.1.4%20(JDK%201.7)/ws/deltaspike/core/impl/target/deltaspike-core-impl-0.5-SNAPSHOT-sources.jar>
to /home/hudson/hudson/jobs/DeltaSpike OWB 1.1.4 (JDK 1.7)/modules/org.apache.deltaspike.core$deltaspike-core-impl/builds/2013-08-03_07-19-15/archive/org.apache.deltaspike.core/deltaspike-core-impl/0.5-SNAPSHOT/deltaspike-core-impl-0.5-SNAPSHOT-sources.jar
[JENKINS] Archiving <https://builds.apache.org/job/DeltaSpike%20OWB%201.1.4%20(JDK%201.7)/ws/deltaspike/modules/data/api/pom.xml>
to /home/hudson/hudson/jobs/DeltaSpike OWB 1.1.4 (JDK 1.7)/modules/org.apache.deltaspike.modules$deltaspike-data-module-api/builds/2013-08-03_07-19-15/archive/org.apache.deltaspike.modules/deltaspike-data-module-api/0.5-SNAPSHOT/deltaspike-data-module-api-0.5-SNAPSHOT.pom
[JENKINS] Archiving <https://builds.apache.org/job/DeltaSpike%20OWB%201.1.4%20(JDK%201.7)/ws/deltaspike/modules/jsf/impl/pom.xml>
to /home/hudson/hudson/jobs/DeltaSpike OWB 1.1.4 (JDK 1.7)/modules/org.apache.deltaspike.modules$deltaspike-jsf-module-impl/builds/2013-08-03_07-19-15/archive/org.apache.deltaspike.modules/deltaspike-jsf-module-impl/0.5-SNAPSHOT/deltaspike-jsf-module-impl-0.5-SNAPSHOT.pom
[JENKINS] Archiving <https://builds.apache.org/job/DeltaSpike%20OWB%201.1.4%20(JDK%201.7)/ws/deltaspike/modules/partial-bean/pom.xml>
to /home/hudson/hudson/jobs/DeltaSpike OWB 1.1.4 (JDK 1.7)/modules/org.apache.deltaspike.modules$partial-bean-module-project/builds/2013-08-03_07-19-15/archive/org.apache.deltaspike.modules/partial-bean-module-project/0.5-SNAPSHOT/partial-bean-module-project-0.5-SNAPSHOT.pom
[JENKINS] Archiving <https://builds.apache.org/job/DeltaSpike%20OWB%201.1.4%20(JDK%201.7)/ws/deltaspike/modules/data/pom.xml>
to /home/hudson/hudson/jobs/DeltaSpike OWB 1.1.4 (JDK 1.7)/modules/org.apache.deltaspike.modules$data-module-project/builds/2013-08-03_07-19-15/archive/org.apache.deltaspike.modules/data-module-project/0.5-SNAPSHOT/data-module-project-0.5-SNAPSHOT.pom
[JENKINS] Archiving <https://builds.apache.org/job/DeltaSpike%20OWB%201.1.4%20(JDK%201.7)/ws/deltaspike/cdictrl/tck/pom.xml>
to /home/hudson/hudson/jobs/DeltaSpike OWB 1.1.4 (JDK 1.7)/modules/org.apache.deltaspike.test$deltaspike-cdictrl-tck/builds/2013-08-03_07-19-15/archive/org.apache.deltaspike.test/deltaspike-cdictrl-tck/0.5-SNAPSHOT/deltaspike-cdictrl-tck-0.5-SNAPSHOT.pom
[JENKINS] Archiving <https://builds.apache.org/job/DeltaSpike%20OWB%201.1.4%20(JDK%201.7)/ws/deltaspike/cdictrl/tck/target/deltaspike-cdictrl-tck-0.5-SNAPSHOT.jar>
to /home/hudson/hudson/jobs/DeltaSpike OWB 1.1.4 (JDK 1.7)/modules/org.apache.deltaspike.test$deltaspike-cdictrl-tck/builds/2013-08-03_07-19-15/archive/org.apache.deltaspike.test/deltaspike-cdictrl-tck/0.5-SNAPSHOT/deltaspike-cdictrl-tck-0.5-SNAPSHOT.jar
[JENKINS] Archiving <https://builds.apache.org/job/DeltaSpike%20OWB%201.1.4%20(JDK%201.7)/ws/deltaspike/cdictrl/tck/target/deltaspike-cdictrl-tck-0.5-SNAPSHOT-sources.jar>
to /home/hudson/hudson/jobs/DeltaSpike OWB 1.1.4 (JDK 1.7)/modules/org.apache.deltaspike.test$deltaspike-cdictrl-tck/builds/2013-08-03_07-19-15/archive/org.apache.deltaspike.test/deltaspike-cdictrl-tck/0.5-SNAPSHOT/deltaspike-cdictrl-tck-0.5-SNAPSHOT-sources.jar
[JENKINS] Archiving <https://builds.apache.org/job/DeltaSpike%20OWB%201.1.4%20(JDK%201.7)/ws/deltaspike/modules/bean-validation/pom.xml>
to /home/hudson/hudson/jobs/DeltaSpike OWB 1.1.4 (JDK 1.7)/modules/org.apache.deltaspike.modules$bean-validation-module-project/builds/2013-08-03_07-19-15/archive/org.apache.deltaspike.modules/bean-validation-module-project/0.5-SNAPSHOT/bean-validation-module-project-0.5-SNAPSHOT.pom
[JENKINS] Archiving <https://builds.apache.org/job/DeltaSpike%20OWB%201.1.4%20(JDK%201.7)/ws/deltaspike/core/pom.xml>
to /home/hudson/hudson/jobs/DeltaSpike OWB 1.1.4 (JDK 1.7)/modules/org.apache.deltaspike.core$core-project/builds/2013-08-03_07-19-15/archive/org.apache.deltaspike.core/core-project/0.5-SNAPSHOT/core-project-0.5-SNAPSHOT.pom
[JENKINS] Archiving <https://builds.apache.org/job/DeltaSpike%20OWB%201.1.4%20(JDK%201.7)/ws/deltaspike/core/target/core-project-0.5-SNAPSHOT-tests.jar>
to /home/hudson/hudson/jobs/DeltaSpike OWB 1.1.4 (JDK 1.7)/modules/org.apache.deltaspike.core$core-project/builds/2013-08-03_07-19-15/archive/org.apache.deltaspike.core/core-project/0.5-SNAPSHOT/core-project-0.5-SNAPSHOT-tests.jar
[JENKINS] Archiving <https://builds.apache.org/job/DeltaSpike%20OWB%201.1.4%20(JDK%201.7)/ws/deltaspike/checkstyle-rules/pom.xml>
to /home/hudson/hudson/jobs/DeltaSpike OWB 1.1.4 (JDK 1.7)/modules/org.apache.deltaspike$checkstyle-rules/builds/2013-08-03_07-19-15/archive/org.apache.deltaspike/checkstyle-rules/0.5-SNAPSHOT/checkstyle-rules-0.5-SNAPSHOT.pom
[JENKINS] Archiving <https://builds.apache.org/job/DeltaSpike%20OWB%201.1.4%20(JDK%201.7)/ws/deltaspike/checkstyle-rules/target/checkstyle-rules-0.5-SNAPSHOT.jar>
to /home/hudson/hudson/jobs/DeltaSpike OWB 1.1.4 (JDK 1.7)/modules/org.apache.deltaspike$checkstyle-rules/builds/2013-08-03_07-19-15/archive/org.apache.deltaspike/checkstyle-rules/0.5-SNAPSHOT/checkstyle-rules-0.5-SNAPSHOT.jar
[JENKINS] Archiving <https://builds.apache.org/job/DeltaSpike%20OWB%201.1.4%20(JDK%201.7)/ws/deltaspike/modules/servlet/api/pom.xml>
to /home/hudson/hudson/jobs/DeltaSpike OWB 1.1.4 (JDK 1.7)/modules/org.apache.deltaspike.modules$deltaspike-servlet-module-api/builds/2013-08-03_07-19-15/archive/org.apache.deltaspike.modules/deltaspike-servlet-module-api/0.5-SNAPSHOT/deltaspike-servlet-module-api-0.5-SNAPSHOT.pom
[JENKINS] Archiving <https://builds.apache.org/job/DeltaSpike%20OWB%201.1.4%20(JDK%201.7)/ws/deltaspike/modules/bean-validation/impl/pom.xml>
to /home/hudson/hudson/jobs/DeltaSpike OWB 1.1.4 (JDK 1.7)/modules/org.apache.deltaspike.modules$deltaspike-bean-validation-module-impl/builds/2013-08-03_07-19-15/archive/org.apache.deltaspike.modules/deltaspike-bean-validation-module-impl/0.5-SNAPSHOT/deltaspike-bean-validation-module-impl-0.5-SNAPSHOT.pom
[JENKINS] Archiving <https://builds.apache.org/job/DeltaSpike%20OWB%201.1.4%20(JDK%201.7)/ws/deltaspike/examples/jsf-examples/pom.xml>
to /home/hudson/hudson/jobs/DeltaSpike OWB 1.1.4 (JDK 1.7)/modules/org.apache.deltaspike.examples$deltaspike-jsf-example/builds/2013-08-03_07-19-15/archive/org.apache.deltaspike.examples/deltaspike-jsf-example/0.5-SNAPSHOT/deltaspike-jsf-example-0.5-SNAPSHOT.pom
[JENKINS] Archiving <https://builds.apache.org/job/DeltaSpike%20OWB%201.1.4%20(JDK%201.7)/ws/deltaspike/modules/security/api/pom.xml>
to /home/hudson/hudson/jobs/DeltaSpike OWB 1.1.4 (JDK 1.7)/modules/org.apache.deltaspike.modules$deltaspike-security-module-api/builds/2013-08-03_07-19-15/archive/org.apache.deltaspike.modules/deltaspike-security-module-api/0.5-SNAPSHOT/deltaspike-security-module-api-0.5-SNAPSHOT.pom
[JENKINS] Archiving <https://builds.apache.org/job/DeltaSpike%20OWB%201.1.4%20(JDK%201.7)/ws/deltaspike/modules/jpa/pom.xml>
to /home/hudson/hudson/jobs/DeltaSpike OWB 1.1.4 (JDK 1.7)/modules/org.apache.deltaspike.modules$jpa-module-project/builds/2013-08-03_07-19-15/archive/org.apache.deltaspike.modules/jpa-module-project/0.5-SNAPSHOT/jpa-module-project-0.5-SNAPSHOT.pom
[JENKINS] Archiving <https://builds.apache.org/job/DeltaSpike%20OWB%201.1.4%20(JDK%201.7)/ws/deltaspike/parent/pom.xml>
to /home/hudson/hudson/jobs/DeltaSpike OWB 1.1.4 (JDK 1.7)/modules/org.apache.deltaspike$parent/builds/2013-08-03_07-19-15/archive/org.apache.deltaspike/parent/0.5-SNAPSHOT/parent-0.5-SNAPSHOT.pom
[JENKINS] Archiving <https://builds.apache.org/job/DeltaSpike%20OWB%201.1.4%20(JDK%201.7)/ws/deltaspike/cdictrl/impl-weld/pom.xml>
to /home/hudson/hudson/jobs/DeltaSpike OWB 1.1.4 (JDK 1.7)/modules/org.apache.deltaspike.cdictrl$deltaspike-cdictrl-weld/builds/2013-08-03_07-19-15/archive/org.apache.deltaspike.cdictrl/deltaspike-cdictrl-weld/0.5-SNAPSHOT/deltaspike-cdictrl-weld-0.5-SNAPSHOT.pom
[JENKINS] Archiving <https://builds.apache.org/job/DeltaSpike%20OWB%201.1.4%20(JDK%201.7)/ws/deltaspike/examples/jse-examples/pom.xml>
to /home/hudson/hudson/jobs/DeltaSpike OWB 1.1.4 (JDK 1.7)/modules/org.apache.deltaspike.examples$deltaspike-jse-example/builds/2013-08-03_07-19-15/archive/org.apache.deltaspike.examples/deltaspike-jse-example/0.5-SNAPSHOT/deltaspike-jse-example-0.5-SNAPSHOT.pom
[JENKINS] Archiving <https://builds.apache.org/job/DeltaSpike%20OWB%201.1.4%20(JDK%201.7)/ws/deltaspike/modules/security/pom.xml>
to /home/hudson/hudson/jobs/DeltaSpike OWB 1.1.4 (JDK 1.7)/modules/org.apache.deltaspike.modules$security-module-project/builds/2013-08-03_07-19-15/archive/org.apache.deltaspike.modules/security-module-project/0.5-SNAPSHOT/security-module-project-0.5-SNAPSHOT.pom
[JENKINS] Archiving <https://builds.apache.org/job/DeltaSpike%20OWB%201.1.4%20(JDK%201.7)/ws/deltaspike/modules/partial-bean/api/pom.xml>
to /home/hudson/hudson/jobs/DeltaSpike OWB 1.1.4 (JDK 1.7)/modules/org.apache.deltaspike.modules$deltaspike-partial-bean-module-api/builds/2013-08-03_07-19-15/archive/org.apache.deltaspike.modules/deltaspike-partial-bean-module-api/0.5-SNAPSHOT/deltaspike-partial-bean-module-api-0.5-SNAPSHOT.pom
[JENKINS] Archiving <https://builds.apache.org/job/DeltaSpike%20OWB%201.1.4%20(JDK%201.7)/ws/deltaspike/cdictrl/impl-owb/pom.xml>
to /home/hudson/hudson/jobs/DeltaSpike OWB 1.1.4 (JDK 1.7)/modules/org.apache.deltaspike.cdictrl$deltaspike-cdictrl-owb/builds/2013-08-03_07-19-15/archive/org.apache.deltaspike.cdictrl/deltaspike-cdictrl-owb/0.5-SNAPSHOT/deltaspike-cdictrl-owb-0.5-SNAPSHOT.pom
[JENKINS] Archiving <https://builds.apache.org/job/DeltaSpike%20OWB%201.1.4%20(JDK%201.7)/ws/deltaspike/modules/jsf/pom.xml>
to /home/hudson/hudson/jobs/DeltaSpike OWB 1.1.4 (JDK 1.7)/modules/org.apache.deltaspike.modules$jsf-module-project/builds/2013-08-03_07-19-15/archive/org.apache.deltaspike.modules/jsf-module-project/0.5-SNAPSHOT/jsf-module-project-0.5-SNAPSHOT.pom
[JENKINS] Archiving <https://builds.apache.org/job/DeltaSpike%20OWB%201.1.4%20(JDK%201.7)/ws/deltaspike/modules/bean-validation/api/pom.xml>
to /home/hudson/hudson/jobs/DeltaSpike OWB 1.1.4 (JDK 1.7)/modules/org.apache.deltaspike.modules$deltaspike-bean-validation-module-api/builds/2013-08-03_07-19-15/archive/org.apache.deltaspike.modules/deltaspike-bean-validation-module-api/0.5-SNAPSHOT/deltaspike-bean-validation-module-api-0.5-SNAPSHOT.pom
[JENKINS] Archiving <https://builds.apache.org/job/DeltaSpike%20OWB%201.1.4%20(JDK%201.7)/ws/deltaspike/core/api/pom.xml>
to /home/hudson/hudson/jobs/DeltaSpike OWB 1.1.4 (JDK 1.7)/modules/org.apache.deltaspike.core$deltaspike-core-api/builds/2013-08-03_07-19-15/archive/org.apache.deltaspike.core/deltaspike-core-api/0.5-SNAPSHOT/deltaspike-core-api-0.5-SNAPSHOT.pom
[JENKINS] Archiving <https://builds.apache.org/job/DeltaSpike%20OWB%201.1.4%20(JDK%201.7)/ws/deltaspike/core/api/target/deltaspike-core-api-0.5-SNAPSHOT.jar>
to /home/hudson/hudson/jobs/DeltaSpike OWB 1.1.4 (JDK 1.7)/modules/org.apache.deltaspike.core$deltaspike-core-api/builds/2013-08-03_07-19-15/archive/org.apache.deltaspike.core/deltaspike-core-api/0.5-SNAPSHOT/deltaspike-core-api-0.5-SNAPSHOT.jar
[JENKINS] Archiving <https://builds.apache.org/job/DeltaSpike%20OWB%201.1.4%20(JDK%201.7)/ws/deltaspike/core/api/target/deltaspike-core-api-0.5-SNAPSHOT-tests.jar>
to /home/hudson/hudson/jobs/DeltaSpike OWB 1.1.4 (JDK 1.7)/modules/org.apache.deltaspike.core$deltaspike-core-api/builds/2013-08-03_07-19-15/archive/org.apache.deltaspike.core/deltaspike-core-api/0.5-SNAPSHOT/deltaspike-core-api-0.5-SNAPSHOT-tests.jar
[JENKINS] Archiving <https://builds.apache.org/job/DeltaSpike%20OWB%201.1.4%20(JDK%201.7)/ws/deltaspike/core/api/target/deltaspike-core-api-0.5-SNAPSHOT-sources.jar>
to /home/hudson/hudson/jobs/DeltaSpike OWB 1.1.4 (JDK 1.7)/modules/org.apache.deltaspike.core$deltaspike-core-api/builds/2013-08-03_07-19-15/archive/org.apache.deltaspike.core/deltaspike-core-api/0.5-SNAPSHOT/deltaspike-core-api-0.5-SNAPSHOT-sources.jar
[JENKINS] Archiving <https://builds.apache.org/job/DeltaSpike%20OWB%201.1.4%20(JDK%201.7)/ws/deltaspike/modules/servlet/pom.xml>
to /home/hudson/hudson/jobs/DeltaSpike OWB 1.1.4 (JDK 1.7)/modules/org.apache.deltaspike.modules$servlet-module-project/builds/2013-08-03_07-19-15/archive/org.apache.deltaspike.modules/servlet-module-project/0.5-SNAPSHOT/servlet-module-project-0.5-SNAPSHOT.pom
[JENKINS] Archiving <https://builds.apache.org/job/DeltaSpike%20OWB%201.1.4%20(JDK%201.7)/ws/deltaspike/parent/code/pom.xml>
to /home/hudson/hudson/jobs/DeltaSpike OWB 1.1.4 (JDK 1.7)/modules/org.apache.deltaspike$parent-code/builds/2013-08-03_07-19-15/archive/org.apache.deltaspike/parent-code/0.5-SNAPSHOT/parent-code-0.5-SNAPSHOT.pom
[JENKINS] Archiving <https://builds.apache.org/job/DeltaSpike%20OWB%201.1.4%20(JDK%201.7)/ws/deltaspike/parent/code/target/parent-code-0.5-SNAPSHOT-tests.jar>
to /home/hudson/hudson/jobs/DeltaSpike OWB 1.1.4 (JDK 1.7)/modules/org.apache.deltaspike$parent-code/builds/2013-08-03_07-19-15/archive/org.apache.deltaspike/parent-code/0.5-SNAPSHOT/parent-code-0.5-SNAPSHOT-tests.jar
[JENKINS] Archiving <https://builds.apache.org/job/DeltaSpike%20OWB%201.1.4%20(JDK%201.7)/ws/deltaspike/modules/data/impl/pom.xml>
to /home/hudson/hudson/jobs/DeltaSpike OWB 1.1.4 (JDK 1.7)/modules/org.apache.deltaspike.modules$deltaspike-data-module-impl/builds/2013-08-03_07-19-15/archive/org.apache.deltaspike.modules/deltaspike-data-module-impl/0.5-SNAPSHOT/deltaspike-data-module-impl-0.5-SNAPSHOT.pom
[JENKINS] Archiving <https://builds.apache.org/job/DeltaSpike%20OWB%201.1.4%20(JDK%201.7)/ws/deltaspike/modules/pom.xml>
to /home/hudson/hudson/jobs/DeltaSpike OWB 1.1.4 (JDK 1.7)/modules/org.apache.deltaspike.modules$modules-project/builds/2013-08-03_07-19-15/archive/org.apache.deltaspike.modules/modules-project/0.5-SNAPSHOT/modules-project-0.5-SNAPSHOT.pom
[JENKINS] Archiving <https://builds.apache.org/job/DeltaSpike%20OWB%201.1.4%20(JDK%201.7)/ws/deltaspike/modules/jpa/impl/pom.xml>
to /home/hudson/hudson/jobs/DeltaSpike OWB 1.1.4 (JDK 1.7)/modules/org.apache.deltaspike.modules$deltaspike-jpa-module-impl/builds/2013-08-03_07-19-15/archive/org.apache.deltaspike.modules/deltaspike-jpa-module-impl/0.5-SNAPSHOT/deltaspike-jpa-module-impl-0.5-SNAPSHOT.pom
[JENKINS] Archiving <https://builds.apache.org/job/DeltaSpike%20OWB%201.1.4%20(JDK%201.7)/ws/deltaspike/modules/servlet/impl/pom.xml>
to /home/hudson/hudson/jobs/DeltaSpike OWB 1.1.4 (JDK 1.7)/modules/org.apache.deltaspike.modules$deltaspike-servlet-module-impl/builds/2013-08-03_07-19-15/archive/org.apache.deltaspike.modules/deltaspike-servlet-module-impl/0.5-SNAPSHOT/deltaspike-servlet-module-impl-0.5-SNAPSHOT.pom
[JENKINS] Archiving <https://builds.apache.org/job/DeltaSpike%20OWB%201.1.4%20(JDK%201.7)/ws/deltaspike/modules/security/impl/pom.xml>
to /home/hudson/hudson/jobs/DeltaSpike OWB 1.1.4 (JDK 1.7)/modules/org.apache.deltaspike.modules$deltaspike-security-module-impl/builds/2013-08-03_07-19-15/archive/org.apache.deltaspike.modules/deltaspike-security-module-impl/0.5-SNAPSHOT/deltaspike-security-module-impl-0.5-SNAPSHOT.pom
[JENKINS] Archiving <https://builds.apache.org/job/DeltaSpike%20OWB%201.1.4%20(JDK%201.7)/ws/deltaspike/modules/jpa/api/pom.xml>
to /home/hudson/hudson/jobs/DeltaSpike OWB 1.1.4 (JDK 1.7)/modules/org.apache.deltaspike.modules$deltaspike-jpa-module-api/builds/2013-08-03_07-19-15/archive/org.apache.deltaspike.modules/deltaspike-jpa-module-api/0.5-SNAPSHOT/deltaspike-jpa-module-api-0.5-SNAPSHOT.pom
[JENKINS] Archiving <https://builds.apache.org/job/DeltaSpike%20OWB%201.1.4%20(JDK%201.7)/ws/deltaspike/modules/jsf/api/pom.xml>
to /home/hudson/hudson/jobs/DeltaSpike OWB 1.1.4 (JDK 1.7)/modules/org.apache.deltaspike.modules$deltaspike-jsf-module-api/builds/2013-08-03_07-19-15/archive/org.apache.deltaspike.modules/deltaspike-jsf-module-api/0.5-SNAPSHOT/deltaspike-jsf-module-api-0.5-SNAPSHOT.pom
[JENKINS] Archiving <https://builds.apache.org/job/DeltaSpike%20OWB%201.1.4%20(JDK%201.7)/ws/deltaspike/examples/pom.xml>
to /home/hudson/hudson/jobs/DeltaSpike OWB 1.1.4 (JDK 1.7)/modules/org.apache.deltaspike.examples$examples-project/builds/2013-08-03_07-19-15/archive/org.apache.deltaspike.examples/examples-project/0.5-SNAPSHOT/examples-project-0.5-SNAPSHOT.pom
[JENKINS] Archiving <https://builds.apache.org/job/DeltaSpike%20OWB%201.1.4%20(JDK%201.7)/ws/deltaspike/cdictrl/pom.xml>
to /home/hudson/hudson/jobs/DeltaSpike OWB 1.1.4 (JDK 1.7)/modules/org.apache.deltaspike.cdictrl$cdictrl-project/builds/2013-08-03_07-19-15/archive/org.apache.deltaspike.cdictrl/cdictrl-project/0.5-SNAPSHOT/cdictrl-project-0.5-SNAPSHOT.pom
Waiting for Jenkins to finish collecting data
mavenExecutionResult exceptions not empty
message : Internal error: hudson.remoting.RemotingSystemException: java.io.StreamCorruptedException:
invalid handle value: 0050E7B5
cause : java.io.StreamCorruptedException: invalid handle value: 0050E7B5
Stack trace : 
org.apache.maven.InternalErrorException: Internal error: hudson.remoting.RemotingSystemException:
java.io.StreamCorruptedException: invalid handle value: 0050E7B5
	at org.apache.maven.lifecycle.internal.BuilderCommon.handleBuildError(BuilderCommon.java:128)
	at org.apache.maven.lifecycle.internal.LifecycleModuleBuilder.buildProject(LifecycleModuleBuilder.java:95)
	at org.apache.maven.lifecycle.internal.LifecycleModuleBuilder.buildProject(LifecycleModuleBuilder.java:59)
	at org.apache.maven.lifecycle.internal.LifecycleStarter.singleThreadedBuild(LifecycleStarter.java:183)
	at org.apache.maven.lifecycle.internal.LifecycleStarter.execute(LifecycleStarter.java:161)
	at org.apache.maven.DefaultMaven.doExecute(DefaultMaven.java:320)
	at org.apache.maven.DefaultMaven.execute(DefaultMaven.java:156)
	at org.jvnet.hudson.maven3.launcher.Maven3Launcher.main(Maven3Launcher.java:117)
	at sun.reflect.NativeMethodAccessorImpl.invoke0(Native Method)
	at sun.reflect.NativeMethodAccessorImpl.invoke(NativeMethodAccessorImpl.java:57)
	at sun.reflect.DelegatingMethodAccessorImpl.invoke(DelegatingMethodAccessorImpl.java:43)
	at java.lang.reflect.Method.invoke(Method.java:606)
	at org.codehaus.plexus.classworlds.launcher.Launcher.launchStandard(Launcher.java:329)
	at org.codehaus.plexus.classworlds.launcher.Launcher.launch(Launcher.java:239)
	at org.jvnet.hudson.maven3.agent.Maven3Main.launch(Maven3Main.java:178)
	at sun.reflect.NativeMethodAccessorImpl.invoke0(Native Method)
	at sun.reflect.NativeMethodAccessorImpl.invoke(NativeMethodAccessorImpl.java:57)
	at sun.reflect.DelegatingMethodAccessorImpl.invoke(DelegatingMethodAccessorImpl.java:43)
	at java.lang.reflect.Method.invoke(Method.java:606)
	at hudson.maven.Maven3Builder.call(Maven3Builder.java:129)
	at hudson.maven.Maven3Builder.call(Maven3Builder.java:67)
	at hudson.remoting.UserRequest.perform(UserRequest.java:118)
	at hudson.remoting.UserRequest.perform(UserRequest.java:48)
	at hudson.remoting.Request$2.run(Request.java:326)
	at hudson.remoting.InterceptingExecutorService$1.call(InterceptingExecutorService.java:72)
	at java.util.concurrent.FutureTask$Sync.innerRun(FutureTask.java:334)
	at java.util.concurrent.FutureTask.run(FutureTask.java:166)
	at java.util.concurrent.ThreadPoolExecutor.runWorker(ThreadPoolExecutor.java:1145)
	at java.util.concurrent.ThreadPoolExecutor$Worker.run(ThreadPoolExecutor.java:615)
	at java.lang.Thread.run(Thread.java:724)
Caused by: hudson.remoting.RemotingSystemException: java.io.StreamCorruptedException: invalid
handle value: 0050E7B5
	at hudson.remoting.RemoteInvocationHandler.invoke(RemoteInvocationHandler.java:183)
	at com.sun.proxy.$Proxy7.setExecutedMojos(Unknown Source)
	at hudson.maven.MavenBuildProxy$Filter.setExecutedMojos(MavenBuildProxy.java:243)
	at hudson.maven.Maven3Builder$MavenExecutionListener.recordMojoEnded(Maven3Builder.java:574)
	at hudson.maven.Maven3Builder$MavenExecutionListener.mojoSucceeded(Maven3Builder.java:560)
	at org.apache.maven.lifecycle.internal.DefaultExecutionEventCatapult.fire(DefaultExecutionEventCatapult.java:87)
	at org.apache.maven.lifecycle.internal.DefaultExecutionEventCatapult.fire(DefaultExecutionEventCatapult.java:42)
	at org.apache.maven.lifecycle.internal.MojoExecutor.execute(MojoExecutor.java:228)
	at org.apache.maven.lifecycle.internal.MojoExecutor.execute(MojoExecutor.java:153)
	at org.apache.maven.lifecycle.internal.MojoExecutor.execute(MojoExecutor.java:145)
	at org.apache.maven.lifecycle.internal.LifecycleModuleBuilder.buildProject(LifecycleModuleBuilder.java:84)
	... 28 more
Caused by: java.io.StreamCorruptedException: invalid handle value: 0050E7B5
	at java.io.ObjectInputStream.readHandle(ObjectInputStream.java:1452)
	at java.io.ObjectInputStream.readClassDesc(ObjectInputStream.java:1509)
	at java.io.ObjectInputStream.readOrdinaryObject(ObjectInputStream.java:1769)
	at java.io.ObjectInputStream.readObject0(ObjectInputStream.java:1348)
	at java.io.ObjectInputStream.readArray(ObjectInputStream.java:1704)
	at java.io.ObjectInputStream.readObject0(ObjectInputStream.java:1342)
	at java.io.ObjectInputStream.defaultReadFields(ObjectInputStream.java:1989)
	at java.io.ObjectInputStream.defaultReadObject(ObjectInputStream.java:499)
	at java.lang.Throwable.readObject(Throwable.java:913)
	at sun.reflect.GeneratedMethodAccessor129.invoke(Unknown Source)
	at sun.reflect.DelegatingMethodAccessorImpl.invoke(DelegatingMethodAccessorImpl.java:43)
	at java.lang.reflect.Method.invoke(Method.java:606)
	at java.io.ObjectStreamClass.invokeReadObject(ObjectStreamClass.java:1017)
	at java.io.ObjectInputStream.readSerialData(ObjectInputStream.java:1891)
	at java.io.ObjectInputStream.readOrdinaryObject(ObjectInputStream.java:1796)
	at java.io.ObjectInputStream.readObject0(ObjectInputStream.java:1348)
	at java.io.ObjectInputStream.defaultReadFields(ObjectInputStream.java:1989)
	at java.io.ObjectInputStream.readSerialData(ObjectInputStream.java:1913)
	at java.io.ObjectInputStream.readOrdinaryObject(ObjectInputStream.java:1796)
	at java.io.ObjectInputStream.readObject0(ObjectInputStream.java:1348)
	at java.io.ObjectInputStream.readObject(ObjectInputStream.java:370)
	at hudson.remoting.UserRequest.deserialize(UserRequest.java:182)
	at hudson.remoting.UserRequest.perform(UserRequest.java:98)
	... 8 more
Sending e-mails to: deltaspike-commits@incubator.apache.org
channel stopped

Mime
View raw message