deltaspike-commits mailing list archives

Site index · List index
Message view « Date » · « Thread »
Top « Date » · « Thread »
From Apache Jenkins Server <jenk...@builds.apache.org>
Subject Build failed in Jenkins: Deltaspike OWB 1.1.9-SNAPSHOT #43
Date Mon, 08 Jul 2013 01:05:55 GMT
See <https://builds.apache.org/job/Deltaspike%20OWB%201.1.9-SNAPSHOT/43/changes>

Changes:

[gpetracek] updated developer section

[gpetracek] DELTASPIKE-390 support for (optional) custom ConfigPreProcessor for @ViewMetaData

[gpetracek] DELTASPIKE-390 custom ConfigPreProcessor test

[Thomas.Hug] DELTASPIKE-60 remove @author

------------------------------------------
[...truncated 204 lines...]
[INFO] Copying 4 resources
[INFO] 
[INFO] --- maven-compiler-plugin:2.5:compile (default-compile) @ test-utils ---
[INFO] Compiling 6 source files to <https://builds.apache.org/job/Deltaspike%20OWB%201.1.9-SNAPSHOT/ws/deltaspike/test-utils/target/classes>
[INFO] [debug] execute contextualize
[INFO] Using 'UTF-8' encoding to copy filtered resources.
[INFO] skip non existing resourceDirectory <https://builds.apache.org/job/Deltaspike%20OWB%201.1.9-SNAPSHOT/ws/deltaspike/test-utils/src/test/resources>
[INFO] Copying 4 resources
[INFO] Copying 4 resources

[INFO] --- maven-resources-plugin:2.5:testResources (default-testResources) @ test-utils ---
[INFO] [INFO] No sources to compile

[INFO] --- maven-compiler-plugin:2.5:testCompile (default-testCompile) @ test-utils ---
[INFO] 
[INFO] --- maven-surefire-plugin:2.11:test (default-test) @ test-utils ---
[INFO] Surefire report directory: <https://builds.apache.org/job/Deltaspike%20OWB%201.1.9-SNAPSHOT/ws/deltaspike/test-utils/target/surefire-reports>
[INFO] Using configured provider org.apache.maven.surefire.junitcore.JUnitCoreProvider

-------------------------------------------------------
 T E S T S
-------------------------------------------------------
Concurrency config is parallel='none', perCoreThreadCount=true, threadCount=2, useUnlimitedThreads=false

Results :

Tests run: 0, Failures: 0, Errors: 0, Skipped: 0

[JENKINS] Recording test results
[INFO] 
[INFO] --- maven-jar-plugin:2.4:jar (default-jar) @ test-utils ---
[INFO] Building jar: <https://builds.apache.org/job/Deltaspike%20OWB%201.1.9-SNAPSHOT/ws/deltaspike/test-utils/target/test-utils-0.5-SNAPSHOT.jar>
[INFO] 
[INFO] --- maven-site-plugin:3.1:attach-descriptor (attach-descriptor) @ test-utils ---
[INFO] 
[INFO] --- maven-bundle-plugin:2.3.7:cleanVersions (versions) @ test-utils ---
[WARNING] Parameter tasks is deprecated, use target instead
[INFO] 
[INFO] --- maven-antrun-plugin:1.6:run (javadoc.resources) @ test-utils ---
[INFO] Executing tasks

main:
[INFO] Executed tasks
Jul 8, 2013 1:05:07 AM hudson.maven.ExecutedMojo <init>
WARNING: Failed to getClass for org.apache.maven.plugin.source.SourceJarMojo
[INFO] 
[INFO] --- maven-source-plugin:2.1.2:jar (attach-sources) @ test-utils ---
[INFO] META-INF already added, skipping
[INFO] META-INF/NOTICE already added, skipping
[INFO] META-INF/LICENSE already added, skipping
[INFO] META-INF/DEPENDENCIES already added, skipping
[INFO] META-INF/DISCLAIMER already added, skipping
[INFO] META-INF already added, skipping
[INFO] META-INF already added, skipping
[INFO] META-INF/NOTICE already added, skipping
[INFO] META-INF/LICENSE already added, skipping
[INFO] META-INF/DEPENDENCIES already added, skipping
[INFO] META-INF/DISCLAIMER already added, skipping
[INFO] META-INF already added, skipping
[INFO] META-INF/NOTICE already added, skipping
[INFO] META-INF/LICENSE already added, skipping
[INFO] META-INF/DEPENDENCIES already added, skipping
[INFO] META-INF/DISCLAIMER already added, skipping
[INFO] Building jar: <https://builds.apache.org/job/Deltaspike%20OWB%201.1.9-SNAPSHOT/ws/deltaspike/test-utils/target/test-utils-0.5-SNAPSHOT-sources.jar>
[INFO] META-INF already added, skipping
[INFO] META-INF/NOTICE already added, skipping
[INFO] META-INF/LICENSE already added, skipping
[INFO] META-INF/DEPENDENCIES already added, skipping
[INFO] META-INF/DISCLAIMER already added, skipping
[INFO] META-INF already added, skipping
[INFO] META-INF already added, skipping
[INFO] META-INF/NOTICE already added, skipping
[INFO] META-INF/LICENSE already added, skipping
[INFO] META-INF/DEPENDENCIES already added, skipping
[INFO] META-INF/DISCLAIMER already added, skipping
[INFO] META-INF already added, skipping
[INFO] META-INF/NOTICE already added, skipping
[INFO] META-INF/LICENSE already added, skipping
[INFO] META-INF/DEPENDENCIES already added, skipping
[INFO] META-INF/DISCLAIMER already added, skipping
[INFO] ------------------------------------------------------------------------
[INFO] Reactor Summary:
[INFO] 
[INFO] Apache DeltaSpike ................................. SUCCESS [23.598s]
[INFO] Apache DeltaSpike CheckStyle-rules ................ SUCCESS [3.012s]
[INFO] Apache DeltaSpike Parent .......................... SUCCESS [5.332s]
[INFO] Apache DeltaSpike Test-Utils ...................... FAILURE [8.332s]
[INFO] Apache DeltaSpike Code Parent ..................... SKIPPED
[INFO] Apache DeltaSpike Core ............................ SKIPPED
[INFO] Apache DeltaSpike Core-API ........................ SKIPPED
[INFO] Apache DeltaSpike Core-Implementation ............. SKIPPED
[INFO] Apache DeltaSpike ContainerControl parent ......... SKIPPED
[INFO] Apache DeltaSpike CDI ContainerControl API ........ SKIPPED
[INFO] Apache DeltaSpike CDI ContainerControl TCK ........ SKIPPED
[INFO] Apache DeltaSpike CDI OWB-ContainerControl ........ SKIPPED
[INFO] Apache DeltaSpike CDI Weld-ContainerControl ....... SKIPPED
[INFO] Apache DeltaSpike CDI OpenEJB-ContainerControl .... SKIPPED
[INFO] Apache DeltaSpike Modules ......................... SKIPPED
[INFO] Apache DeltaSpike Security-Module ................. SKIPPED
[INFO] Apache DeltaSpike Security-Module API ............. SKIPPED
[INFO] Apache DeltaSpike Security-Module Impl ............ SKIPPED
[INFO] Apache DeltaSpike JPA-Module ...................... SKIPPED
[INFO] Apache DeltaSpike JPA-Module API .................. SKIPPED
[INFO] Apache DeltaSpike JPA-Module Impl ................. SKIPPED
[INFO] Apache DeltaSpike Servlet-Module .................. SKIPPED
[INFO] Apache DeltaSpike Servlet-Module API .............. SKIPPED
[INFO] Apache DeltaSpike Servlet-Module Impl ............. SKIPPED
[INFO] Apache DeltaSpike JSF-Module ...................... SKIPPED
[INFO] Apache DeltaSpike JSF-Module API .................. SKIPPED
[INFO] Apache DeltaSpike JSF-Module Impl ................. SKIPPED
[INFO] Apache DeltaSpike Partial-Bean-Module ............. SKIPPED
[INFO] Apache DeltaSpike Partial-Bean-Module API ......... SKIPPED
[INFO] Apache DeltaSpike Partial-Bean-Module Impl ........ SKIPPED
[INFO] Apache DeltaSpike BeanValidation-Module ........... SKIPPED
[INFO] Apache DeltaSpike BeanValidation-Module API ....... SKIPPED
[INFO] Apache DeltaSpike BeanValidation-Module Impl ...... SKIPPED
[INFO] Apache DeltaSpike Data-Module ..................... SKIPPED
[INFO] Apache DeltaSpike Data-Module API ................. SKIPPED
[INFO] Apache DeltaSpike Data-Module Impl ................ SKIPPED
[INFO] Apache DeltaSpike Examples ........................ SKIPPED
[INFO] Apache DeltaSpike Java-SE Examples ................ SKIPPED
[INFO] Apache DeltaSpike JSF Examples .................... SKIPPED
[INFO] ------------------------------------------------------------------------
[INFO] BUILD FAILURE
[INFO] ------------------------------------------------------------------------
[INFO] Total time: 43.946s
[INFO] Finished at: Mon Jul 08 01:05:12 UTC 2013
[INFO] Final Memory: 29M/127M
[INFO] ------------------------------------------------------------------------
[JENKINS] Archiving <https://builds.apache.org/job/Deltaspike%20OWB%201.1.9-SNAPSHOT/ws/deltaspike/pom.xml>
to /home/hudson/hudson/jobs/Deltaspike OWB 1.1.9-SNAPSHOT/modules/org.apache.deltaspike$deltaspike-project/builds/2013-07-08_01-04-15/archive/org.apache.deltaspike/deltaspike-project/0.5-SNAPSHOT/deltaspike-project-0.5-SNAPSHOT.pom
[JENKINS] Archiving <https://builds.apache.org/job/Deltaspike%20OWB%201.1.9-SNAPSHOT/ws/deltaspike/modules/partial-bean/impl/pom.xml>
to /home/hudson/hudson/jobs/Deltaspike OWB 1.1.9-SNAPSHOT/modules/org.apache.deltaspike.modules$deltaspike-partial-bean-module-impl/builds/2013-07-08_01-04-15/archive/org.apache.deltaspike.modules/deltaspike-partial-bean-module-impl/0.5-SNAPSHOT/deltaspike-partial-bean-module-impl-0.5-SNAPSHOT.pom
[JENKINS] Archiving <https://builds.apache.org/job/Deltaspike%20OWB%201.1.9-SNAPSHOT/ws/deltaspike/cdictrl/impl-openejb/pom.xml>
to /home/hudson/hudson/jobs/Deltaspike OWB 1.1.9-SNAPSHOT/modules/org.apache.deltaspike.cdictrl$deltaspike-cdictrl-openejb/builds/2013-07-08_01-04-15/archive/org.apache.deltaspike.cdictrl/deltaspike-cdictrl-openejb/0.5-SNAPSHOT/deltaspike-cdictrl-openejb-0.5-SNAPSHOT.pom
[JENKINS] Archiving <https://builds.apache.org/job/Deltaspike%20OWB%201.1.9-SNAPSHOT/ws/deltaspike/cdictrl/api/pom.xml>
to /home/hudson/hudson/jobs/Deltaspike OWB 1.1.9-SNAPSHOT/modules/org.apache.deltaspike.cdictrl$deltaspike-cdictrl-api/builds/2013-07-08_01-04-15/archive/org.apache.deltaspike.cdictrl/deltaspike-cdictrl-api/0.5-SNAPSHOT/deltaspike-cdictrl-api-0.5-SNAPSHOT.pom
[JENKINS] Archiving <https://builds.apache.org/job/Deltaspike%20OWB%201.1.9-SNAPSHOT/ws/deltaspike/test-utils/pom.xml>
to /home/hudson/hudson/jobs/Deltaspike OWB 1.1.9-SNAPSHOT/modules/org.apache.deltaspike.test$test-utils/builds/2013-07-08_01-04-15/archive/org.apache.deltaspike.test/test-utils/0.5-SNAPSHOT/test-utils-0.5-SNAPSHOT.pom
[JENKINS] Archiving <https://builds.apache.org/job/Deltaspike%20OWB%201.1.9-SNAPSHOT/ws/deltaspike/test-utils/target/test-utils-0.5-SNAPSHOT.jar>
to /home/hudson/hudson/jobs/Deltaspike OWB 1.1.9-SNAPSHOT/modules/org.apache.deltaspike.test$test-utils/builds/2013-07-08_01-04-15/archive/org.apache.deltaspike.test/test-utils/0.5-SNAPSHOT/test-utils-0.5-SNAPSHOT.jar
[JENKINS] Archiving <https://builds.apache.org/job/Deltaspike%20OWB%201.1.9-SNAPSHOT/ws/deltaspike/test-utils/target/test-utils-0.5-SNAPSHOT-sources.jar>
to /home/hudson/hudson/jobs/Deltaspike OWB 1.1.9-SNAPSHOT/modules/org.apache.deltaspike.test$test-utils/builds/2013-07-08_01-04-15/archive/org.apache.deltaspike.test/test-utils/0.5-SNAPSHOT/test-utils-0.5-SNAPSHOT-sources.jar
[JENKINS] Archiving <https://builds.apache.org/job/Deltaspike%20OWB%201.1.9-SNAPSHOT/ws/deltaspike/core/impl/pom.xml>
to /home/hudson/hudson/jobs/Deltaspike OWB 1.1.9-SNAPSHOT/modules/org.apache.deltaspike.core$deltaspike-core-impl/builds/2013-07-08_01-04-15/archive/org.apache.deltaspike.core/deltaspike-core-impl/0.5-SNAPSHOT/deltaspike-core-impl-0.5-SNAPSHOT.pom
[JENKINS] Archiving <https://builds.apache.org/job/Deltaspike%20OWB%201.1.9-SNAPSHOT/ws/deltaspike/modules/data/api/pom.xml>
to /home/hudson/hudson/jobs/Deltaspike OWB 1.1.9-SNAPSHOT/modules/org.apache.deltaspike.modules$deltaspike-data-module-api/builds/2013-07-08_01-04-15/archive/org.apache.deltaspike.modules/deltaspike-data-module-api/0.5-SNAPSHOT/deltaspike-data-module-api-0.5-SNAPSHOT.pom
[JENKINS] Archiving <https://builds.apache.org/job/Deltaspike%20OWB%201.1.9-SNAPSHOT/ws/deltaspike/modules/jsf/impl/pom.xml>
to /home/hudson/hudson/jobs/Deltaspike OWB 1.1.9-SNAPSHOT/modules/org.apache.deltaspike.modules$deltaspike-jsf-module-impl/builds/2013-07-08_01-04-15/archive/org.apache.deltaspike.modules/deltaspike-jsf-module-impl/0.5-SNAPSHOT/deltaspike-jsf-module-impl-0.5-SNAPSHOT.pom
[JENKINS] Archiving <https://builds.apache.org/job/Deltaspike%20OWB%201.1.9-SNAPSHOT/ws/deltaspike/modules/partial-bean/pom.xml>
to /home/hudson/hudson/jobs/Deltaspike OWB 1.1.9-SNAPSHOT/modules/org.apache.deltaspike.modules$partial-bean-module-project/builds/2013-07-08_01-04-15/archive/org.apache.deltaspike.modules/partial-bean-module-project/0.5-SNAPSHOT/partial-bean-module-project-0.5-SNAPSHOT.pom
[JENKINS] Archiving <https://builds.apache.org/job/Deltaspike%20OWB%201.1.9-SNAPSHOT/ws/deltaspike/modules/data/pom.xml>
to /home/hudson/hudson/jobs/Deltaspike OWB 1.1.9-SNAPSHOT/modules/org.apache.deltaspike.modules$data-module-project/builds/2013-07-08_01-04-15/archive/org.apache.deltaspike.modules/data-module-project/0.5-SNAPSHOT/data-module-project-0.5-SNAPSHOT.pom
[JENKINS] Archiving <https://builds.apache.org/job/Deltaspike%20OWB%201.1.9-SNAPSHOT/ws/deltaspike/cdictrl/tck/pom.xml>
to /home/hudson/hudson/jobs/Deltaspike OWB 1.1.9-SNAPSHOT/modules/org.apache.deltaspike.test$deltaspike-cdictrl-tck/builds/2013-07-08_01-04-15/archive/org.apache.deltaspike.test/deltaspike-cdictrl-tck/0.5-SNAPSHOT/deltaspike-cdictrl-tck-0.5-SNAPSHOT.pom
[JENKINS] Archiving <https://builds.apache.org/job/Deltaspike%20OWB%201.1.9-SNAPSHOT/ws/deltaspike/modules/bean-validation/pom.xml>
to /home/hudson/hudson/jobs/Deltaspike OWB 1.1.9-SNAPSHOT/modules/org.apache.deltaspike.modules$bean-validation-module-project/builds/2013-07-08_01-04-15/archive/org.apache.deltaspike.modules/bean-validation-module-project/0.5-SNAPSHOT/bean-validation-module-project-0.5-SNAPSHOT.pom
[JENKINS] Archiving <https://builds.apache.org/job/Deltaspike%20OWB%201.1.9-SNAPSHOT/ws/deltaspike/core/pom.xml>
to /home/hudson/hudson/jobs/Deltaspike OWB 1.1.9-SNAPSHOT/modules/org.apache.deltaspike.core$core-project/builds/2013-07-08_01-04-15/archive/org.apache.deltaspike.core/core-project/0.5-SNAPSHOT/core-project-0.5-SNAPSHOT.pom
[JENKINS] Archiving <https://builds.apache.org/job/Deltaspike%20OWB%201.1.9-SNAPSHOT/ws/deltaspike/modules/bean-validation/impl/pom.xml>
to /home/hudson/hudson/jobs/Deltaspike OWB 1.1.9-SNAPSHOT/modules/org.apache.deltaspike.modules$deltaspike-bean-validation-module-impl/builds/2013-07-08_01-04-15/archive/org.apache.deltaspike.modules/deltaspike-bean-validation-module-impl/0.5-SNAPSHOT/deltaspike-bean-validation-module-impl-0.5-SNAPSHOT.pom
[JENKINS] Archiving <https://builds.apache.org/job/Deltaspike%20OWB%201.1.9-SNAPSHOT/ws/deltaspike/checkstyle-rules/pom.xml>
to /home/hudson/hudson/jobs/Deltaspike OWB 1.1.9-SNAPSHOT/modules/org.apache.deltaspike$checkstyle-rules/builds/2013-07-08_01-04-15/archive/org.apache.deltaspike/checkstyle-rules/0.5-SNAPSHOT/checkstyle-rules-0.5-SNAPSHOT.pom
[JENKINS] Archiving <https://builds.apache.org/job/Deltaspike%20OWB%201.1.9-SNAPSHOT/ws/deltaspike/checkstyle-rules/target/checkstyle-rules-0.5-SNAPSHOT.jar>
to /home/hudson/hudson/jobs/Deltaspike OWB 1.1.9-SNAPSHOT/modules/org.apache.deltaspike$checkstyle-rules/builds/2013-07-08_01-04-15/archive/org.apache.deltaspike/checkstyle-rules/0.5-SNAPSHOT/checkstyle-rules-0.5-SNAPSHOT.jar
[JENKINS] Archiving <https://builds.apache.org/job/Deltaspike%20OWB%201.1.9-SNAPSHOT/ws/deltaspike/modules/servlet/api/pom.xml>
to /home/hudson/hudson/jobs/Deltaspike OWB 1.1.9-SNAPSHOT/modules/org.apache.deltaspike.modules$deltaspike-servlet-module-api/builds/2013-07-08_01-04-15/archive/org.apache.deltaspike.modules/deltaspike-servlet-module-api/0.5-SNAPSHOT/deltaspike-servlet-module-api-0.5-SNAPSHOT.pom
[JENKINS] Archiving <https://builds.apache.org/job/Deltaspike%20OWB%201.1.9-SNAPSHOT/ws/deltaspike/examples/jsf-examples/pom.xml>
to /home/hudson/hudson/jobs/Deltaspike OWB 1.1.9-SNAPSHOT/modules/org.apache.deltaspike.examples$deltaspike-jsf-example/builds/2013-07-08_01-04-15/archive/org.apache.deltaspike.examples/deltaspike-jsf-example/0.5-SNAPSHOT/deltaspike-jsf-example-0.5-SNAPSHOT.pom
[JENKINS] Archiving <https://builds.apache.org/job/Deltaspike%20OWB%201.1.9-SNAPSHOT/ws/deltaspike/modules/security/api/pom.xml>
to /home/hudson/hudson/jobs/Deltaspike OWB 1.1.9-SNAPSHOT/modules/org.apache.deltaspike.modules$deltaspike-security-module-api/builds/2013-07-08_01-04-15/archive/org.apache.deltaspike.modules/deltaspike-security-module-api/0.5-SNAPSHOT/deltaspike-security-module-api-0.5-SNAPSHOT.pom
[JENKINS] Archiving <https://builds.apache.org/job/Deltaspike%20OWB%201.1.9-SNAPSHOT/ws/deltaspike/modules/jpa/pom.xml>
to /home/hudson/hudson/jobs/Deltaspike OWB 1.1.9-SNAPSHOT/modules/org.apache.deltaspike.modules$jpa-module-project/builds/2013-07-08_01-04-15/archive/org.apache.deltaspike.modules/jpa-module-project/0.5-SNAPSHOT/jpa-module-project-0.5-SNAPSHOT.pom
[JENKINS] Archiving <https://builds.apache.org/job/Deltaspike%20OWB%201.1.9-SNAPSHOT/ws/deltaspike/parent/pom.xml>
to /home/hudson/hudson/jobs/Deltaspike OWB 1.1.9-SNAPSHOT/modules/org.apache.deltaspike$parent/builds/2013-07-08_01-04-15/archive/org.apache.deltaspike/parent/0.5-SNAPSHOT/parent-0.5-SNAPSHOT.pom
[JENKINS] Archiving <https://builds.apache.org/job/Deltaspike%20OWB%201.1.9-SNAPSHOT/ws/deltaspike/cdictrl/impl-weld/pom.xml>
to /home/hudson/hudson/jobs/Deltaspike OWB 1.1.9-SNAPSHOT/modules/org.apache.deltaspike.cdictrl$deltaspike-cdictrl-weld/builds/2013-07-08_01-04-15/archive/org.apache.deltaspike.cdictrl/deltaspike-cdictrl-weld/0.5-SNAPSHOT/deltaspike-cdictrl-weld-0.5-SNAPSHOT.pom
[JENKINS] Archiving <https://builds.apache.org/job/Deltaspike%20OWB%201.1.9-SNAPSHOT/ws/deltaspike/examples/jse-examples/pom.xml>
to /home/hudson/hudson/jobs/Deltaspike OWB 1.1.9-SNAPSHOT/modules/org.apache.deltaspike.examples$deltaspike-jse-example/builds/2013-07-08_01-04-15/archive/org.apache.deltaspike.examples/deltaspike-jse-example/0.5-SNAPSHOT/deltaspike-jse-example-0.5-SNAPSHOT.pom
[JENKINS] Archiving <https://builds.apache.org/job/Deltaspike%20OWB%201.1.9-SNAPSHOT/ws/deltaspike/modules/partial-bean/api/pom.xml>
to /home/hudson/hudson/jobs/Deltaspike OWB 1.1.9-SNAPSHOT/modules/org.apache.deltaspike.modules$deltaspike-partial-bean-module-api/builds/2013-07-08_01-04-15/archive/org.apache.deltaspike.modules/deltaspike-partial-bean-module-api/0.5-SNAPSHOT/deltaspike-partial-bean-module-api-0.5-SNAPSHOT.pom
[JENKINS] Archiving <https://builds.apache.org/job/Deltaspike%20OWB%201.1.9-SNAPSHOT/ws/deltaspike/modules/security/pom.xml>
to /home/hudson/hudson/jobs/Deltaspike OWB 1.1.9-SNAPSHOT/modules/org.apache.deltaspike.modules$security-module-project/builds/2013-07-08_01-04-15/archive/org.apache.deltaspike.modules/security-module-project/0.5-SNAPSHOT/security-module-project-0.5-SNAPSHOT.pom
[JENKINS] Archiving <https://builds.apache.org/job/Deltaspike%20OWB%201.1.9-SNAPSHOT/ws/deltaspike/cdictrl/impl-owb/pom.xml>
to /home/hudson/hudson/jobs/Deltaspike OWB 1.1.9-SNAPSHOT/modules/org.apache.deltaspike.cdictrl$deltaspike-cdictrl-owb/builds/2013-07-08_01-04-15/archive/org.apache.deltaspike.cdictrl/deltaspike-cdictrl-owb/0.5-SNAPSHOT/deltaspike-cdictrl-owb-0.5-SNAPSHOT.pom
[JENKINS] Archiving <https://builds.apache.org/job/Deltaspike%20OWB%201.1.9-SNAPSHOT/ws/deltaspike/modules/jsf/pom.xml>
to /home/hudson/hudson/jobs/Deltaspike OWB 1.1.9-SNAPSHOT/modules/org.apache.deltaspike.modules$jsf-module-project/builds/2013-07-08_01-04-15/archive/org.apache.deltaspike.modules/jsf-module-project/0.5-SNAPSHOT/jsf-module-project-0.5-SNAPSHOT.pom
[JENKINS] Archiving <https://builds.apache.org/job/Deltaspike%20OWB%201.1.9-SNAPSHOT/ws/deltaspike/modules/bean-validation/api/pom.xml>
to /home/hudson/hudson/jobs/Deltaspike OWB 1.1.9-SNAPSHOT/modules/org.apache.deltaspike.modules$deltaspike-bean-validation-module-api/builds/2013-07-08_01-04-15/archive/org.apache.deltaspike.modules/deltaspike-bean-validation-module-api/0.5-SNAPSHOT/deltaspike-bean-validation-module-api-0.5-SNAPSHOT.pom
[JENKINS] Archiving <https://builds.apache.org/job/Deltaspike%20OWB%201.1.9-SNAPSHOT/ws/deltaspike/core/api/pom.xml>
to /home/hudson/hudson/jobs/Deltaspike OWB 1.1.9-SNAPSHOT/modules/org.apache.deltaspike.core$deltaspike-core-api/builds/2013-07-08_01-04-15/archive/org.apache.deltaspike.core/deltaspike-core-api/0.5-SNAPSHOT/deltaspike-core-api-0.5-SNAPSHOT.pom
[JENKINS] Archiving <https://builds.apache.org/job/Deltaspike%20OWB%201.1.9-SNAPSHOT/ws/deltaspike/modules/servlet/pom.xml>
to /home/hudson/hudson/jobs/Deltaspike OWB 1.1.9-SNAPSHOT/modules/org.apache.deltaspike.modules$servlet-module-project/builds/2013-07-08_01-04-15/archive/org.apache.deltaspike.modules/servlet-module-project/0.5-SNAPSHOT/servlet-module-project-0.5-SNAPSHOT.pom
[JENKINS] Archiving <https://builds.apache.org/job/Deltaspike%20OWB%201.1.9-SNAPSHOT/ws/deltaspike/parent/code/pom.xml>
to /home/hudson/hudson/jobs/Deltaspike OWB 1.1.9-SNAPSHOT/modules/org.apache.deltaspike$parent-code/builds/2013-07-08_01-04-15/archive/org.apache.deltaspike/parent-code/0.5-SNAPSHOT/parent-code-0.5-SNAPSHOT.pom
[JENKINS] Archiving <https://builds.apache.org/job/Deltaspike%20OWB%201.1.9-SNAPSHOT/ws/deltaspike/modules/data/impl/pom.xml>
to /home/hudson/hudson/jobs/Deltaspike OWB 1.1.9-SNAPSHOT/modules/org.apache.deltaspike.modules$deltaspike-data-module-impl/builds/2013-07-08_01-04-15/archive/org.apache.deltaspike.modules/deltaspike-data-module-impl/0.5-SNAPSHOT/deltaspike-data-module-impl-0.5-SNAPSHOT.pom
[JENKINS] Archiving <https://builds.apache.org/job/Deltaspike%20OWB%201.1.9-SNAPSHOT/ws/deltaspike/modules/pom.xml>
to /home/hudson/hudson/jobs/Deltaspike OWB 1.1.9-SNAPSHOT/modules/org.apache.deltaspike.modules$modules-project/builds/2013-07-08_01-04-15/archive/org.apache.deltaspike.modules/modules-project/0.5-SNAPSHOT/modules-project-0.5-SNAPSHOT.pom
[JENKINS] Archiving <https://builds.apache.org/job/Deltaspike%20OWB%201.1.9-SNAPSHOT/ws/deltaspike/modules/jpa/impl/pom.xml>
to /home/hudson/hudson/jobs/Deltaspike OWB 1.1.9-SNAPSHOT/modules/org.apache.deltaspike.modules$deltaspike-jpa-module-impl/builds/2013-07-08_01-04-15/archive/org.apache.deltaspike.modules/deltaspike-jpa-module-impl/0.5-SNAPSHOT/deltaspike-jpa-module-impl-0.5-SNAPSHOT.pom
[JENKINS] Archiving <https://builds.apache.org/job/Deltaspike%20OWB%201.1.9-SNAPSHOT/ws/deltaspike/modules/servlet/impl/pom.xml>
to /home/hudson/hudson/jobs/Deltaspike OWB 1.1.9-SNAPSHOT/modules/org.apache.deltaspike.modules$deltaspike-servlet-module-impl/builds/2013-07-08_01-04-15/archive/org.apache.deltaspike.modules/deltaspike-servlet-module-impl/0.5-SNAPSHOT/deltaspike-servlet-module-impl-0.5-SNAPSHOT.pom
[JENKINS] Archiving <https://builds.apache.org/job/Deltaspike%20OWB%201.1.9-SNAPSHOT/ws/deltaspike/modules/security/impl/pom.xml>
to /home/hudson/hudson/jobs/Deltaspike OWB 1.1.9-SNAPSHOT/modules/org.apache.deltaspike.modules$deltaspike-security-module-impl/builds/2013-07-08_01-04-15/archive/org.apache.deltaspike.modules/deltaspike-security-module-impl/0.5-SNAPSHOT/deltaspike-security-module-impl-0.5-SNAPSHOT.pom
[JENKINS] Archiving <https://builds.apache.org/job/Deltaspike%20OWB%201.1.9-SNAPSHOT/ws/deltaspike/modules/jpa/api/pom.xml>
to /home/hudson/hudson/jobs/Deltaspike OWB 1.1.9-SNAPSHOT/modules/org.apache.deltaspike.modules$deltaspike-jpa-module-api/builds/2013-07-08_01-04-15/archive/org.apache.deltaspike.modules/deltaspike-jpa-module-api/0.5-SNAPSHOT/deltaspike-jpa-module-api-0.5-SNAPSHOT.pom
[JENKINS] Archiving <https://builds.apache.org/job/Deltaspike%20OWB%201.1.9-SNAPSHOT/ws/deltaspike/modules/jsf/api/pom.xml>
to /home/hudson/hudson/jobs/Deltaspike OWB 1.1.9-SNAPSHOT/modules/org.apache.deltaspike.modules$deltaspike-jsf-module-api/builds/2013-07-08_01-04-15/archive/org.apache.deltaspike.modules/deltaspike-jsf-module-api/0.5-SNAPSHOT/deltaspike-jsf-module-api-0.5-SNAPSHOT.pom
[JENKINS] Archiving <https://builds.apache.org/job/Deltaspike%20OWB%201.1.9-SNAPSHOT/ws/deltaspike/examples/pom.xml>
to /home/hudson/hudson/jobs/Deltaspike OWB 1.1.9-SNAPSHOT/modules/org.apache.deltaspike.examples$examples-project/builds/2013-07-08_01-04-15/archive/org.apache.deltaspike.examples/examples-project/0.5-SNAPSHOT/examples-project-0.5-SNAPSHOT.pom
[JENKINS] Archiving <https://builds.apache.org/job/Deltaspike%20OWB%201.1.9-SNAPSHOT/ws/deltaspike/cdictrl/pom.xml>
to /home/hudson/hudson/jobs/Deltaspike OWB 1.1.9-SNAPSHOT/modules/org.apache.deltaspike.cdictrl$cdictrl-project/builds/2013-07-08_01-04-15/archive/org.apache.deltaspike.cdictrl/cdictrl-project/0.5-SNAPSHOT/cdictrl-project-0.5-SNAPSHOT.pom
Waiting for Jenkins to finish collecting data
mavenExecutionResult exceptions not empty
message : Internal error: java.lang.reflect.UndeclaredThrowableException
cause : null
Stack trace : 
org.apache.maven.InternalErrorException: Internal error: java.lang.reflect.UndeclaredThrowableException
	at org.apache.maven.lifecycle.internal.BuilderCommon.handleBuildError(BuilderCommon.java:128)
	at org.apache.maven.lifecycle.internal.LifecycleModuleBuilder.buildProject(LifecycleModuleBuilder.java:95)
	at org.apache.maven.lifecycle.internal.LifecycleModuleBuilder.buildProject(LifecycleModuleBuilder.java:59)
	at org.apache.maven.lifecycle.internal.LifecycleStarter.singleThreadedBuild(LifecycleStarter.java:183)
	at org.apache.maven.lifecycle.internal.LifecycleStarter.execute(LifecycleStarter.java:161)
	at org.apache.maven.DefaultMaven.doExecute(DefaultMaven.java:320)
	at org.apache.maven.DefaultMaven.execute(DefaultMaven.java:156)
	at org.jvnet.hudson.maven3.launcher.Maven3Launcher.main(Maven3Launcher.java:79)
	at sun.reflect.NativeMethodAccessorImpl.invoke0(Native Method)
	at sun.reflect.NativeMethodAccessorImpl.invoke(NativeMethodAccessorImpl.java:39)
	at sun.reflect.DelegatingMethodAccessorImpl.invoke(DelegatingMethodAccessorImpl.java:25)
	at java.lang.reflect.Method.invoke(Method.java:597)
	at org.codehaus.plexus.classworlds.launcher.Launcher.launchStandard(Launcher.java:329)
	at org.codehaus.plexus.classworlds.launcher.Launcher.launch(Launcher.java:239)
	at org.jvnet.hudson.maven3.agent.Maven3Main.launch(Maven3Main.java:158)
	at hudson.maven.Maven3Builder.call(Maven3Builder.java:100)
	at hudson.maven.Maven3Builder.call(Maven3Builder.java:66)
	at hudson.remoting.UserRequest.perform(UserRequest.java:118)
	at hudson.remoting.UserRequest.perform(UserRequest.java:48)
	at hudson.remoting.Request$2.run(Request.java:326)
	at hudson.remoting.InterceptingExecutorService$1.call(InterceptingExecutorService.java:72)
	at java.util.concurrent.FutureTask$Sync.innerRun(FutureTask.java:303)
	at java.util.concurrent.FutureTask.run(FutureTask.java:138)
	at java.util.concurrent.ThreadPoolExecutor$Worker.runTask(ThreadPoolExecutor.java:895)
	at java.util.concurrent.ThreadPoolExecutor$Worker.run(ThreadPoolExecutor.java:918)
	at java.lang.Thread.run(Thread.java:662)
Caused by: java.lang.reflect.UndeclaredThrowableException
	at com.sun.proxy.$Proxy2.setExecutedMojos(Unknown Source)
	at hudson.maven.MavenBuildProxy$Filter.setExecutedMojos(MavenBuildProxy.java:243)
	at hudson.maven.Maven3Builder$MavenExecutionListener.recordMojoEnded(Maven3Builder.java:439)
	at hudson.maven.Maven3Builder$MavenExecutionListener.mojoSucceeded(Maven3Builder.java:425)
	at org.apache.maven.lifecycle.internal.DefaultExecutionEventCatapult.fire(DefaultExecutionEventCatapult.java:87)
	at org.apache.maven.lifecycle.internal.DefaultExecutionEventCatapult.fire(DefaultExecutionEventCatapult.java:42)
	at org.apache.maven.lifecycle.internal.MojoExecutor.execute(MojoExecutor.java:228)
	at org.apache.maven.lifecycle.internal.MojoExecutor.execute(MojoExecutor.java:153)
	at org.apache.maven.lifecycle.internal.MojoExecutor.execute(MojoExecutor.java:145)
	at org.apache.maven.lifecycle.internal.LifecycleModuleBuilder.buildProject(LifecycleModuleBuilder.java:84)
	... 24 more
Caused by: java.io.StreamCorruptedException: invalid type code: 25
	at java.io.ObjectInputStream.readObject0(ObjectInputStream.java:1374)
	at java.io.ObjectInputStream.defaultReadFields(ObjectInputStream.java:1970)
	at java.io.ObjectInputStream.readSerialData(ObjectInputStream.java:1894)
	at java.io.ObjectInputStream.readOrdinaryObject(ObjectInputStream.java:1777)
	at java.io.ObjectInputStream.readObject0(ObjectInputStream.java:1347)
	at java.io.ObjectInputStream.readObject(ObjectInputStream.java:369)
	at java.util.concurrent.CopyOnWriteArrayList.readObject(CopyOnWriteArrayList.java:879)
	at sun.reflect.GeneratedMethodAccessor15361.invoke(Unknown Source)
	at sun.reflect.DelegatingMethodAccessorImpl.invoke(DelegatingMethodAccessorImpl.java:43)
	at java.lang.reflect.Method.invoke(Method.java:601)
	at java.io.ObjectStreamClass.invokeReadObject(ObjectStreamClass.java:1004)
	at java.io.ObjectInputStream.readSerialData(ObjectInputStream.java:1872)
	at java.io.ObjectInputStream.readOrdinaryObject(ObjectInputStream.java:1777)
	at java.io.ObjectInputStream.readObject0(ObjectInputStream.java:1347)
	at java.io.ObjectInputStream.readArray(ObjectInputStream.java:1685)
	at java.io.ObjectInputStream.readObject0(ObjectInputStream.java:1341)
	at java.io.ObjectInputStream.defaultReadFields(ObjectInputStream.java:1970)
	at java.io.ObjectInputStream.readSerialData(ObjectInputStream.java:1894)
	at java.io.ObjectInputStream.readOrdinaryObject(ObjectInputStream.java:1777)
	at java.io.ObjectInputStream.readObject0(ObjectInputStream.java:1347)
	at java.io.ObjectInputStream.readObject(ObjectInputStream.java:369)
	at hudson.remoting.UserRequest.deserialize(UserRequest.java:182)
	at hudson.remoting.UserRequest.perform(UserRequest.java:98)
	at hudson.remoting.UserRequest.perform(UserRequest.java:48)
	at hudson.remoting.Request$2.run(Request.java:326)
	at hudson.remoting.InterceptingExecutorService$1.call(InterceptingExecutorService.java:72)
	at java.util.concurrent.FutureTask$Sync.innerRun(FutureTask.java:334)
	at java.util.concurrent.FutureTask.run(FutureTask.java:166)
	at java.util.concurrent.ThreadPoolExecutor.runWorker(ThreadPoolExecutor.java:1145)
	at java.util.concurrent.ThreadPoolExecutor$Worker.run(ThreadPoolExecutor.java:615)
	at java.lang.Thread.run(Thread.java:722)
Sending e-mails to: deltaspike-commits@incubator.apache.org
channel stopped

Mime
View raw message