deltaspike-commits mailing list archives

Site index · List index
Message view « Date » · « Thread »
Top « Date » · « Thread »
From Apache Jenkins Server <jenk...@builds.apache.org>
Subject Build failed in Jenkins: DeltaSpike Weld 2.0.0 #21
Date Mon, 29 Jul 2013 10:40:17 GMT
See <https://builds.apache.org/job/DeltaSpike%20Weld%202.0.0/21/changes>

Changes:

[struberg] DELTASPIKE-397 handle hashCode, etc on MessageBundles

[Thomas.Hug] DELTASPIKE-391 Remove ApplicationScope, not required by PartialBeans anymore

[struberg] make sure our MessageBundle mesages are fully Serializable

------------------------------------------
[...truncated 810 lines...]
INFO: 
Jul 29, 2013 10:36:46 AM org.apache.maven.cli.event.ExecutionEventLogger mojoStarted
INFO: --- maven-resources-plugin:2.5:testResources (default-testResources) @ deltaspike-core-impl
---
[debug] execute contextualize
[INFO] Using 'UTF-8' encoding to copy filtered resources.
[INFO] Copying 11 resources
[INFO] Copying 4 resources
[INFO] Copying 4 resources
Jul 29, 2013 10:36:46 AM org.apache.maven.cli.event.ExecutionEventLogger mojoStarted
INFO: 
Jul 29, 2013 10:36:46 AM org.apache.maven.cli.event.ExecutionEventLogger mojoStarted
INFO: --- maven-compiler-plugin:2.5:testCompile (default-testCompile) @ deltaspike-core-impl
---
[INFO] Compiling 125 source files to <https://builds.apache.org/job/DeltaSpike%20Weld%202.0.0/ws/deltaspike/core/impl/target/test-classes>
Jul 29, 2013 10:36:48 AM org.apache.maven.cli.event.ExecutionEventLogger logReactorSummary
INFO: ------------------------------------------------------------------------
Jul 29, 2013 10:36:48 AM org.apache.maven.cli.event.ExecutionEventLogger logReactorSummary
INFO: Reactor Summary:
Jul 29, 2013 10:36:48 AM org.apache.maven.cli.event.ExecutionEventLogger logReactorSummary
INFO: 
Jul 29, 2013 10:36:48 AM org.apache.maven.cli.event.ExecutionEventLogger logReactorSummary
INFO: Apache DeltaSpike ................................. SUCCESS [12.717s]
Jul 29, 2013 10:36:48 AM org.apache.maven.cli.event.ExecutionEventLogger logReactorSummary
INFO: Apache DeltaSpike CheckStyle-rules ................ SUCCESS [4.178s]
Jul 29, 2013 10:36:48 AM org.apache.maven.cli.event.ExecutionEventLogger logReactorSummary
INFO: Apache DeltaSpike Parent .......................... SUCCESS [8.554s]
Jul 29, 2013 10:36:48 AM org.apache.maven.cli.event.ExecutionEventLogger logReactorSummary
INFO: Apache DeltaSpike Test-Utils ...................... SUCCESS [6.735s]
Jul 29, 2013 10:36:48 AM org.apache.maven.cli.event.ExecutionEventLogger logReactorSummary
INFO: Apache DeltaSpike Code Parent ..................... SUCCESS [4.901s]
Jul 29, 2013 10:36:48 AM org.apache.maven.cli.event.ExecutionEventLogger logReactorSummary
INFO: Apache DeltaSpike Core ............................ SUCCESS [2.511s]
Jul 29, 2013 10:36:48 AM org.apache.maven.cli.event.ExecutionEventLogger logReactorSummary
INFO: Apache DeltaSpike Core-API ........................ SUCCESS [18.830s]
Jul 29, 2013 10:36:48 AM org.apache.maven.cli.event.ExecutionEventLogger logReactorSummary
INFO: Apache DeltaSpike Core-Implementation ............. FAILURE [4.316s]
Jul 29, 2013 10:36:48 AM org.apache.maven.cli.event.ExecutionEventLogger logReactorSummary
INFO: Apache DeltaSpike ContainerControl parent ......... SKIPPED
Jul 29, 2013 10:36:48 AM org.apache.maven.cli.event.ExecutionEventLogger logReactorSummary
INFO: Apache DeltaSpike CDI ContainerControl API ........ SKIPPED
Jul 29, 2013 10:36:48 AM org.apache.maven.cli.event.ExecutionEventLogger logReactorSummary
INFO: Apache DeltaSpike CDI ContainerControl TCK ........ SKIPPED
Jul 29, 2013 10:36:48 AM org.apache.maven.cli.event.ExecutionEventLogger logReactorSummary
INFO: Apache DeltaSpike CDI OWB-ContainerControl ........ SKIPPED
Jul 29, 2013 10:36:48 AM org.apache.maven.cli.event.ExecutionEventLogger logReactorSummary
INFO: Apache DeltaSpike CDI Weld-ContainerControl ....... SKIPPED
Jul 29, 2013 10:36:48 AM org.apache.maven.cli.event.ExecutionEventLogger logReactorSummary
INFO: Apache DeltaSpike CDI OpenEJB-ContainerControl .... SKIPPED
Jul 29, 2013 10:36:48 AM org.apache.maven.cli.event.ExecutionEventLogger logReactorSummary
INFO: Apache DeltaSpike Modules ......................... SKIPPED
Jul 29, 2013 10:36:48 AM org.apache.maven.cli.event.ExecutionEventLogger logReactorSummary
INFO: Apache DeltaSpike Security-Module ................. SKIPPED
Jul 29, 2013 10:36:48 AM org.apache.maven.cli.event.ExecutionEventLogger logReactorSummary
INFO: Apache DeltaSpike Security-Module API ............. SKIPPED
Jul 29, 2013 10:36:48 AM org.apache.maven.cli.event.ExecutionEventLogger logReactorSummary
INFO: Apache DeltaSpike Security-Module Impl ............ SKIPPED
Jul 29, 2013 10:36:48 AM org.apache.maven.cli.event.ExecutionEventLogger logReactorSummary
INFO: Apache DeltaSpike JPA-Module ...................... SKIPPED
Jul 29, 2013 10:36:48 AM org.apache.maven.cli.event.ExecutionEventLogger logReactorSummary
INFO: Apache DeltaSpike JPA-Module API .................. SKIPPED
Jul 29, 2013 10:36:48 AM org.apache.maven.cli.event.ExecutionEventLogger logReactorSummary
INFO: Apache DeltaSpike JPA-Module Impl ................. SKIPPED
Jul 29, 2013 10:36:48 AM org.apache.maven.cli.event.ExecutionEventLogger logReactorSummary
INFO: Apache DeltaSpike Servlet-Module .................. SKIPPED
Jul 29, 2013 10:36:48 AM org.apache.maven.cli.event.ExecutionEventLogger logReactorSummary
INFO: Apache DeltaSpike Servlet-Module API .............. SKIPPED
Jul 29, 2013 10:36:48 AM org.apache.maven.cli.event.ExecutionEventLogger logReactorSummary
INFO: Apache DeltaSpike Servlet-Module Impl ............. SKIPPED
Jul 29, 2013 10:36:48 AM org.apache.maven.cli.event.ExecutionEventLogger logReactorSummary
INFO: Apache DeltaSpike JSF-Module ...................... SKIPPED
Jul 29, 2013 10:36:48 AM org.apache.maven.cli.event.ExecutionEventLogger logReactorSummary
INFO: Apache DeltaSpike JSF-Module API .................. SKIPPED
Jul 29, 2013 10:36:48 AM org.apache.maven.cli.event.ExecutionEventLogger logReactorSummary
INFO: Apache DeltaSpike JSF-Module Impl ................. SKIPPED
Jul 29, 2013 10:36:48 AM org.apache.maven.cli.event.ExecutionEventLogger logReactorSummary
INFO: Apache DeltaSpike Partial-Bean-Module ............. SKIPPED
Jul 29, 2013 10:36:48 AM org.apache.maven.cli.event.ExecutionEventLogger logReactorSummary
INFO: Apache DeltaSpike Partial-Bean-Module API ......... SKIPPED
Jul 29, 2013 10:36:48 AM org.apache.maven.cli.event.ExecutionEventLogger logReactorSummary
INFO: Apache DeltaSpike Partial-Bean-Module Impl ........ SKIPPED
Jul 29, 2013 10:36:48 AM org.apache.maven.cli.event.ExecutionEventLogger logReactorSummary
INFO: Apache DeltaSpike BeanValidation-Module ........... SKIPPED
Jul 29, 2013 10:36:48 AM org.apache.maven.cli.event.ExecutionEventLogger logReactorSummary
INFO: Apache DeltaSpike BeanValidation-Module API ....... SKIPPED
Jul 29, 2013 10:36:48 AM org.apache.maven.cli.event.ExecutionEventLogger logReactorSummary
INFO: Apache DeltaSpike BeanValidation-Module Impl ...... SKIPPED
Jul 29, 2013 10:36:48 AM org.apache.maven.cli.event.ExecutionEventLogger logReactorSummary
INFO: Apache DeltaSpike Data-Module ..................... SKIPPED
Jul 29, 2013 10:36:48 AM org.apache.maven.cli.event.ExecutionEventLogger logReactorSummary
INFO: Apache DeltaSpike Data-Module API ................. SKIPPED
Jul 29, 2013 10:36:48 AM org.apache.maven.cli.event.ExecutionEventLogger logReactorSummary
INFO: Apache DeltaSpike Data-Module Impl ................ SKIPPED
Jul 29, 2013 10:36:48 AM org.apache.maven.cli.event.ExecutionEventLogger logReactorSummary
INFO: Apache DeltaSpike Examples ........................ SKIPPED
Jul 29, 2013 10:36:48 AM org.apache.maven.cli.event.ExecutionEventLogger logReactorSummary
INFO: Apache DeltaSpike Java-SE Examples ................ SKIPPED
Jul 29, 2013 10:36:48 AM org.apache.maven.cli.event.ExecutionEventLogger logReactorSummary
INFO: Apache DeltaSpike JSF Examples .................... SKIPPED
Jul 29, 2013 10:36:48 AM org.apache.maven.cli.event.ExecutionEventLogger logResult
INFO: ------------------------------------------------------------------------
Jul 29, 2013 10:36:48 AM org.apache.maven.cli.event.ExecutionEventLogger logResult
INFO: BUILD FAILURE
Jul 29, 2013 10:36:48 AM org.apache.maven.cli.event.ExecutionEventLogger logStats
INFO: ------------------------------------------------------------------------
Jul 29, 2013 10:36:48 AM org.apache.maven.cli.event.ExecutionEventLogger logStats
INFO: Total time: 1:07.409s
Jul 29, 2013 10:36:48 AM org.apache.maven.cli.event.ExecutionEventLogger logStats
INFO: Finished at: Mon Jul 29 10:36:48 UTC 2013
Jul 29, 2013 10:36:48 AM org.apache.maven.cli.event.ExecutionEventLogger logStats
INFO: Final Memory: 54M/616M
Jul 29, 2013 10:36:48 AM org.apache.maven.cli.event.ExecutionEventLogger sessionEnded
INFO: ------------------------------------------------------------------------
[JENKINS] Archiving <https://builds.apache.org/job/DeltaSpike%20Weld%202.0.0/ws/deltaspike/pom.xml>
to /home/hudson/hudson/jobs/DeltaSpike Weld 2.0.0/modules/org.apache.deltaspike$deltaspike-project/builds/2013-07-29_10-35-31/archive/org.apache.deltaspike/deltaspike-project/0.5-SNAPSHOT/deltaspike-project-0.5-SNAPSHOT.pom
[JENKINS] Archiving <https://builds.apache.org/job/DeltaSpike%20Weld%202.0.0/ws/deltaspike/modules/partial-bean/impl/pom.xml>
to /home/hudson/hudson/jobs/DeltaSpike Weld 2.0.0/modules/org.apache.deltaspike.modules$deltaspike-partial-bean-module-impl/builds/2013-07-29_10-35-31/archive/org.apache.deltaspike.modules/deltaspike-partial-bean-module-impl/0.5-SNAPSHOT/deltaspike-partial-bean-module-impl-0.5-SNAPSHOT.pom
[JENKINS] Archiving <https://builds.apache.org/job/DeltaSpike%20Weld%202.0.0/ws/deltaspike/cdictrl/impl-openejb/pom.xml>
to /home/hudson/hudson/jobs/DeltaSpike Weld 2.0.0/modules/org.apache.deltaspike.cdictrl$deltaspike-cdictrl-openejb/builds/2013-07-29_10-35-31/archive/org.apache.deltaspike.cdictrl/deltaspike-cdictrl-openejb/0.5-SNAPSHOT/deltaspike-cdictrl-openejb-0.5-SNAPSHOT.pom
[JENKINS] Archiving <https://builds.apache.org/job/DeltaSpike%20Weld%202.0.0/ws/deltaspike/cdictrl/api/pom.xml>
to /home/hudson/hudson/jobs/DeltaSpike Weld 2.0.0/modules/org.apache.deltaspike.cdictrl$deltaspike-cdictrl-api/builds/2013-07-29_10-35-31/archive/org.apache.deltaspike.cdictrl/deltaspike-cdictrl-api/0.5-SNAPSHOT/deltaspike-cdictrl-api-0.5-SNAPSHOT.pom
[JENKINS] Archiving <https://builds.apache.org/job/DeltaSpike%20Weld%202.0.0/ws/deltaspike/test-utils/pom.xml>
to /home/hudson/hudson/jobs/DeltaSpike Weld 2.0.0/modules/org.apache.deltaspike.test$test-utils/builds/2013-07-29_10-35-31/archive/org.apache.deltaspike.test/test-utils/0.5-SNAPSHOT/test-utils-0.5-SNAPSHOT.pom
[JENKINS] Archiving <https://builds.apache.org/job/DeltaSpike%20Weld%202.0.0/ws/deltaspike/test-utils/target/test-utils-0.5-SNAPSHOT.jar>
to /home/hudson/hudson/jobs/DeltaSpike Weld 2.0.0/modules/org.apache.deltaspike.test$test-utils/builds/2013-07-29_10-35-31/archive/org.apache.deltaspike.test/test-utils/0.5-SNAPSHOT/test-utils-0.5-SNAPSHOT.jar
[JENKINS] Archiving <https://builds.apache.org/job/DeltaSpike%20Weld%202.0.0/ws/deltaspike/test-utils/target/test-utils-0.5-SNAPSHOT-sources.jar>
to /home/hudson/hudson/jobs/DeltaSpike Weld 2.0.0/modules/org.apache.deltaspike.test$test-utils/builds/2013-07-29_10-35-31/archive/org.apache.deltaspike.test/test-utils/0.5-SNAPSHOT/test-utils-0.5-SNAPSHOT-sources.jar
[JENKINS] Archiving <https://builds.apache.org/job/DeltaSpike%20Weld%202.0.0/ws/deltaspike/core/impl/pom.xml>
to /home/hudson/hudson/jobs/DeltaSpike Weld 2.0.0/modules/org.apache.deltaspike.core$deltaspike-core-impl/builds/2013-07-29_10-35-31/archive/org.apache.deltaspike.core/deltaspike-core-impl/0.5-SNAPSHOT/deltaspike-core-impl-0.5-SNAPSHOT.pom
[JENKINS] Archiving <https://builds.apache.org/job/DeltaSpike%20Weld%202.0.0/ws/deltaspike/modules/data/api/pom.xml>
to /home/hudson/hudson/jobs/DeltaSpike Weld 2.0.0/modules/org.apache.deltaspike.modules$deltaspike-data-module-api/builds/2013-07-29_10-35-31/archive/org.apache.deltaspike.modules/deltaspike-data-module-api/0.5-SNAPSHOT/deltaspike-data-module-api-0.5-SNAPSHOT.pom
[JENKINS] Archiving <https://builds.apache.org/job/DeltaSpike%20Weld%202.0.0/ws/deltaspike/modules/jsf/impl/pom.xml>
to /home/hudson/hudson/jobs/DeltaSpike Weld 2.0.0/modules/org.apache.deltaspike.modules$deltaspike-jsf-module-impl/builds/2013-07-29_10-35-31/archive/org.apache.deltaspike.modules/deltaspike-jsf-module-impl/0.5-SNAPSHOT/deltaspike-jsf-module-impl-0.5-SNAPSHOT.pom
[JENKINS] Archiving <https://builds.apache.org/job/DeltaSpike%20Weld%202.0.0/ws/deltaspike/modules/partial-bean/pom.xml>
to /home/hudson/hudson/jobs/DeltaSpike Weld 2.0.0/modules/org.apache.deltaspike.modules$partial-bean-module-project/builds/2013-07-29_10-35-31/archive/org.apache.deltaspike.modules/partial-bean-module-project/0.5-SNAPSHOT/partial-bean-module-project-0.5-SNAPSHOT.pom
[JENKINS] Archiving <https://builds.apache.org/job/DeltaSpike%20Weld%202.0.0/ws/deltaspike/modules/data/pom.xml>
to /home/hudson/hudson/jobs/DeltaSpike Weld 2.0.0/modules/org.apache.deltaspike.modules$data-module-project/builds/2013-07-29_10-35-31/archive/org.apache.deltaspike.modules/data-module-project/0.5-SNAPSHOT/data-module-project-0.5-SNAPSHOT.pom
[JENKINS] Archiving <https://builds.apache.org/job/DeltaSpike%20Weld%202.0.0/ws/deltaspike/cdictrl/tck/pom.xml>
to /home/hudson/hudson/jobs/DeltaSpike Weld 2.0.0/modules/org.apache.deltaspike.test$deltaspike-cdictrl-tck/builds/2013-07-29_10-35-31/archive/org.apache.deltaspike.test/deltaspike-cdictrl-tck/0.5-SNAPSHOT/deltaspike-cdictrl-tck-0.5-SNAPSHOT.pom
[JENKINS] Archiving <https://builds.apache.org/job/DeltaSpike%20Weld%202.0.0/ws/deltaspike/modules/bean-validation/pom.xml>
to /home/hudson/hudson/jobs/DeltaSpike Weld 2.0.0/modules/org.apache.deltaspike.modules$bean-validation-module-project/builds/2013-07-29_10-35-31/archive/org.apache.deltaspike.modules/bean-validation-module-project/0.5-SNAPSHOT/bean-validation-module-project-0.5-SNAPSHOT.pom
[JENKINS] Archiving <https://builds.apache.org/job/DeltaSpike%20Weld%202.0.0/ws/deltaspike/core/pom.xml>
to /home/hudson/hudson/jobs/DeltaSpike Weld 2.0.0/modules/org.apache.deltaspike.core$core-project/builds/2013-07-29_10-35-31/archive/org.apache.deltaspike.core/core-project/0.5-SNAPSHOT/core-project-0.5-SNAPSHOT.pom
[JENKINS] Archiving <https://builds.apache.org/job/DeltaSpike%20Weld%202.0.0/ws/deltaspike/core/target/core-project-0.5-SNAPSHOT-tests.jar>
to /home/hudson/hudson/jobs/DeltaSpike Weld 2.0.0/modules/org.apache.deltaspike.core$core-project/builds/2013-07-29_10-35-31/archive/org.apache.deltaspike.core/core-project/0.5-SNAPSHOT/core-project-0.5-SNAPSHOT-tests.jar
[JENKINS] Archiving <https://builds.apache.org/job/DeltaSpike%20Weld%202.0.0/ws/deltaspike/checkstyle-rules/pom.xml>
to /home/hudson/hudson/jobs/DeltaSpike Weld 2.0.0/modules/org.apache.deltaspike$checkstyle-rules/builds/2013-07-29_10-35-31/archive/org.apache.deltaspike/checkstyle-rules/0.5-SNAPSHOT/checkstyle-rules-0.5-SNAPSHOT.pom
[JENKINS] Archiving <https://builds.apache.org/job/DeltaSpike%20Weld%202.0.0/ws/deltaspike/checkstyle-rules/target/checkstyle-rules-0.5-SNAPSHOT.jar>
to /home/hudson/hudson/jobs/DeltaSpike Weld 2.0.0/modules/org.apache.deltaspike$checkstyle-rules/builds/2013-07-29_10-35-31/archive/org.apache.deltaspike/checkstyle-rules/0.5-SNAPSHOT/checkstyle-rules-0.5-SNAPSHOT.jar
[JENKINS] Archiving <https://builds.apache.org/job/DeltaSpike%20Weld%202.0.0/ws/deltaspike/modules/servlet/api/pom.xml>
to /home/hudson/hudson/jobs/DeltaSpike Weld 2.0.0/modules/org.apache.deltaspike.modules$deltaspike-servlet-module-api/builds/2013-07-29_10-35-31/archive/org.apache.deltaspike.modules/deltaspike-servlet-module-api/0.5-SNAPSHOT/deltaspike-servlet-module-api-0.5-SNAPSHOT.pom
[JENKINS] Archiving <https://builds.apache.org/job/DeltaSpike%20Weld%202.0.0/ws/deltaspike/modules/bean-validation/impl/pom.xml>
to /home/hudson/hudson/jobs/DeltaSpike Weld 2.0.0/modules/org.apache.deltaspike.modules$deltaspike-bean-validation-module-impl/builds/2013-07-29_10-35-31/archive/org.apache.deltaspike.modules/deltaspike-bean-validation-module-impl/0.5-SNAPSHOT/deltaspike-bean-validation-module-impl-0.5-SNAPSHOT.pom
[JENKINS] Archiving <https://builds.apache.org/job/DeltaSpike%20Weld%202.0.0/ws/deltaspike/examples/jsf-examples/pom.xml>
to /home/hudson/hudson/jobs/DeltaSpike Weld 2.0.0/modules/org.apache.deltaspike.examples$deltaspike-jsf-example/builds/2013-07-29_10-35-31/archive/org.apache.deltaspike.examples/deltaspike-jsf-example/0.5-SNAPSHOT/deltaspike-jsf-example-0.5-SNAPSHOT.pom
[JENKINS] Archiving <https://builds.apache.org/job/DeltaSpike%20Weld%202.0.0/ws/deltaspike/modules/security/api/pom.xml>
to /home/hudson/hudson/jobs/DeltaSpike Weld 2.0.0/modules/org.apache.deltaspike.modules$deltaspike-security-module-api/builds/2013-07-29_10-35-31/archive/org.apache.deltaspike.modules/deltaspike-security-module-api/0.5-SNAPSHOT/deltaspike-security-module-api-0.5-SNAPSHOT.pom
[JENKINS] Archiving <https://builds.apache.org/job/DeltaSpike%20Weld%202.0.0/ws/deltaspike/modules/jpa/pom.xml>
to /home/hudson/hudson/jobs/DeltaSpike Weld 2.0.0/modules/org.apache.deltaspike.modules$jpa-module-project/builds/2013-07-29_10-35-31/archive/org.apache.deltaspike.modules/jpa-module-project/0.5-SNAPSHOT/jpa-module-project-0.5-SNAPSHOT.pom
[JENKINS] Archiving <https://builds.apache.org/job/DeltaSpike%20Weld%202.0.0/ws/deltaspike/parent/pom.xml>
to /home/hudson/hudson/jobs/DeltaSpike Weld 2.0.0/modules/org.apache.deltaspike$parent/builds/2013-07-29_10-35-31/archive/org.apache.deltaspike/parent/0.5-SNAPSHOT/parent-0.5-SNAPSHOT.pom
[JENKINS] Archiving <https://builds.apache.org/job/DeltaSpike%20Weld%202.0.0/ws/deltaspike/cdictrl/impl-weld/pom.xml>
to /home/hudson/hudson/jobs/DeltaSpike Weld 2.0.0/modules/org.apache.deltaspike.cdictrl$deltaspike-cdictrl-weld/builds/2013-07-29_10-35-31/archive/org.apache.deltaspike.cdictrl/deltaspike-cdictrl-weld/0.5-SNAPSHOT/deltaspike-cdictrl-weld-0.5-SNAPSHOT.pom
[JENKINS] Archiving <https://builds.apache.org/job/DeltaSpike%20Weld%202.0.0/ws/deltaspike/examples/jse-examples/pom.xml>
to /home/hudson/hudson/jobs/DeltaSpike Weld 2.0.0/modules/org.apache.deltaspike.examples$deltaspike-jse-example/builds/2013-07-29_10-35-31/archive/org.apache.deltaspike.examples/deltaspike-jse-example/0.5-SNAPSHOT/deltaspike-jse-example-0.5-SNAPSHOT.pom
[JENKINS] Archiving <https://builds.apache.org/job/DeltaSpike%20Weld%202.0.0/ws/deltaspike/modules/security/pom.xml>
to /home/hudson/hudson/jobs/DeltaSpike Weld 2.0.0/modules/org.apache.deltaspike.modules$security-module-project/builds/2013-07-29_10-35-31/archive/org.apache.deltaspike.modules/security-module-project/0.5-SNAPSHOT/security-module-project-0.5-SNAPSHOT.pom
[JENKINS] Archiving <https://builds.apache.org/job/DeltaSpike%20Weld%202.0.0/ws/deltaspike/modules/partial-bean/api/pom.xml>
to /home/hudson/hudson/jobs/DeltaSpike Weld 2.0.0/modules/org.apache.deltaspike.modules$deltaspike-partial-bean-module-api/builds/2013-07-29_10-35-31/archive/org.apache.deltaspike.modules/deltaspike-partial-bean-module-api/0.5-SNAPSHOT/deltaspike-partial-bean-module-api-0.5-SNAPSHOT.pom
[JENKINS] Archiving <https://builds.apache.org/job/DeltaSpike%20Weld%202.0.0/ws/deltaspike/cdictrl/impl-owb/pom.xml>
to /home/hudson/hudson/jobs/DeltaSpike Weld 2.0.0/modules/org.apache.deltaspike.cdictrl$deltaspike-cdictrl-owb/builds/2013-07-29_10-35-31/archive/org.apache.deltaspike.cdictrl/deltaspike-cdictrl-owb/0.5-SNAPSHOT/deltaspike-cdictrl-owb-0.5-SNAPSHOT.pom
[JENKINS] Archiving <https://builds.apache.org/job/DeltaSpike%20Weld%202.0.0/ws/deltaspike/modules/jsf/pom.xml>
to /home/hudson/hudson/jobs/DeltaSpike Weld 2.0.0/modules/org.apache.deltaspike.modules$jsf-module-project/builds/2013-07-29_10-35-31/archive/org.apache.deltaspike.modules/jsf-module-project/0.5-SNAPSHOT/jsf-module-project-0.5-SNAPSHOT.pom
[JENKINS] Archiving <https://builds.apache.org/job/DeltaSpike%20Weld%202.0.0/ws/deltaspike/modules/bean-validation/api/pom.xml>
to /home/hudson/hudson/jobs/DeltaSpike Weld 2.0.0/modules/org.apache.deltaspike.modules$deltaspike-bean-validation-module-api/builds/2013-07-29_10-35-31/archive/org.apache.deltaspike.modules/deltaspike-bean-validation-module-api/0.5-SNAPSHOT/deltaspike-bean-validation-module-api-0.5-SNAPSHOT.pom
[JENKINS] Archiving <https://builds.apache.org/job/DeltaSpike%20Weld%202.0.0/ws/deltaspike/core/api/pom.xml>
to /home/hudson/hudson/jobs/DeltaSpike Weld 2.0.0/modules/org.apache.deltaspike.core$deltaspike-core-api/builds/2013-07-29_10-35-31/archive/org.apache.deltaspike.core/deltaspike-core-api/0.5-SNAPSHOT/deltaspike-core-api-0.5-SNAPSHOT.pom
[JENKINS] Archiving <https://builds.apache.org/job/DeltaSpike%20Weld%202.0.0/ws/deltaspike/core/api/target/deltaspike-core-api-0.5-SNAPSHOT.jar>
to /home/hudson/hudson/jobs/DeltaSpike Weld 2.0.0/modules/org.apache.deltaspike.core$deltaspike-core-api/builds/2013-07-29_10-35-31/archive/org.apache.deltaspike.core/deltaspike-core-api/0.5-SNAPSHOT/deltaspike-core-api-0.5-SNAPSHOT.jar
[JENKINS] Archiving <https://builds.apache.org/job/DeltaSpike%20Weld%202.0.0/ws/deltaspike/core/api/target/deltaspike-core-api-0.5-SNAPSHOT-tests.jar>
to /home/hudson/hudson/jobs/DeltaSpike Weld 2.0.0/modules/org.apache.deltaspike.core$deltaspike-core-api/builds/2013-07-29_10-35-31/archive/org.apache.deltaspike.core/deltaspike-core-api/0.5-SNAPSHOT/deltaspike-core-api-0.5-SNAPSHOT-tests.jar
[JENKINS] Archiving <https://builds.apache.org/job/DeltaSpike%20Weld%202.0.0/ws/deltaspike/core/api/target/deltaspike-core-api-0.5-SNAPSHOT-sources.jar>
to /home/hudson/hudson/jobs/DeltaSpike Weld 2.0.0/modules/org.apache.deltaspike.core$deltaspike-core-api/builds/2013-07-29_10-35-31/archive/org.apache.deltaspike.core/deltaspike-core-api/0.5-SNAPSHOT/deltaspike-core-api-0.5-SNAPSHOT-sources.jar
[JENKINS] Archiving <https://builds.apache.org/job/DeltaSpike%20Weld%202.0.0/ws/deltaspike/modules/servlet/pom.xml>
to /home/hudson/hudson/jobs/DeltaSpike Weld 2.0.0/modules/org.apache.deltaspike.modules$servlet-module-project/builds/2013-07-29_10-35-31/archive/org.apache.deltaspike.modules/servlet-module-project/0.5-SNAPSHOT/servlet-module-project-0.5-SNAPSHOT.pom
[JENKINS] Archiving <https://builds.apache.org/job/DeltaSpike%20Weld%202.0.0/ws/deltaspike/parent/code/pom.xml>
to /home/hudson/hudson/jobs/DeltaSpike Weld 2.0.0/modules/org.apache.deltaspike$parent-code/builds/2013-07-29_10-35-31/archive/org.apache.deltaspike/parent-code/0.5-SNAPSHOT/parent-code-0.5-SNAPSHOT.pom
[JENKINS] Archiving <https://builds.apache.org/job/DeltaSpike%20Weld%202.0.0/ws/deltaspike/parent/code/target/parent-code-0.5-SNAPSHOT-tests.jar>
to /home/hudson/hudson/jobs/DeltaSpike Weld 2.0.0/modules/org.apache.deltaspike$parent-code/builds/2013-07-29_10-35-31/archive/org.apache.deltaspike/parent-code/0.5-SNAPSHOT/parent-code-0.5-SNAPSHOT-tests.jar
[JENKINS] Archiving <https://builds.apache.org/job/DeltaSpike%20Weld%202.0.0/ws/deltaspike/modules/data/impl/pom.xml>
to /home/hudson/hudson/jobs/DeltaSpike Weld 2.0.0/modules/org.apache.deltaspike.modules$deltaspike-data-module-impl/builds/2013-07-29_10-35-31/archive/org.apache.deltaspike.modules/deltaspike-data-module-impl/0.5-SNAPSHOT/deltaspike-data-module-impl-0.5-SNAPSHOT.pom
[JENKINS] Archiving <https://builds.apache.org/job/DeltaSpike%20Weld%202.0.0/ws/deltaspike/modules/pom.xml>
to /home/hudson/hudson/jobs/DeltaSpike Weld 2.0.0/modules/org.apache.deltaspike.modules$modules-project/builds/2013-07-29_10-35-31/archive/org.apache.deltaspike.modules/modules-project/0.5-SNAPSHOT/modules-project-0.5-SNAPSHOT.pom
[JENKINS] Archiving <https://builds.apache.org/job/DeltaSpike%20Weld%202.0.0/ws/deltaspike/modules/jpa/impl/pom.xml>
to /home/hudson/hudson/jobs/DeltaSpike Weld 2.0.0/modules/org.apache.deltaspike.modules$deltaspike-jpa-module-impl/builds/2013-07-29_10-35-31/archive/org.apache.deltaspike.modules/deltaspike-jpa-module-impl/0.5-SNAPSHOT/deltaspike-jpa-module-impl-0.5-SNAPSHOT.pom
[JENKINS] Archiving <https://builds.apache.org/job/DeltaSpike%20Weld%202.0.0/ws/deltaspike/modules/servlet/impl/pom.xml>
to /home/hudson/hudson/jobs/DeltaSpike Weld 2.0.0/modules/org.apache.deltaspike.modules$deltaspike-servlet-module-impl/builds/2013-07-29_10-35-31/archive/org.apache.deltaspike.modules/deltaspike-servlet-module-impl/0.5-SNAPSHOT/deltaspike-servlet-module-impl-0.5-SNAPSHOT.pom
[JENKINS] Archiving <https://builds.apache.org/job/DeltaSpike%20Weld%202.0.0/ws/deltaspike/modules/security/impl/pom.xml>
to /home/hudson/hudson/jobs/DeltaSpike Weld 2.0.0/modules/org.apache.deltaspike.modules$deltaspike-security-module-impl/builds/2013-07-29_10-35-31/archive/org.apache.deltaspike.modules/deltaspike-security-module-impl/0.5-SNAPSHOT/deltaspike-security-module-impl-0.5-SNAPSHOT.pom
[JENKINS] Archiving <https://builds.apache.org/job/DeltaSpike%20Weld%202.0.0/ws/deltaspike/modules/jpa/api/pom.xml>
to /home/hudson/hudson/jobs/DeltaSpike Weld 2.0.0/modules/org.apache.deltaspike.modules$deltaspike-jpa-module-api/builds/2013-07-29_10-35-31/archive/org.apache.deltaspike.modules/deltaspike-jpa-module-api/0.5-SNAPSHOT/deltaspike-jpa-module-api-0.5-SNAPSHOT.pom
[JENKINS] Archiving <https://builds.apache.org/job/DeltaSpike%20Weld%202.0.0/ws/deltaspike/modules/jsf/api/pom.xml>
to /home/hudson/hudson/jobs/DeltaSpike Weld 2.0.0/modules/org.apache.deltaspike.modules$deltaspike-jsf-module-api/builds/2013-07-29_10-35-31/archive/org.apache.deltaspike.modules/deltaspike-jsf-module-api/0.5-SNAPSHOT/deltaspike-jsf-module-api-0.5-SNAPSHOT.pom
[JENKINS] Archiving <https://builds.apache.org/job/DeltaSpike%20Weld%202.0.0/ws/deltaspike/examples/pom.xml>
to /home/hudson/hudson/jobs/DeltaSpike Weld 2.0.0/modules/org.apache.deltaspike.examples$examples-project/builds/2013-07-29_10-35-31/archive/org.apache.deltaspike.examples/examples-project/0.5-SNAPSHOT/examples-project-0.5-SNAPSHOT.pom
[JENKINS] Archiving <https://builds.apache.org/job/DeltaSpike%20Weld%202.0.0/ws/deltaspike/cdictrl/pom.xml>
to /home/hudson/hudson/jobs/DeltaSpike Weld 2.0.0/modules/org.apache.deltaspike.cdictrl$cdictrl-project/builds/2013-07-29_10-35-31/archive/org.apache.deltaspike.cdictrl/cdictrl-project/0.5-SNAPSHOT/cdictrl-project-0.5-SNAPSHOT.pom
Waiting for Jenkins to finish collecting data
mavenExecutionResult exceptions not empty
message : Internal error: hudson.remoting.RemotingSystemException: java.io.StreamCorruptedException:
invalid type code: 00
cause : java.io.StreamCorruptedException: invalid type code: 00
Stack trace : 
org.apache.maven.InternalErrorException: Internal error: hudson.remoting.RemotingSystemException:
java.io.StreamCorruptedException: invalid type code: 00
	at org.apache.maven.lifecycle.internal.BuilderCommon.handleBuildError(BuilderCommon.java:128)
	at org.apache.maven.lifecycle.internal.LifecycleModuleBuilder.buildProject(LifecycleModuleBuilder.java:95)
	at org.apache.maven.lifecycle.internal.LifecycleModuleBuilder.buildProject(LifecycleModuleBuilder.java:59)
	at org.apache.maven.lifecycle.internal.LifecycleStarter.singleThreadedBuild(LifecycleStarter.java:183)
	at org.apache.maven.lifecycle.internal.LifecycleStarter.execute(LifecycleStarter.java:161)
	at org.apache.maven.DefaultMaven.doExecute(DefaultMaven.java:320)
	at org.apache.maven.DefaultMaven.execute(DefaultMaven.java:156)
	at org.jvnet.hudson.maven3.launcher.Maven3Launcher.main(Maven3Launcher.java:117)
	at sun.reflect.NativeMethodAccessorImpl.invoke0(Native Method)
	at sun.reflect.NativeMethodAccessorImpl.invoke(NativeMethodAccessorImpl.java:57)
	at sun.reflect.DelegatingMethodAccessorImpl.invoke(DelegatingMethodAccessorImpl.java:43)
	at java.lang.reflect.Method.invoke(Method.java:601)
	at org.codehaus.plexus.classworlds.launcher.Launcher.launchStandard(Launcher.java:329)
	at org.codehaus.plexus.classworlds.launcher.Launcher.launch(Launcher.java:239)
	at org.jvnet.hudson.maven3.agent.Maven3Main.launch(Maven3Main.java:178)
	at sun.reflect.NativeMethodAccessorImpl.invoke0(Native Method)
	at sun.reflect.NativeMethodAccessorImpl.invoke(NativeMethodAccessorImpl.java:57)
	at sun.reflect.DelegatingMethodAccessorImpl.invoke(DelegatingMethodAccessorImpl.java:43)
	at java.lang.reflect.Method.invoke(Method.java:601)
	at hudson.maven.Maven3Builder.call(Maven3Builder.java:129)
	at hudson.maven.Maven3Builder.call(Maven3Builder.java:67)
	at hudson.remoting.UserRequest.perform(UserRequest.java:118)
	at hudson.remoting.UserRequest.perform(UserRequest.java:48)
	at hudson.remoting.Request$2.run(Request.java:326)
	at hudson.remoting.InterceptingExecutorService$1.call(InterceptingExecutorService.java:72)
	at java.util.concurrent.FutureTask$Sync.innerRun(FutureTask.java:334)
	at java.util.concurrent.FutureTask.run(FutureTask.java:166)
	at java.util.concurrent.ThreadPoolExecutor.runWorker(ThreadPoolExecutor.java:1110)
	at java.util.concurrent.ThreadPoolExecutor$Worker.run(ThreadPoolExecutor.java:603)
	at java.lang.Thread.run(Thread.java:722)
Caused by: hudson.remoting.RemotingSystemException: java.io.StreamCorruptedException: invalid
type code: 00
	at hudson.remoting.RemoteInvocationHandler.invoke(RemoteInvocationHandler.java:183)
	at $Proxy7.setExecutedMojos(Unknown Source)
	at hudson.maven.MavenBuildProxy$Filter.setExecutedMojos(MavenBuildProxy.java:243)
	at hudson.maven.Maven3Builder$MavenExecutionListener.recordMojoEnded(Maven3Builder.java:574)
	at hudson.maven.Maven3Builder$MavenExecutionListener.mojoSucceeded(Maven3Builder.java:560)
	at org.apache.maven.lifecycle.internal.DefaultExecutionEventCatapult.fire(DefaultExecutionEventCatapult.java:87)
	at org.apache.maven.lifecycle.internal.DefaultExecutionEventCatapult.fire(DefaultExecutionEventCatapult.java:42)
	at org.apache.maven.lifecycle.internal.MojoExecutor.execute(MojoExecutor.java:228)
	at org.apache.maven.lifecycle.internal.MojoExecutor.execute(MojoExecutor.java:153)
	at org.apache.maven.lifecycle.internal.MojoExecutor.execute(MojoExecutor.java:145)
	at org.apache.maven.lifecycle.internal.LifecycleModuleBuilder.buildProject(LifecycleModuleBuilder.java:84)
	... 28 more
Caused by: java.io.StreamCorruptedException: invalid type code: 00
	at java.io.ObjectInputStream$BlockDataInputStream.readBlockHeader(ObjectInputStream.java:2506)
	at java.io.ObjectInputStream$BlockDataInputStream.refill(ObjectInputStream.java:2541)
	at java.io.ObjectInputStream$BlockDataInputStream.read(ObjectInputStream.java:2613)
	at java.io.DataInputStream.readInt(DataInputStream.java:387)
	at java.io.ObjectInputStream$BlockDataInputStream.readInt(ObjectInputStream.java:2818)
	at java.io.ObjectInputStream.readInt(ObjectInputStream.java:969)
	at hudson.remoting.MultiClassLoaderSerializer$Input.readClassLoader(MultiClassLoaderSerializer.java:89)
	at hudson.remoting.MultiClassLoaderSerializer$Input.resolveClass(MultiClassLoaderSerializer.java:112)
	at java.io.ObjectInputStream.readNonProxyDesc(ObjectInputStream.java:1610)
	at java.io.ObjectInputStream.readClassDesc(ObjectInputStream.java:1515)
	at java.io.ObjectInputStream.readNonProxyDesc(ObjectInputStream.java:1620)
	at java.io.ObjectInputStream.readClassDesc(ObjectInputStream.java:1515)
	at java.io.ObjectInputStream.readOrdinaryObject(ObjectInputStream.java:1769)
	at java.io.ObjectInputStream.readObject0(ObjectInputStream.java:1348)
	at java.io.ObjectInputStream.defaultReadFields(ObjectInputStream.java:1989)
	at java.io.ObjectInputStream.defaultReadObject(ObjectInputStream.java:499)
	at java.lang.Throwable.readObject(Throwable.java:913)
	at sun.reflect.GeneratedMethodAccessor129.invoke(Unknown Source)
	at sun.reflect.DelegatingMethodAccessorImpl.invoke(DelegatingMethodAccessorImpl.java:43)
	at java.lang.reflect.Method.invoke(Method.java:606)
	at java.io.ObjectStreamClass.invokeReadObject(ObjectStreamClass.java:1017)
	at java.io.ObjectInputStream.readSerialData(ObjectInputStream.java:1891)
	at java.io.ObjectInputStream.readOrdinaryObject(ObjectInputStream.java:1796)
	at java.io.ObjectInputStream.readObject0(ObjectInputStream.java:1348)
	at java.io.ObjectInputStream.defaultReadFields(ObjectInputStream.java:1989)
	at java.io.ObjectInputStream.readSerialData(ObjectInputStream.java:1913)
	at java.io.ObjectInputStream.readOrdinaryObject(ObjectInputStream.java:1796)
	at java.io.ObjectInputStream.readObject0(ObjectInputStream.java:1348)
	at java.io.ObjectInputStream.readObject(ObjectInputStream.java:370)
	at hudson.remoting.UserRequest.deserialize(UserRequest.java:182)
	at hudson.remoting.UserRequest.perform(UserRequest.java:98)
	at hudson.remoting.UserRequest.perform(UserRequest.java:48)
	at hudson.remoting.Request$2.run(Request.java:326)
	at hudson.remoting.InterceptingExecutorService$1.call(InterceptingExecutorService.java:72)
	at java.util.concurrent.FutureTask$Sync.innerRun(FutureTask.java:334)
	at java.util.concurrent.FutureTask.run(FutureTask.java:166)
	at java.util.concurrent.ThreadPoolExecutor.runWorker(ThreadPoolExecutor.java:1145)
	at java.util.concurrent.ThreadPoolExecutor$Worker.run(ThreadPoolExecutor.java:615)
	at java.lang.Thread.run(Thread.java:724)
Sending e-mails to: commits@deltaspike.apache.org
channel stopped

Mime
View raw message