deltaspike-commits mailing list archives

Site index · List index
Message view « Date » · « Thread »
Top « Date » · « Thread »
From Apache Jenkins Server <jenk...@builds.apache.org>
Subject Build failed in Jenkins: DeltaSpike RAT-Check #550
Date Tue, 25 Jun 2013 00:14:14 GMT
See <https://builds.apache.org/job/DeltaSpike%20RAT-Check/550/changes>

Changes:

[john.d.ament] DELTASPIKE-387 Created new name for the module.

[john.d.ament] DELTASPIKE-387 Renamed package.

[john.d.ament] DELTASPIKE-387 Changed test package name.

[christian] Minor javadoc cleanup in servlet module

------------------------------------------
[...truncated 2105 lines...]
INFO - Enterprise application "<https://builds.apache.org/job/DeltaSpike%20RAT-Check/ws/deltaspike/cdictrl/impl-openejb/classpath.ear">
loaded.
INFO - Creating TransactionManager(id=Default Transaction Manager)
INFO - Creating SecurityService(id=Default Security Service)
INFO - Using 'java.security.auth.login.config=jar:file:/home/jenkins/jenkins-slave/maven-repositories/1/org/apache/openejb/openejb-core/4.5.1/openejb-core-4.5.1.jar!/login.config'
INFO - Creating Container(id=Default Managed Container)
INFO - Using directory /tmp for stateful session passivation
INFO - Assembling app: <https://builds.apache.org/job/DeltaSpike%20RAT-Check/ws/deltaspike/cdictrl/impl-openejb/classpath.ear>
INFO - Existing thread singleton service in SystemInstance() org.apache.openejb.cdi.ThreadSingletonServiceImpl@d6a05e
INFO - OpenWebBeans Container is starting...
INFO - Adding OpenWebBeansPlugin : [CdiPlugin]
INFO - All injection points are validated successfully.
INFO - OpenWebBeans Container has started, it took 11 ms.
INFO - Deployed Application(path=<https://builds.apache.org/job/DeltaSpike%20RAT-Check/ws/deltaspike/cdictrl/impl-openejb/classpath.ear)>
INFO - Destroying container system
INFO - Undeploying app: <https://builds.apache.org/job/DeltaSpike%20RAT-Check/ws/deltaspike/cdictrl/impl-openejb/classpath.ear>
Tests run: 4, Failures: 0, Errors: 0, Skipped: 0, Time elapsed: 0.82 sec

Results :

Tests run: 6, Failures: 0, Errors: 0, Skipped: 0

[JENKINS] Recording test results
[INFO] [INFO] Building jar: <https://builds.apache.org/job/DeltaSpike%20RAT-Check/ws/deltaspike/cdictrl/impl-openejb/target/deltaspike-cdictrl-openejb-0.5-SNAPSHOT.jar>

[INFO] --- maven-jar-plugin:2.4:jar (default-jar) @ deltaspike-cdictrl-openejb ---
[INFO] 
[INFO] --- maven-site-plugin:3.1:attach-descriptor (attach-descriptor) @ deltaspike-cdictrl-openejb
---
[INFO] [INFO] Exclude: .idea/**/*
[INFO] Exclude: readme/**/*
[INFO] Exclude: **/*.log

[INFO] --- apache-rat-plugin:0.8:check (default) @ deltaspike-cdictrl-openejb ---
[INFO] 
[INFO] --- maven-bundle-plugin:2.3.7:cleanVersions (versions) @ deltaspike-cdictrl-openejb
---
[INFO] [WARNING] Parameter tasks is deprecated, use target instead
[INFO] Executing tasks

main:
[INFO] Executed tasks

[INFO] --- maven-antrun-plugin:1.6:run (javadoc.resources) @ deltaspike-cdictrl-openejb ---
[INFO] [INFO] Configured Artifact: org.apache.deltaspike.cdictrl:deltaspike-cdictrl-owb:0.5-SNAPSHOT:jar
[INFO] Unpacking <https://builds.apache.org/job/DeltaSpike%20RAT-Check/ws/deltaspike/cdictrl/impl-owb/target/deltaspike-cdictrl-owb-0.5-SNAPSHOT.jar>
to <https://builds.apache.org/job/DeltaSpike%20RAT-Check/ws/deltaspike/cdictrl/impl-openejb/target/classes>
with includes "" and excludes "**\/META-INF\/**,**\/OpenWebBeansContainerControl.class"

[INFO] --- maven-dependency-plugin:2.4:unpack (unpack-context) @ deltaspike-cdictrl-openejb
---
Jun 25, 2013 12:12:21 AM hudson.maven.ExecutedMojo <init>
WARNING: Failed to getClass for org.apache.maven.plugin.source.SourceJarMojo
[INFO] [INFO] META-INF already added, skipping
[INFO] META-INF/NOTICE already added, skipping
[INFO] META-INF/LICENSE already added, skipping
[INFO] META-INF/DISCLAIMER already added, skipping
[INFO] META-INF/DEPENDENCIES already added, skipping
[INFO] META-INF already added, skipping
[INFO] META-INF already added, skipping
[INFO] META-INF/NOTICE already added, skipping
[INFO] META-INF/LICENSE already added, skipping
[INFO] META-INF/DISCLAIMER already added, skipping
[INFO] META-INF/DEPENDENCIES already added, skipping
[INFO] META-INF already added, skipping
[INFO] META-INF/NOTICE already added, skipping
[INFO] META-INF/LICENSE already added, skipping
[INFO] META-INF/DISCLAIMER already added, skipping
[INFO] META-INF/DEPENDENCIES already added, skipping

[INFO] Building jar: <https://builds.apache.org/job/DeltaSpike%20RAT-Check/ws/deltaspike/cdictrl/impl-openejb/target/deltaspike-cdictrl-openejb-0.5-SNAPSHOT-sources.jar>
[INFO] --- maven-source-plugin:2.1.2:jar (attach-sources) @ deltaspike-cdictrl-openejb ---
[INFO] META-INF already added, skipping
[INFO] META-INF/NOTICE already added, skipping
[INFO] META-INF/LICENSE already added, skipping
[INFO] META-INF/DISCLAIMER already added, skipping
[INFO] META-INF/DEPENDENCIES already added, skipping
[INFO] META-INF already added, skipping
[INFO] META-INF already added, skipping
[INFO] META-INF/NOTICE already added, skipping
[INFO] META-INF/LICENSE already added, skipping
[INFO] META-INF/DISCLAIMER already added, skipping
[INFO] META-INF/DEPENDENCIES already added, skipping
[INFO] META-INF already added, skipping
[INFO] META-INF/NOTICE already added, skipping
[INFO] META-INF/LICENSE already added, skipping
[INFO] META-INF/DISCLAIMER already added, skipping
[INFO] META-INF/DEPENDENCIES already added, skipping
[INFO] 
[INFO] --- maven-checkstyle-plugin:2.9.1:check (verify-style) @ deltaspike-cdictrl-openejb
---
[INFO] Starting audit...
Audit done.

[INFO] Installing <https://builds.apache.org/job/DeltaSpike%20RAT-Check/ws/deltaspike/cdictrl/impl-openejb/target/deltaspike-cdictrl-openejb-0.5-SNAPSHOT.jar>
to /home/jenkins/jenkins-slave/maven-repositories/1/org/apache/deltaspike/cdictrl/deltaspike-cdictrl-openejb/0.5-SNAPSHOT/deltaspike-cdictrl-openejb-0.5-SNAPSHOT.jar
[INFO] 
[INFO] --- maven-install-plugin:2.3.1:install (default-install) @ deltaspike-cdictrl-openejb
---
[INFO] Installing <https://builds.apache.org/job/DeltaSpike%20RAT-Check/ws/deltaspike/cdictrl/impl-openejb/pom.xml>
to /home/jenkins/jenkins-slave/maven-repositories/1/org/apache/deltaspike/cdictrl/deltaspike-cdictrl-openejb/0.5-SNAPSHOT/deltaspike-cdictrl-openejb-0.5-SNAPSHOT.pom
[INFO] Installing <https://builds.apache.org/job/DeltaSpike%20RAT-Check/ws/deltaspike/cdictrl/impl-openejb/target/deltaspike-cdictrl-openejb-0.5-SNAPSHOT-sources.jar>
to /home/jenkins/jenkins-slave/maven-repositories/1/org/apache/deltaspike/cdictrl/deltaspike-cdictrl-openejb/0.5-SNAPSHOT/deltaspike-cdictrl-openejb-0.5-SNAPSHOT-sources.jar
[INFO] [INFO] Deleting <https://builds.apache.org/job/DeltaSpike%20RAT-Check/ws/deltaspike/modules/target>
                                                                        
[INFO] ------------------------------------------------------------------------
[INFO] Building Apache DeltaSpike Modules 0.5-SNAPSHOT
[INFO] ------------------------------------------------------------------------
[INFO] 
[INFO] --- maven-clean-plugin:2.5:clean (default-clean) @ modules-project ---
[INFO] Exclude: .idea/**/*
[INFO] [INFO] Exclude: readme/**/*
[INFO] Exclude: **/*.log

[INFO] --- apache-rat-plugin:0.8:check (default) @ modules-project ---
[INFO] ------------------------------------------------------------------------
[INFO] Reactor Summary:
[INFO] 
[INFO] Apache DeltaSpike ................................. SUCCESS [28.847s]
[INFO] Apache DeltaSpike CheckStyle-rules ................ SUCCESS [3.733s]
[INFO] Apache DeltaSpike Parent .......................... SUCCESS [6.040s]
[INFO] Apache DeltaSpike Test-Utils ...................... SUCCESS [8.069s]
[INFO] Apache DeltaSpike Code Parent ..................... SUCCESS [4.726s]
[INFO] Apache DeltaSpike Core ............................ SUCCESS [2.789s]
[INFO] Apache DeltaSpike Core-API ........................ SUCCESS [23.444s]
[INFO] Apache DeltaSpike Core-Implementation ............. SUCCESS [18.782s]
[INFO] Apache DeltaSpike ContainerControl parent ......... SUCCESS [2.991s]
[INFO] Apache DeltaSpike CDI ContainerControl API ........ SUCCESS [4.131s]
[INFO] Apache DeltaSpike CDI ContainerControl TCK ........ SUCCESS [4.281s]
[INFO] Apache DeltaSpike CDI OWB-ContainerControl ........ SUCCESS [5.865s]
[INFO] Apache DeltaSpike CDI Weld-ContainerControl ....... SUCCESS [7.089s]
[INFO] Apache DeltaSpike CDI OpenEJB-ContainerControl .... SUCCESS [14.440s]
[INFO] Apache DeltaSpike Modules ......................... FAILURE [0.731s]
[INFO] Apache DeltaSpike Security-Module ................. SKIPPED
[INFO] Apache DeltaSpike Security-Module API ............. SKIPPED
[INFO] Apache DeltaSpike Security-Module Impl ............ SKIPPED
[INFO] Apache DeltaSpike JPA-Module ...................... SKIPPED
[INFO] Apache DeltaSpike JPA-Module API .................. SKIPPED
[INFO] Apache DeltaSpike JPA-Module Impl ................. SKIPPED
[INFO] Apache DeltaSpike Servlet-Module .................. SKIPPED
[INFO] Apache DeltaSpike Servlet-Module API .............. SKIPPED
[INFO] Apache DeltaSpike Servlet-Module Impl ............. SKIPPED
[INFO] Apache DeltaSpike JSF-Module ...................... SKIPPED
[INFO] Apache DeltaSpike JSF-Module API .................. SKIPPED
[INFO] Apache DeltaSpike JSF-Module Impl ................. SKIPPED
[INFO] Apache DeltaSpike Partial-Bean-Module ............. SKIPPED
[INFO] Apache DeltaSpike Partial-Bean-Module API ......... SKIPPED
[INFO] Apache DeltaSpike Partial-Bean-Module Impl ........ SKIPPED
[INFO] Apache DeltaSpike BeanValidation-Module ........... SKIPPED
[INFO] Apache DeltaSpike BeanValidation-Module API ....... SKIPPED
[INFO] Apache DeltaSpike BeanValidation-Module Impl ...... SKIPPED
[INFO] Apache DeltaSpike Examples ........................ SKIPPED
[INFO] Apache DeltaSpike Java-SE Examples ................ SKIPPED
[INFO] Apache DeltaSpike JSF Examples .................... SKIPPED
[INFO] ------------------------------------------------------------------------
[INFO] BUILD FAILURE
[INFO] ------------------------------------------------------------------------
[INFO] Total time: 2:22.086s
[INFO] Finished at: Tue Jun 25 00:12:24 UTC 2013
[INFO] Final Memory: 47M/403M
[INFO] ------------------------------------------------------------------------
[JENKINS] Archiving <https://builds.apache.org/job/DeltaSpike%20RAT-Check/ws/deltaspike/pom.xml>
to /home/hudson/hudson/jobs/DeltaSpike RAT-Check/modules/org.apache.deltaspike$deltaspike-project/builds/2013-06-25_00-09-45/archive/org.apache.deltaspike/deltaspike-project/0.5-SNAPSHOT/deltaspike-project-0.5-SNAPSHOT.pom
[JENKINS] Archiving <https://builds.apache.org/job/DeltaSpike%20RAT-Check/ws/deltaspike/modules/partial-bean/impl/pom.xml>
to /home/hudson/hudson/jobs/DeltaSpike RAT-Check/modules/org.apache.deltaspike.modules$deltaspike-partial-bean-module-impl/builds/2013-06-25_00-09-45/archive/org.apache.deltaspike.modules/deltaspike-partial-bean-module-impl/0.5-SNAPSHOT/deltaspike-partial-bean-module-impl-0.5-SNAPSHOT.pom
[JENKINS] Archiving <https://builds.apache.org/job/DeltaSpike%20RAT-Check/ws/deltaspike/cdictrl/impl-openejb/pom.xml>
to /home/hudson/hudson/jobs/DeltaSpike RAT-Check/modules/org.apache.deltaspike.cdictrl$deltaspike-cdictrl-openejb/builds/2013-06-25_00-09-45/archive/org.apache.deltaspike.cdictrl/deltaspike-cdictrl-openejb/0.5-SNAPSHOT/deltaspike-cdictrl-openejb-0.5-SNAPSHOT.pom
[JENKINS] Archiving <https://builds.apache.org/job/DeltaSpike%20RAT-Check/ws/deltaspike/cdictrl/impl-openejb/target/deltaspike-cdictrl-openejb-0.5-SNAPSHOT.jar>
to /home/hudson/hudson/jobs/DeltaSpike RAT-Check/modules/org.apache.deltaspike.cdictrl$deltaspike-cdictrl-openejb/builds/2013-06-25_00-09-45/archive/org.apache.deltaspike.cdictrl/deltaspike-cdictrl-openejb/0.5-SNAPSHOT/deltaspike-cdictrl-openejb-0.5-SNAPSHOT.jar
[JENKINS] Archiving <https://builds.apache.org/job/DeltaSpike%20RAT-Check/ws/deltaspike/cdictrl/impl-openejb/target/deltaspike-cdictrl-openejb-0.5-SNAPSHOT-sources.jar>
to /home/hudson/hudson/jobs/DeltaSpike RAT-Check/modules/org.apache.deltaspike.cdictrl$deltaspike-cdictrl-openejb/builds/2013-06-25_00-09-45/archive/org.apache.deltaspike.cdictrl/deltaspike-cdictrl-openejb/0.5-SNAPSHOT/deltaspike-cdictrl-openejb-0.5-SNAPSHOT-sources.jar
[JENKINS] Archiving <https://builds.apache.org/job/DeltaSpike%20RAT-Check/ws/deltaspike/cdictrl/api/pom.xml>
to /home/hudson/hudson/jobs/DeltaSpike RAT-Check/modules/org.apache.deltaspike.cdictrl$deltaspike-cdictrl-api/builds/2013-06-25_00-09-45/archive/org.apache.deltaspike.cdictrl/deltaspike-cdictrl-api/0.5-SNAPSHOT/deltaspike-cdictrl-api-0.5-SNAPSHOT.pom
[JENKINS] Archiving <https://builds.apache.org/job/DeltaSpike%20RAT-Check/ws/deltaspike/cdictrl/api/target/deltaspike-cdictrl-api-0.5-SNAPSHOT.jar>
to /home/hudson/hudson/jobs/DeltaSpike RAT-Check/modules/org.apache.deltaspike.cdictrl$deltaspike-cdictrl-api/builds/2013-06-25_00-09-45/archive/org.apache.deltaspike.cdictrl/deltaspike-cdictrl-api/0.5-SNAPSHOT/deltaspike-cdictrl-api-0.5-SNAPSHOT.jar
[JENKINS] Archiving <https://builds.apache.org/job/DeltaSpike%20RAT-Check/ws/deltaspike/cdictrl/api/target/deltaspike-cdictrl-api-0.5-SNAPSHOT-sources.jar>
to /home/hudson/hudson/jobs/DeltaSpike RAT-Check/modules/org.apache.deltaspike.cdictrl$deltaspike-cdictrl-api/builds/2013-06-25_00-09-45/archive/org.apache.deltaspike.cdictrl/deltaspike-cdictrl-api/0.5-SNAPSHOT/deltaspike-cdictrl-api-0.5-SNAPSHOT-sources.jar
[JENKINS] Archiving <https://builds.apache.org/job/DeltaSpike%20RAT-Check/ws/deltaspike/test-utils/pom.xml>
to /home/hudson/hudson/jobs/DeltaSpike RAT-Check/modules/org.apache.deltaspike.test$test-utils/builds/2013-06-25_00-09-45/archive/org.apache.deltaspike.test/test-utils/0.5-SNAPSHOT/test-utils-0.5-SNAPSHOT.pom
[JENKINS] Archiving <https://builds.apache.org/job/DeltaSpike%20RAT-Check/ws/deltaspike/test-utils/target/test-utils-0.5-SNAPSHOT.jar>
to /home/hudson/hudson/jobs/DeltaSpike RAT-Check/modules/org.apache.deltaspike.test$test-utils/builds/2013-06-25_00-09-45/archive/org.apache.deltaspike.test/test-utils/0.5-SNAPSHOT/test-utils-0.5-SNAPSHOT.jar
[JENKINS] Archiving <https://builds.apache.org/job/DeltaSpike%20RAT-Check/ws/deltaspike/test-utils/target/test-utils-0.5-SNAPSHOT-sources.jar>
to /home/hudson/hudson/jobs/DeltaSpike RAT-Check/modules/org.apache.deltaspike.test$test-utils/builds/2013-06-25_00-09-45/archive/org.apache.deltaspike.test/test-utils/0.5-SNAPSHOT/test-utils-0.5-SNAPSHOT-sources.jar
[JENKINS] Archiving <https://builds.apache.org/job/DeltaSpike%20RAT-Check/ws/deltaspike/core/impl/pom.xml>
to /home/hudson/hudson/jobs/DeltaSpike RAT-Check/modules/org.apache.deltaspike.core$deltaspike-core-impl/builds/2013-06-25_00-09-45/archive/org.apache.deltaspike.core/deltaspike-core-impl/0.5-SNAPSHOT/deltaspike-core-impl-0.5-SNAPSHOT.pom
[JENKINS] Archiving <https://builds.apache.org/job/DeltaSpike%20RAT-Check/ws/deltaspike/core/impl/target/deltaspike-core-impl-0.5-SNAPSHOT.jar>
to /home/hudson/hudson/jobs/DeltaSpike RAT-Check/modules/org.apache.deltaspike.core$deltaspike-core-impl/builds/2013-06-25_00-09-45/archive/org.apache.deltaspike.core/deltaspike-core-impl/0.5-SNAPSHOT/deltaspike-core-impl-0.5-SNAPSHOT.jar
[JENKINS] Archiving <https://builds.apache.org/job/DeltaSpike%20RAT-Check/ws/deltaspike/core/impl/target/deltaspike-core-impl-0.5-SNAPSHOT-tests.jar>
to /home/hudson/hudson/jobs/DeltaSpike RAT-Check/modules/org.apache.deltaspike.core$deltaspike-core-impl/builds/2013-06-25_00-09-45/archive/org.apache.deltaspike.core/deltaspike-core-impl/0.5-SNAPSHOT/deltaspike-core-impl-0.5-SNAPSHOT-tests.jar
[JENKINS] Archiving <https://builds.apache.org/job/DeltaSpike%20RAT-Check/ws/deltaspike/core/impl/target/deltaspike-core-impl-0.5-SNAPSHOT-sources.jar>
to /home/hudson/hudson/jobs/DeltaSpike RAT-Check/modules/org.apache.deltaspike.core$deltaspike-core-impl/builds/2013-06-25_00-09-45/archive/org.apache.deltaspike.core/deltaspike-core-impl/0.5-SNAPSHOT/deltaspike-core-impl-0.5-SNAPSHOT-sources.jar
[JENKINS] Archiving <https://builds.apache.org/job/DeltaSpike%20RAT-Check/ws/deltaspike/modules/jsf/impl/pom.xml>
to /home/hudson/hudson/jobs/DeltaSpike RAT-Check/modules/org.apache.deltaspike.modules$deltaspike-jsf-module-impl/builds/2013-06-25_00-09-45/archive/org.apache.deltaspike.modules/deltaspike-jsf-module-impl/0.5-SNAPSHOT/deltaspike-jsf-module-impl-0.5-SNAPSHOT.pom
[JENKINS] Archiving <https://builds.apache.org/job/DeltaSpike%20RAT-Check/ws/deltaspike/modules/partial-bean/pom.xml>
to /home/hudson/hudson/jobs/DeltaSpike RAT-Check/modules/org.apache.deltaspike.modules$partial-bean-module-project/builds/2013-06-25_00-09-45/archive/org.apache.deltaspike.modules/partial-bean-module-project/0.5-SNAPSHOT/partial-bean-module-project-0.5-SNAPSHOT.pom
[JENKINS] Archiving <https://builds.apache.org/job/DeltaSpike%20RAT-Check/ws/deltaspike/cdictrl/tck/pom.xml>
to /home/hudson/hudson/jobs/DeltaSpike RAT-Check/modules/org.apache.deltaspike.test$deltaspike-cdictrl-tck/builds/2013-06-25_00-09-45/archive/org.apache.deltaspike.test/deltaspike-cdictrl-tck/0.5-SNAPSHOT/deltaspike-cdictrl-tck-0.5-SNAPSHOT.pom
[JENKINS] Archiving <https://builds.apache.org/job/DeltaSpike%20RAT-Check/ws/deltaspike/cdictrl/tck/target/deltaspike-cdictrl-tck-0.5-SNAPSHOT.jar>
to /home/hudson/hudson/jobs/DeltaSpike RAT-Check/modules/org.apache.deltaspike.test$deltaspike-cdictrl-tck/builds/2013-06-25_00-09-45/archive/org.apache.deltaspike.test/deltaspike-cdictrl-tck/0.5-SNAPSHOT/deltaspike-cdictrl-tck-0.5-SNAPSHOT.jar
[JENKINS] Archiving <https://builds.apache.org/job/DeltaSpike%20RAT-Check/ws/deltaspike/cdictrl/tck/target/deltaspike-cdictrl-tck-0.5-SNAPSHOT-sources.jar>
to /home/hudson/hudson/jobs/DeltaSpike RAT-Check/modules/org.apache.deltaspike.test$deltaspike-cdictrl-tck/builds/2013-06-25_00-09-45/archive/org.apache.deltaspike.test/deltaspike-cdictrl-tck/0.5-SNAPSHOT/deltaspike-cdictrl-tck-0.5-SNAPSHOT-sources.jar
[JENKINS] Archiving <https://builds.apache.org/job/DeltaSpike%20RAT-Check/ws/deltaspike/modules/bean-validation/pom.xml>
to /home/hudson/hudson/jobs/DeltaSpike RAT-Check/modules/org.apache.deltaspike.modules$bean-validation-module-project/builds/2013-06-25_00-09-45/archive/org.apache.deltaspike.modules/bean-validation-module-project/0.5-SNAPSHOT/bean-validation-module-project-0.5-SNAPSHOT.pom
[JENKINS] Archiving <https://builds.apache.org/job/DeltaSpike%20RAT-Check/ws/deltaspike/core/pom.xml>
to /home/hudson/hudson/jobs/DeltaSpike RAT-Check/modules/org.apache.deltaspike.core$core-project/builds/2013-06-25_00-09-45/archive/org.apache.deltaspike.core/core-project/0.5-SNAPSHOT/core-project-0.5-SNAPSHOT.pom
[JENKINS] Archiving <https://builds.apache.org/job/DeltaSpike%20RAT-Check/ws/deltaspike/core/target/core-project-0.5-SNAPSHOT-tests.jar>
to /home/hudson/hudson/jobs/DeltaSpike RAT-Check/modules/org.apache.deltaspike.core$core-project/builds/2013-06-25_00-09-45/archive/org.apache.deltaspike.core/core-project/0.5-SNAPSHOT/core-project-0.5-SNAPSHOT-tests.jar
[JENKINS] Archiving <https://builds.apache.org/job/DeltaSpike%20RAT-Check/ws/deltaspike/modules/bean-validation/impl/pom.xml>
to /home/hudson/hudson/jobs/DeltaSpike RAT-Check/modules/org.apache.deltaspike.modules$deltaspike-bean-validation-module-impl/builds/2013-06-25_00-09-45/archive/org.apache.deltaspike.modules/deltaspike-bean-validation-module-impl/0.5-SNAPSHOT/deltaspike-bean-validation-module-impl-0.5-SNAPSHOT.pom
[JENKINS] Archiving <https://builds.apache.org/job/DeltaSpike%20RAT-Check/ws/deltaspike/checkstyle-rules/pom.xml>
to /home/hudson/hudson/jobs/DeltaSpike RAT-Check/modules/org.apache.deltaspike$checkstyle-rules/builds/2013-06-25_00-09-45/archive/org.apache.deltaspike/checkstyle-rules/0.5-SNAPSHOT/checkstyle-rules-0.5-SNAPSHOT.pom
[JENKINS] Archiving <https://builds.apache.org/job/DeltaSpike%20RAT-Check/ws/deltaspike/checkstyle-rules/target/checkstyle-rules-0.5-SNAPSHOT.jar>
to /home/hudson/hudson/jobs/DeltaSpike RAT-Check/modules/org.apache.deltaspike$checkstyle-rules/builds/2013-06-25_00-09-45/archive/org.apache.deltaspike/checkstyle-rules/0.5-SNAPSHOT/checkstyle-rules-0.5-SNAPSHOT.jar
[JENKINS] Archiving <https://builds.apache.org/job/DeltaSpike%20RAT-Check/ws/deltaspike/modules/servlet/api/pom.xml>
to /home/hudson/hudson/jobs/DeltaSpike RAT-Check/modules/org.apache.deltaspike.modules$deltaspike-servlet-module-api/builds/2013-06-25_00-09-45/archive/org.apache.deltaspike.modules/deltaspike-servlet-module-api/0.5-SNAPSHOT/deltaspike-servlet-module-api-0.5-SNAPSHOT.pom
[JENKINS] Archiving <https://builds.apache.org/job/DeltaSpike%20RAT-Check/ws/deltaspike/examples/jsf-examples/pom.xml>
to /home/hudson/hudson/jobs/DeltaSpike RAT-Check/modules/org.apache.deltaspike.examples$deltaspike-jsf-example/builds/2013-06-25_00-09-45/archive/org.apache.deltaspike.examples/deltaspike-jsf-example/0.5-SNAPSHOT/deltaspike-jsf-example-0.5-SNAPSHOT.pom
[JENKINS] Archiving <https://builds.apache.org/job/DeltaSpike%20RAT-Check/ws/deltaspike/modules/security/api/pom.xml>
to /home/hudson/hudson/jobs/DeltaSpike RAT-Check/modules/org.apache.deltaspike.modules$deltaspike-security-module-api/builds/2013-06-25_00-09-45/archive/org.apache.deltaspike.modules/deltaspike-security-module-api/0.5-SNAPSHOT/deltaspike-security-module-api-0.5-SNAPSHOT.pom
[JENKINS] Archiving <https://builds.apache.org/job/DeltaSpike%20RAT-Check/ws/deltaspike/modules/jpa/pom.xml>
to /home/hudson/hudson/jobs/DeltaSpike RAT-Check/modules/org.apache.deltaspike.modules$jpa-module-project/builds/2013-06-25_00-09-45/archive/org.apache.deltaspike.modules/jpa-module-project/0.5-SNAPSHOT/jpa-module-project-0.5-SNAPSHOT.pom
[JENKINS] Archiving <https://builds.apache.org/job/DeltaSpike%20RAT-Check/ws/deltaspike/parent/pom.xml>
to /home/hudson/hudson/jobs/DeltaSpike RAT-Check/modules/org.apache.deltaspike$parent/builds/2013-06-25_00-09-45/archive/org.apache.deltaspike/parent/0.5-SNAPSHOT/parent-0.5-SNAPSHOT.pom
[JENKINS] Archiving <https://builds.apache.org/job/DeltaSpike%20RAT-Check/ws/deltaspike/cdictrl/impl-weld/pom.xml>
to /home/hudson/hudson/jobs/DeltaSpike RAT-Check/modules/org.apache.deltaspike.cdictrl$deltaspike-cdictrl-weld/builds/2013-06-25_00-09-45/archive/org.apache.deltaspike.cdictrl/deltaspike-cdictrl-weld/0.5-SNAPSHOT/deltaspike-cdictrl-weld-0.5-SNAPSHOT.pom
[JENKINS] Archiving <https://builds.apache.org/job/DeltaSpike%20RAT-Check/ws/deltaspike/cdictrl/impl-weld/target/deltaspike-cdictrl-weld-0.5-SNAPSHOT.jar>
to /home/hudson/hudson/jobs/DeltaSpike RAT-Check/modules/org.apache.deltaspike.cdictrl$deltaspike-cdictrl-weld/builds/2013-06-25_00-09-45/archive/org.apache.deltaspike.cdictrl/deltaspike-cdictrl-weld/0.5-SNAPSHOT/deltaspike-cdictrl-weld-0.5-SNAPSHOT.jar
[JENKINS] Archiving <https://builds.apache.org/job/DeltaSpike%20RAT-Check/ws/deltaspike/cdictrl/impl-weld/target/deltaspike-cdictrl-weld-0.5-SNAPSHOT-sources.jar>
to /home/hudson/hudson/jobs/DeltaSpike RAT-Check/modules/org.apache.deltaspike.cdictrl$deltaspike-cdictrl-weld/builds/2013-06-25_00-09-45/archive/org.apache.deltaspike.cdictrl/deltaspike-cdictrl-weld/0.5-SNAPSHOT/deltaspike-cdictrl-weld-0.5-SNAPSHOT-sources.jar
[JENKINS] Archiving <https://builds.apache.org/job/DeltaSpike%20RAT-Check/ws/deltaspike/examples/jse-examples/pom.xml>
to /home/hudson/hudson/jobs/DeltaSpike RAT-Check/modules/org.apache.deltaspike.examples$deltaspike-jse-example/builds/2013-06-25_00-09-45/archive/org.apache.deltaspike.examples/deltaspike-jse-example/0.5-SNAPSHOT/deltaspike-jse-example-0.5-SNAPSHOT.pom
[JENKINS] Archiving <https://builds.apache.org/job/DeltaSpike%20RAT-Check/ws/deltaspike/modules/partial-bean/api/pom.xml>
to /home/hudson/hudson/jobs/DeltaSpike RAT-Check/modules/org.apache.deltaspike.modules$deltaspike-partial-bean-module-api/builds/2013-06-25_00-09-45/archive/org.apache.deltaspike.modules/deltaspike-partial-bean-module-api/0.5-SNAPSHOT/deltaspike-partial-bean-module-api-0.5-SNAPSHOT.pom
[JENKINS] Archiving <https://builds.apache.org/job/DeltaSpike%20RAT-Check/ws/deltaspike/modules/security/pom.xml>
to /home/hudson/hudson/jobs/DeltaSpike RAT-Check/modules/org.apache.deltaspike.modules$security-module-project/builds/2013-06-25_00-09-45/archive/org.apache.deltaspike.modules/security-module-project/0.5-SNAPSHOT/security-module-project-0.5-SNAPSHOT.pom
[JENKINS] Archiving <https://builds.apache.org/job/DeltaSpike%20RAT-Check/ws/deltaspike/cdictrl/impl-owb/pom.xml>
to /home/hudson/hudson/jobs/DeltaSpike RAT-Check/modules/org.apache.deltaspike.cdictrl$deltaspike-cdictrl-owb/builds/2013-06-25_00-09-45/archive/org.apache.deltaspike.cdictrl/deltaspike-cdictrl-owb/0.5-SNAPSHOT/deltaspike-cdictrl-owb-0.5-SNAPSHOT.pom
[JENKINS] Archiving <https://builds.apache.org/job/DeltaSpike%20RAT-Check/ws/deltaspike/cdictrl/impl-owb/target/deltaspike-cdictrl-owb-0.5-SNAPSHOT.jar>
to /home/hudson/hudson/jobs/DeltaSpike RAT-Check/modules/org.apache.deltaspike.cdictrl$deltaspike-cdictrl-owb/builds/2013-06-25_00-09-45/archive/org.apache.deltaspike.cdictrl/deltaspike-cdictrl-owb/0.5-SNAPSHOT/deltaspike-cdictrl-owb-0.5-SNAPSHOT.jar
[JENKINS] Archiving <https://builds.apache.org/job/DeltaSpike%20RAT-Check/ws/deltaspike/cdictrl/impl-owb/target/deltaspike-cdictrl-owb-0.5-SNAPSHOT-sources.jar>
to /home/hudson/hudson/jobs/DeltaSpike RAT-Check/modules/org.apache.deltaspike.cdictrl$deltaspike-cdictrl-owb/builds/2013-06-25_00-09-45/archive/org.apache.deltaspike.cdictrl/deltaspike-cdictrl-owb/0.5-SNAPSHOT/deltaspike-cdictrl-owb-0.5-SNAPSHOT-sources.jar
[JENKINS] Archiving <https://builds.apache.org/job/DeltaSpike%20RAT-Check/ws/deltaspike/modules/jsf/pom.xml>
to /home/hudson/hudson/jobs/DeltaSpike RAT-Check/modules/org.apache.deltaspike.modules$jsf-module-project/builds/2013-06-25_00-09-45/archive/org.apache.deltaspike.modules/jsf-module-project/0.5-SNAPSHOT/jsf-module-project-0.5-SNAPSHOT.pom
[JENKINS] Archiving <https://builds.apache.org/job/DeltaSpike%20RAT-Check/ws/deltaspike/modules/bean-validation/api/pom.xml>
to /home/hudson/hudson/jobs/DeltaSpike RAT-Check/modules/org.apache.deltaspike.modules$deltaspike-bean-validation-module-api/builds/2013-06-25_00-09-45/archive/org.apache.deltaspike.modules/deltaspike-bean-validation-module-api/0.5-SNAPSHOT/deltaspike-bean-validation-module-api-0.5-SNAPSHOT.pom
[JENKINS] Archiving <https://builds.apache.org/job/DeltaSpike%20RAT-Check/ws/deltaspike/core/api/pom.xml>
to /home/hudson/hudson/jobs/DeltaSpike RAT-Check/modules/org.apache.deltaspike.core$deltaspike-core-api/builds/2013-06-25_00-09-45/archive/org.apache.deltaspike.core/deltaspike-core-api/0.5-SNAPSHOT/deltaspike-core-api-0.5-SNAPSHOT.pom
[JENKINS] Archiving <https://builds.apache.org/job/DeltaSpike%20RAT-Check/ws/deltaspike/core/api/target/deltaspike-core-api-0.5-SNAPSHOT.jar>
to /home/hudson/hudson/jobs/DeltaSpike RAT-Check/modules/org.apache.deltaspike.core$deltaspike-core-api/builds/2013-06-25_00-09-45/archive/org.apache.deltaspike.core/deltaspike-core-api/0.5-SNAPSHOT/deltaspike-core-api-0.5-SNAPSHOT.jar
[JENKINS] Archiving <https://builds.apache.org/job/DeltaSpike%20RAT-Check/ws/deltaspike/core/api/target/deltaspike-core-api-0.5-SNAPSHOT-tests.jar>
to /home/hudson/hudson/jobs/DeltaSpike RAT-Check/modules/org.apache.deltaspike.core$deltaspike-core-api/builds/2013-06-25_00-09-45/archive/org.apache.deltaspike.core/deltaspike-core-api/0.5-SNAPSHOT/deltaspike-core-api-0.5-SNAPSHOT-tests.jar
[JENKINS] Archiving <https://builds.apache.org/job/DeltaSpike%20RAT-Check/ws/deltaspike/core/api/target/deltaspike-core-api-0.5-SNAPSHOT-sources.jar>
to /home/hudson/hudson/jobs/DeltaSpike RAT-Check/modules/org.apache.deltaspike.core$deltaspike-core-api/builds/2013-06-25_00-09-45/archive/org.apache.deltaspike.core/deltaspike-core-api/0.5-SNAPSHOT/deltaspike-core-api-0.5-SNAPSHOT-sources.jar
[JENKINS] Archiving <https://builds.apache.org/job/DeltaSpike%20RAT-Check/ws/deltaspike/modules/servlet/pom.xml>
to /home/hudson/hudson/jobs/DeltaSpike RAT-Check/modules/org.apache.deltaspike.modules$servlet-module-project/builds/2013-06-25_00-09-45/archive/org.apache.deltaspike.modules/servlet-module-project/0.5-SNAPSHOT/servlet-module-project-0.5-SNAPSHOT.pom
[JENKINS] Archiving <https://builds.apache.org/job/DeltaSpike%20RAT-Check/ws/deltaspike/parent/code/pom.xml>
to /home/hudson/hudson/jobs/DeltaSpike RAT-Check/modules/org.apache.deltaspike$parent-code/builds/2013-06-25_00-09-45/archive/org.apache.deltaspike/parent-code/0.5-SNAPSHOT/parent-code-0.5-SNAPSHOT.pom
[JENKINS] Archiving <https://builds.apache.org/job/DeltaSpike%20RAT-Check/ws/deltaspike/parent/code/target/parent-code-0.5-SNAPSHOT-tests.jar>
to /home/hudson/hudson/jobs/DeltaSpike RAT-Check/modules/org.apache.deltaspike$parent-code/builds/2013-06-25_00-09-45/archive/org.apache.deltaspike/parent-code/0.5-SNAPSHOT/parent-code-0.5-SNAPSHOT-tests.jar
[JENKINS] Archiving <https://builds.apache.org/job/DeltaSpike%20RAT-Check/ws/deltaspike/modules/pom.xml>
to /home/hudson/hudson/jobs/DeltaSpike RAT-Check/modules/org.apache.deltaspike.modules$modules-project/builds/2013-06-25_00-09-45/archive/org.apache.deltaspike.modules/modules-project/0.5-SNAPSHOT/modules-project-0.5-SNAPSHOT.pom
[JENKINS] Archiving <https://builds.apache.org/job/DeltaSpike%20RAT-Check/ws/deltaspike/modules/jpa/impl/pom.xml>
to /home/hudson/hudson/jobs/DeltaSpike RAT-Check/modules/org.apache.deltaspike.modules$deltaspike-jpa-module-impl/builds/2013-06-25_00-09-45/archive/org.apache.deltaspike.modules/deltaspike-jpa-module-impl/0.5-SNAPSHOT/deltaspike-jpa-module-impl-0.5-SNAPSHOT.pom
[JENKINS] Archiving <https://builds.apache.org/job/DeltaSpike%20RAT-Check/ws/deltaspike/modules/servlet/impl/pom.xml>
to /home/hudson/hudson/jobs/DeltaSpike RAT-Check/modules/org.apache.deltaspike.modules$deltaspike-servlet-module-impl/builds/2013-06-25_00-09-45/archive/org.apache.deltaspike.modules/deltaspike-servlet-module-impl/0.5-SNAPSHOT/deltaspike-servlet-module-impl-0.5-SNAPSHOT.pom
[JENKINS] Archiving <https://builds.apache.org/job/DeltaSpike%20RAT-Check/ws/deltaspike/modules/security/impl/pom.xml>
to /home/hudson/hudson/jobs/DeltaSpike RAT-Check/modules/org.apache.deltaspike.modules$deltaspike-security-module-impl/builds/2013-06-25_00-09-45/archive/org.apache.deltaspike.modules/deltaspike-security-module-impl/0.5-SNAPSHOT/deltaspike-security-module-impl-0.5-SNAPSHOT.pom
[JENKINS] Archiving <https://builds.apache.org/job/DeltaSpike%20RAT-Check/ws/deltaspike/modules/jpa/api/pom.xml>
to /home/hudson/hudson/jobs/DeltaSpike RAT-Check/modules/org.apache.deltaspike.modules$deltaspike-jpa-module-api/builds/2013-06-25_00-09-45/archive/org.apache.deltaspike.modules/deltaspike-jpa-module-api/0.5-SNAPSHOT/deltaspike-jpa-module-api-0.5-SNAPSHOT.pom
[JENKINS] Archiving <https://builds.apache.org/job/DeltaSpike%20RAT-Check/ws/deltaspike/modules/jsf/api/pom.xml>
to /home/hudson/hudson/jobs/DeltaSpike RAT-Check/modules/org.apache.deltaspike.modules$deltaspike-jsf-module-api/builds/2013-06-25_00-09-45/archive/org.apache.deltaspike.modules/deltaspike-jsf-module-api/0.5-SNAPSHOT/deltaspike-jsf-module-api-0.5-SNAPSHOT.pom
[JENKINS] Archiving <https://builds.apache.org/job/DeltaSpike%20RAT-Check/ws/deltaspike/examples/pom.xml>
to /home/hudson/hudson/jobs/DeltaSpike RAT-Check/modules/org.apache.deltaspike.examples$examples-project/builds/2013-06-25_00-09-45/archive/org.apache.deltaspike.examples/examples-project/0.5-SNAPSHOT/examples-project-0.5-SNAPSHOT.pom
[JENKINS] Archiving <https://builds.apache.org/job/DeltaSpike%20RAT-Check/ws/deltaspike/cdictrl/pom.xml>
to /home/hudson/hudson/jobs/DeltaSpike RAT-Check/modules/org.apache.deltaspike.cdictrl$cdictrl-project/builds/2013-06-25_00-09-45/archive/org.apache.deltaspike.cdictrl/cdictrl-project/0.5-SNAPSHOT/cdictrl-project-0.5-SNAPSHOT.pom
Waiting for Jenkins to finish collecting data
mavenExecutionResult exceptions not empty
message : Failed to execute goal org.apache.rat:apache-rat-plugin:0.8:check (default) on project
modules-project: Too many unapproved licenses: 16
cause : Too many unapproved licenses: 16
Stack trace : 
org.apache.maven.lifecycle.LifecycleExecutionException: Failed to execute goal org.apache.rat:apache-rat-plugin:0.8:check
(default) on project modules-project: Too many unapproved licenses: 16
	at org.apache.maven.lifecycle.internal.MojoExecutor.execute(MojoExecutor.java:213)
	at org.apache.maven.lifecycle.internal.MojoExecutor.execute(MojoExecutor.java:153)
	at org.apache.maven.lifecycle.internal.MojoExecutor.execute(MojoExecutor.java:145)
	at org.apache.maven.lifecycle.internal.LifecycleModuleBuilder.buildProject(LifecycleModuleBuilder.java:84)
	at org.apache.maven.lifecycle.internal.LifecycleModuleBuilder.buildProject(LifecycleModuleBuilder.java:59)
	at org.apache.maven.lifecycle.internal.LifecycleStarter.singleThreadedBuild(LifecycleStarter.java:183)
	at org.apache.maven.lifecycle.internal.LifecycleStarter.execute(LifecycleStarter.java:161)
	at org.apache.maven.DefaultMaven.doExecute(DefaultMaven.java:320)
	at org.apache.maven.DefaultMaven.execute(DefaultMaven.java:156)
	at org.jvnet.hudson.maven3.launcher.Maven3Launcher.main(Maven3Launcher.java:79)
	at sun.reflect.NativeMethodAccessorImpl.invoke0(Native Method)
	at sun.reflect.NativeMethodAccessorImpl.invoke(NativeMethodAccessorImpl.java:39)
	at sun.reflect.DelegatingMethodAccessorImpl.invoke(DelegatingMethodAccessorImpl.java:25)
	at java.lang.reflect.Method.invoke(Method.java:597)
	at org.codehaus.plexus.classworlds.launcher.Launcher.launchStandard(Launcher.java:329)
	at org.codehaus.plexus.classworlds.launcher.Launcher.launch(Launcher.java:239)
	at org.jvnet.hudson.maven3.agent.Maven3Main.launch(Maven3Main.java:158)
	at hudson.maven.Maven3Builder.call(Maven3Builder.java:100)
	at hudson.maven.Maven3Builder.call(Maven3Builder.java:66)
	at hudson.remoting.UserRequest.perform(UserRequest.java:118)
	at hudson.remoting.UserRequest.perform(UserRequest.java:48)
	at hudson.remoting.Request$2.run(Request.java:326)
	at hudson.remoting.InterceptingExecutorService$1.call(InterceptingExecutorService.java:72)
	at java.util.concurrent.FutureTask$Sync.innerRun(FutureTask.java:303)
	at java.util.concurrent.FutureTask.run(FutureTask.java:138)
	at java.util.concurrent.ThreadPoolExecutor$Worker.runTask(ThreadPoolExecutor.java:895)
	at java.util.concurrent.ThreadPoolExecutor$Worker.run(ThreadPoolExecutor.java:918)
	at java.lang.Thread.run(Thread.java:662)
Caused by: org.apache.rat.mp.RatCheckException: Too many unapproved licenses: 16
	at org.apache.rat.mp.RatCheckMojo.check(RatCheckMojo.java:167)
	at org.apache.rat.mp.RatCheckMojo.execute(RatCheckMojo.java:159)
	at org.apache.maven.plugin.DefaultBuildPluginManager.executeMojo(DefaultBuildPluginManager.java:101)
	at org.apache.maven.lifecycle.internal.MojoExecutor.execute(MojoExecutor.java:209)
	... 27 more
Sending e-mails to: commits@deltaspike.apache.org
channel stopped

Mime
View raw message