deltaspike-commits mailing list archives

Site index · List index
Message view « Date » · « Thread »
Top « Date » · « Thread »
From Apache Jenkins Server <jenk...@builds.apache.org>
Subject Build failed in Jenkins: DeltaSpike_TomEE #209
Date Sat, 11 May 2013 02:54:17 GMT
See <https://builds.apache.org/job/DeltaSpike_TomEE/209/changes>

Changes:

[gpetracek] DELTASPIKE-288 ConfigDescriptorValidator (optional)

------------------------------------------
[...truncated 583 lines...]
[INFO] --- maven-bundle-plugin:2.3.7:cleanVersions (versions) @ parent-code ---
[INFO] [WARNING] Parameter tasks is deprecated, use target instead

[INFO] --- maven-antrun-plugin:1.6:run (javadoc.resources) @ parent-code ---
[INFO] Executing tasks

main:
[INFO] Executed tasks
May 11, 2013 2:53:32 AM hudson.maven.ExecutedMojo <init>
WARNING: Failed to getClass for org.apache.maven.plugin.source.SourceJarMojo
[INFO] 
[INFO] --- maven-source-plugin:2.1.2:jar (attach-sources) @ parent-code ---
[INFO] 
[INFO] --- maven-checkstyle-plugin:2.9.1:check (verify-style) @ parent-code ---
[INFO] Starting audit...
Audit done.

[INFO] [INFO] Installing <https://builds.apache.org/job/DeltaSpike_TomEE/ws/deltaspike/parent/code/pom.xml>
to /home/jenkins/jenkins-slave/maven-repositories/0/org/apache/deltaspike/parent-code/0.4-incubating-SNAPSHOT/parent-code-0.4-incubating-SNAPSHOT.pom
[INFO] Installing <https://builds.apache.org/job/DeltaSpike_TomEE/ws/deltaspike/parent/code/target/parent-code-0.4-incubating-SNAPSHOT-tests.jar>
to /home/jenkins/jenkins-slave/maven-repositories/0/org/apache/deltaspike/parent-code/0.4-incubating-SNAPSHOT/parent-code-0.4-incubating-SNAPSHOT-tests.jar

[INFO] --- maven-install-plugin:2.3.1:install (default-install) @ parent-code ---
[INFO]                                                                         
[INFO] ------------------------------------------------------------------------
[INFO] Building Apache DeltaSpike Core 0.4-incubating-SNAPSHOT
[INFO] ------------------------------------------------------------------------
[INFO] 
[INFO] --- maven-clean-plugin:2.5:clean (default-clean) @ core-project ---
[INFO] 
[INFO] --- maven-bundle-plugin:2.3.7:cleanVersions (versions) @ core-project ---
[WARNING] Parameter tasks is deprecated, use target instead
[INFO] [INFO] Executing tasks

main:
[INFO] Executed tasks

[INFO] --- maven-antrun-plugin:1.6:run (javadoc.resources) @ core-project ---
[INFO] 
[INFO] --- maven-remote-resources-plugin:1.3:process (process-remote-resources) @ core-project
---
[INFO] 
[INFO] --- maven-remote-resources-plugin:1.3:process (default) @ core-project ---
[INFO] 
[INFO] --- maven-site-plugin:3.1:attach-descriptor (attach-descriptor) @ core-project ---
[INFO] [WARNING] JAR will be empty - no content was marked for inclusion!
[INFO] Building jar: <https://builds.apache.org/job/DeltaSpike_TomEE/ws/deltaspike/core/target/core-project-0.4-incubating-SNAPSHOT-tests.jar>

[INFO] --- maven-jar-plugin:2.4:test-jar (default) @ core-project ---
[INFO] 
[INFO] --- maven-bundle-plugin:2.3.7:cleanVersions (versions) @ core-project ---
[INFO] [WARNING] Parameter tasks is deprecated, use target instead

[INFO] --- maven-antrun-plugin:1.6:run (javadoc.resources) @ core-project ---
[INFO] Executing tasks

main:
[INFO] Executed tasks
May 11, 2013 2:53:35 AM hudson.maven.ExecutedMojo <init>
WARNING: Failed to getClass for org.apache.maven.plugin.source.SourceJarMojo
[INFO] 
[INFO] --- maven-source-plugin:2.1.2:jar (attach-sources) @ core-project ---
[INFO] 
[INFO] --- maven-checkstyle-plugin:2.9.1:check (verify-style) @ core-project ---
[INFO] Starting audit...
Audit done.

[INFO] Installing <https://builds.apache.org/job/DeltaSpike_TomEE/ws/deltaspike/core/pom.xml>
to /home/jenkins/jenkins-slave/maven-repositories/0/org/apache/deltaspike/core/core-project/0.4-incubating-SNAPSHOT/core-project-0.4-incubating-SNAPSHOT.pom
[INFO] [INFO] Installing <https://builds.apache.org/job/DeltaSpike_TomEE/ws/deltaspike/core/target/core-project-0.4-incubating-SNAPSHOT-tests.jar>
to /home/jenkins/jenkins-slave/maven-repositories/0/org/apache/deltaspike/core/core-project/0.4-incubating-SNAPSHOT/core-project-0.4-incubating-SNAPSHOT-tests.jar

[INFO] --- maven-install-plugin:2.3.1:install (default-install) @ core-project ---
[INFO]                                                                         
[INFO] ------------------------------------------------------------------------
[INFO] Building Apache DeltaSpike Core-API 0.4-incubating-SNAPSHOT
[INFO] ------------------------------------------------------------------------
[INFO] 
[INFO] --- maven-clean-plugin:2.5:clean (default-clean) @ deltaspike-core-api ---
[INFO] 
[INFO] --- maven-bundle-plugin:2.3.7:cleanVersions (versions) @ deltaspike-core-api ---
[INFO] [WARNING] Parameter tasks is deprecated, use target instead

[INFO] --- maven-antrun-plugin:1.6:run (javadoc.resources) @ deltaspike-core-api ---
[INFO] Executing tasks

main:
[INFO] Executed tasks
[INFO] 
[INFO] --- maven-remote-resources-plugin:1.3:process (process-remote-resources) @ deltaspike-core-api
---
[INFO] 
[INFO] --- maven-remote-resources-plugin:1.3:process (default) @ deltaspike-core-api ---
[debug] execute contextualize
[INFO] [INFO] Using 'UTF-8' encoding to copy filtered resources.
[INFO] Copying 2 resources
[INFO] Copying 4 resources
[INFO] Copying 4 resources

[INFO] --- maven-resources-plugin:2.5:resources (default-resources) @ deltaspike-core-api
---
[INFO] 
[INFO] --- maven-compiler-plugin:2.5:compile (default-compile) @ deltaspike-core-api ---
[INFO] Compiling 133 source files to <https://builds.apache.org/job/DeltaSpike_TomEE/ws/deltaspike/core/api/target/classes>
[INFO] -------------------------------------------------------------
[ERROR] COMPILATION ERROR : 
[INFO] -------------------------------------------------------------
[ERROR] <https://builds.apache.org/job/DeltaSpike_TomEE/ws/deltaspike/core/api/src/main/java/org/apache/deltaspike/core/api/message/MessageContextConfig.java>:[59,78]
incompatible types
found   : java.lang.Class<org.apache.deltaspike.core.api.message.MessageResolver>
required: java.lang.Class<? extends org.apache.deltaspike.core.api.message.MessageResolver>
[ERROR] <https://builds.apache.org/job/DeltaSpike_TomEE/ws/deltaspike/core/api/src/main/java/org/apache/deltaspike/core/api/message/MessageContextConfig.java>:[65,90]
incompatible types
found   : java.lang.Class<org.apache.deltaspike.core.api.message.MessageInterpolator>
required: java.lang.Class<? extends org.apache.deltaspike.core.api.message.MessageInterpolator>
[ERROR] <https://builds.apache.org/job/DeltaSpike_TomEE/ws/deltaspike/core/api/src/main/java/org/apache/deltaspike/core/api/message/MessageContextConfig.java>:[72,75]
incompatible types
found   : java.lang.Class<org.apache.deltaspike.core.api.message.LocaleResolver>
required: java.lang.Class<? extends org.apache.deltaspike.core.api.message.LocaleResolver>
[ERROR] <https://builds.apache.org/job/DeltaSpike_TomEE/ws/deltaspike/core/api/src/main/java/org/apache/deltaspike/core/spi/config/view/ViewConfigRoot.java>:[45,34]
incompatible types
found   : java.lang.Class<org.apache.deltaspike.core.api.config.view.metadata.ViewConfigResolver>
required: java.lang.Class<? extends org.apache.deltaspike.core.api.config.view.metadata.ViewConfigResolver>
[ERROR] <https://builds.apache.org/job/DeltaSpike_TomEE/ws/deltaspike/core/api/src/main/java/org/apache/deltaspike/core/spi/config/view/ViewConfigRoot.java>:[48,35]
incompatible types
found   : java.lang.Class<org.apache.deltaspike.core.spi.config.view.ConfigNodeConverter>
required: java.lang.Class<? extends org.apache.deltaspike.core.spi.config.view.ConfigNodeConverter>
[ERROR] <https://builds.apache.org/job/DeltaSpike_TomEE/ws/deltaspike/core/api/src/main/java/org/apache/deltaspike/core/spi/config/view/ViewConfigRoot.java>:[51,45]
incompatible types
found   : java.lang.Class<org.apache.deltaspike.core.spi.config.view.ViewConfigInheritanceStrategy>
required: java.lang.Class<? extends org.apache.deltaspike.core.spi.config.view.ViewConfigInheritanceStrategy>
[ERROR] <https://builds.apache.org/job/DeltaSpike_TomEE/ws/deltaspike/core/api/src/main/java/org/apache/deltaspike/core/api/config/view/metadata/ViewMetaData.java>:[42,81]
incompatible types
found   : java.lang.Class<org.apache.deltaspike.core.spi.config.view.ConfigPreProcessor>
required: java.lang.Class<? extends org.apache.deltaspike.core.spi.config.view.ConfigPreProcessor>
[ERROR] <https://builds.apache.org/job/DeltaSpike_TomEE/ws/deltaspike/core/api/src/main/java/org/apache/deltaspike/core/api/config/view/metadata/InlineViewMetaData.java>:[39,108]
incompatible types
found   : java.lang.Class<org.apache.deltaspike.core.spi.config.view.InlineMetaDataTransformer>
required: java.lang.Class<? extends org.apache.deltaspike.core.spi.config.view.InlineMetaDataTransformer>
[ERROR] <https://builds.apache.org/job/DeltaSpike_TomEE/ws/deltaspike/core/api/src/main/java/org/apache/deltaspike/core/api/jmx/NotificationInfo.java>:[36,74]
incompatible types
found   : java.lang.Class<javax.management.Notification>
required: java.lang.Class<? extends javax.management.Notification>
[ERROR] <https://builds.apache.org/job/DeltaSpike_TomEE/ws/deltaspike/core/api/src/main/java/org/apache/deltaspike/core/api/exclude/Exclude.java>:[104,88]
incompatible types
found   : java.lang.Class<org.apache.deltaspike.core.api.interpreter.ExpressionInterpreter>
required: java.lang.Class<? extends org.apache.deltaspike.core.api.interpreter.ExpressionInterpreter>
[INFO] 10 errors 
[INFO] -------------------------------------------------------------
[INFO] ------------------------------------------------------------------------
[INFO] Reactor Summary:
[INFO] 
[INFO] Apache DeltaSpike ................................. SUCCESS [16.322s]
[INFO] Apache DeltaSpike CheckStyle-rules ................ SUCCESS [2.612s]
[INFO] Apache DeltaSpike Parent .......................... SUCCESS [3.515s]
[INFO] Apache DeltaSpike Test-Utils ...................... SUCCESS [5.133s]
[INFO] Apache DeltaSpike Code Parent ..................... SUCCESS [27.123s]
[INFO] Apache DeltaSpike Core ............................ SUCCESS [3.169s]
[INFO] Apache DeltaSpike Core-API ........................ FAILURE [3.242s]
[INFO] Apache DeltaSpike Core-Implementation ............. SKIPPED
[INFO] Apache DeltaSpike ContainerControl parent ......... SKIPPED
[INFO] Apache DeltaSpike CDI ContainerControl API ........ SKIPPED
[INFO] Apache DeltaSpike CDI ContainerControl TCK ........ SKIPPED
[INFO] Apache DeltaSpike CDI OWB-ContainerControl ........ SKIPPED
[INFO] Apache DeltaSpike CDI Weld-ContainerControl ....... SKIPPED
[INFO] Apache DeltaSpike CDI OpenEJB-ContainerControl .... SKIPPED
[INFO] Apache DeltaSpike Modules ......................... SKIPPED
[INFO] Apache DeltaSpike Security-Module ................. SKIPPED
[INFO] Apache DeltaSpike Security-Module API ............. SKIPPED
[INFO] Apache DeltaSpike Security-Module Impl ............ SKIPPED
[INFO] Apache DeltaSpike JPA-Module ...................... SKIPPED
[INFO] Apache DeltaSpike JPA-Module API .................. SKIPPED
[INFO] Apache DeltaSpike JPA-Module Impl ................. SKIPPED
[INFO] Apache DeltaSpike JSF-Module ...................... SKIPPED
[INFO] Apache DeltaSpike JSF-Module API .................. SKIPPED
[INFO] Apache DeltaSpike JSF-Module Impl ................. SKIPPED
[INFO] Apache DeltaSpike Partial-Bean-Module ............. SKIPPED
[INFO] Apache DeltaSpike Partial-Bean-Module API ......... SKIPPED
[INFO] Apache DeltaSpike Partial-Bean-Module Impl ........ SKIPPED
[INFO] Apache DeltaSpike Examples ........................ SKIPPED
[INFO] Apache DeltaSpike Java-SE Examples ................ SKIPPED
[INFO] Apache DeltaSpike JSF Examples .................... SKIPPED
[INFO] ------------------------------------------------------------------------
[INFO] BUILD FAILURE
[INFO] ------------------------------------------------------------------------
[INFO] Total time: 1:05.314s
[INFO] Finished at: Sat May 11 02:53:39 UTC 2013
[INFO] Final Memory: 43M/311M
[INFO] ------------------------------------------------------------------------
[JENKINS] Archiving <https://builds.apache.org/job/DeltaSpike_TomEE/ws/deltaspike/pom.xml>
to /home/hudson/hudson/jobs/DeltaSpike_TomEE/modules/org.apache.deltaspike$deltaspike-project/builds/2013-05-11_02-52-16/archive/org.apache.deltaspike/deltaspike-project/0.4-incubating-SNAPSHOT/deltaspike-project-0.4-incubating-SNAPSHOT.pom
[JENKINS] Archiving <https://builds.apache.org/job/DeltaSpike_TomEE/ws/deltaspike/modules/partial-bean/impl/pom.xml>
to /home/hudson/hudson/jobs/DeltaSpike_TomEE/modules/org.apache.deltaspike.modules$deltaspike-partial-bean-module-impl/builds/2013-05-11_02-52-16/archive/org.apache.deltaspike.modules/deltaspike-partial-bean-module-impl/0.4-incubating-SNAPSHOT/deltaspike-partial-bean-module-impl-0.4-incubating-SNAPSHOT.pom
[JENKINS] Archiving <https://builds.apache.org/job/DeltaSpike_TomEE/ws/deltaspike/cdictrl/impl-openejb/pom.xml>
to /home/hudson/hudson/jobs/DeltaSpike_TomEE/modules/org.apache.deltaspike.cdictrl$deltaspike-cdictrl-openejb/builds/2013-05-11_02-52-16/archive/org.apache.deltaspike.cdictrl/deltaspike-cdictrl-openejb/0.4-incubating-SNAPSHOT/deltaspike-cdictrl-openejb-0.4-incubating-SNAPSHOT.pom
[JENKINS] Archiving <https://builds.apache.org/job/DeltaSpike_TomEE/ws/deltaspike/cdictrl/api/pom.xml>
to /home/hudson/hudson/jobs/DeltaSpike_TomEE/modules/org.apache.deltaspike.cdictrl$deltaspike-cdictrl-api/builds/2013-05-11_02-52-16/archive/org.apache.deltaspike.cdictrl/deltaspike-cdictrl-api/0.4-incubating-SNAPSHOT/deltaspike-cdictrl-api-0.4-incubating-SNAPSHOT.pom
[JENKINS] Archiving <https://builds.apache.org/job/DeltaSpike_TomEE/ws/deltaspike/test-utils/pom.xml>
to /home/hudson/hudson/jobs/DeltaSpike_TomEE/modules/org.apache.deltaspike.test$test-utils/builds/2013-05-11_02-52-16/archive/org.apache.deltaspike.test/test-utils/0.4-incubating-SNAPSHOT/test-utils-0.4-incubating-SNAPSHOT.pom
[JENKINS] Archiving <https://builds.apache.org/job/DeltaSpike_TomEE/ws/deltaspike/test-utils/target/test-utils-0.4-incubating-SNAPSHOT.jar>
to /home/hudson/hudson/jobs/DeltaSpike_TomEE/modules/org.apache.deltaspike.test$test-utils/builds/2013-05-11_02-52-16/archive/org.apache.deltaspike.test/test-utils/0.4-incubating-SNAPSHOT/test-utils-0.4-incubating-SNAPSHOT.jar
[JENKINS] Archiving <https://builds.apache.org/job/DeltaSpike_TomEE/ws/deltaspike/test-utils/target/test-utils-0.4-incubating-SNAPSHOT-sources.jar>
to /home/hudson/hudson/jobs/DeltaSpike_TomEE/modules/org.apache.deltaspike.test$test-utils/builds/2013-05-11_02-52-16/archive/org.apache.deltaspike.test/test-utils/0.4-incubating-SNAPSHOT/test-utils-0.4-incubating-SNAPSHOT-sources.jar
[JENKINS] Archiving <https://builds.apache.org/job/DeltaSpike_TomEE/ws/deltaspike/core/impl/pom.xml>
to /home/hudson/hudson/jobs/DeltaSpike_TomEE/modules/org.apache.deltaspike.core$deltaspike-core-impl/builds/2013-05-11_02-52-16/archive/org.apache.deltaspike.core/deltaspike-core-impl/0.4-incubating-SNAPSHOT/deltaspike-core-impl-0.4-incubating-SNAPSHOT.pom
[JENKINS] Archiving <https://builds.apache.org/job/DeltaSpike_TomEE/ws/deltaspike/modules/jsf/impl/pom.xml>
to /home/hudson/hudson/jobs/DeltaSpike_TomEE/modules/org.apache.deltaspike.modules$deltaspike-jsf-module-impl/builds/2013-05-11_02-52-16/archive/org.apache.deltaspike.modules/deltaspike-jsf-module-impl/0.4-incubating-SNAPSHOT/deltaspike-jsf-module-impl-0.4-incubating-SNAPSHOT.pom
[JENKINS] Archiving <https://builds.apache.org/job/DeltaSpike_TomEE/ws/deltaspike/modules/partial-bean/pom.xml>
to /home/hudson/hudson/jobs/DeltaSpike_TomEE/modules/org.apache.deltaspike.modules$partial-bean-module-project/builds/2013-05-11_02-52-16/archive/org.apache.deltaspike.modules/partial-bean-module-project/0.4-incubating-SNAPSHOT/partial-bean-module-project-0.4-incubating-SNAPSHOT.pom
[JENKINS] Archiving <https://builds.apache.org/job/DeltaSpike_TomEE/ws/deltaspike/cdictrl/tck/pom.xml>
to /home/hudson/hudson/jobs/DeltaSpike_TomEE/modules/org.apache.deltaspike.test$deltaspike-cdictrl-tck/builds/2013-05-11_02-52-16/archive/org.apache.deltaspike.test/deltaspike-cdictrl-tck/0.4-incubating-SNAPSHOT/deltaspike-cdictrl-tck-0.4-incubating-SNAPSHOT.pom
[JENKINS] Archiving <https://builds.apache.org/job/DeltaSpike_TomEE/ws/deltaspike/core/pom.xml>
to /home/hudson/hudson/jobs/DeltaSpike_TomEE/modules/org.apache.deltaspike.core$core-project/builds/2013-05-11_02-52-16/archive/org.apache.deltaspike.core/core-project/0.4-incubating-SNAPSHOT/core-project-0.4-incubating-SNAPSHOT.pom
[JENKINS] Archiving <https://builds.apache.org/job/DeltaSpike_TomEE/ws/deltaspike/core/target/core-project-0.4-incubating-SNAPSHOT-tests.jar>
to /home/hudson/hudson/jobs/DeltaSpike_TomEE/modules/org.apache.deltaspike.core$core-project/builds/2013-05-11_02-52-16/archive/org.apache.deltaspike.core/core-project/0.4-incubating-SNAPSHOT/core-project-0.4-incubating-SNAPSHOT-tests.jar
[JENKINS] Archiving <https://builds.apache.org/job/DeltaSpike_TomEE/ws/deltaspike/checkstyle-rules/pom.xml>
to /home/hudson/hudson/jobs/DeltaSpike_TomEE/modules/org.apache.deltaspike$checkstyle-rules/builds/2013-05-11_02-52-16/archive/org.apache.deltaspike/checkstyle-rules/0.4-incubating-SNAPSHOT/checkstyle-rules-0.4-incubating-SNAPSHOT.pom
[JENKINS] Archiving <https://builds.apache.org/job/DeltaSpike_TomEE/ws/deltaspike/checkstyle-rules/target/checkstyle-rules-0.4-incubating-SNAPSHOT.jar>
to /home/hudson/hudson/jobs/DeltaSpike_TomEE/modules/org.apache.deltaspike$checkstyle-rules/builds/2013-05-11_02-52-16/archive/org.apache.deltaspike/checkstyle-rules/0.4-incubating-SNAPSHOT/checkstyle-rules-0.4-incubating-SNAPSHOT.jar
[JENKINS] Archiving <https://builds.apache.org/job/DeltaSpike_TomEE/ws/deltaspike/examples/jsf-examples/pom.xml>
to /home/hudson/hudson/jobs/DeltaSpike_TomEE/modules/org.apache.deltaspike.examples$deltaspike-jsf-example/builds/2013-05-11_02-52-16/archive/org.apache.deltaspike.examples/deltaspike-jsf-example/0.4-incubating-SNAPSHOT/deltaspike-jsf-example-0.4-incubating-SNAPSHOT.pom
[JENKINS] Archiving <https://builds.apache.org/job/DeltaSpike_TomEE/ws/deltaspike/modules/security/api/pom.xml>
to /home/hudson/hudson/jobs/DeltaSpike_TomEE/modules/org.apache.deltaspike.modules$deltaspike-security-module-api/builds/2013-05-11_02-52-16/archive/org.apache.deltaspike.modules/deltaspike-security-module-api/0.4-incubating-SNAPSHOT/deltaspike-security-module-api-0.4-incubating-SNAPSHOT.pom
[JENKINS] Archiving <https://builds.apache.org/job/DeltaSpike_TomEE/ws/deltaspike/modules/jpa/pom.xml>
to /home/hudson/hudson/jobs/DeltaSpike_TomEE/modules/org.apache.deltaspike.modules$jpa-module-project/builds/2013-05-11_02-52-16/archive/org.apache.deltaspike.modules/jpa-module-project/0.4-incubating-SNAPSHOT/jpa-module-project-0.4-incubating-SNAPSHOT.pom
[JENKINS] Archiving <https://builds.apache.org/job/DeltaSpike_TomEE/ws/deltaspike/parent/pom.xml>
to /home/hudson/hudson/jobs/DeltaSpike_TomEE/modules/org.apache.deltaspike$parent/builds/2013-05-11_02-52-16/archive/org.apache.deltaspike/parent/0.4-incubating-SNAPSHOT/parent-0.4-incubating-SNAPSHOT.pom
[JENKINS] Archiving <https://builds.apache.org/job/DeltaSpike_TomEE/ws/deltaspike/cdictrl/impl-weld/pom.xml>
to /home/hudson/hudson/jobs/DeltaSpike_TomEE/modules/org.apache.deltaspike.cdictrl$deltaspike-cdictrl-weld/builds/2013-05-11_02-52-16/archive/org.apache.deltaspike.cdictrl/deltaspike-cdictrl-weld/0.4-incubating-SNAPSHOT/deltaspike-cdictrl-weld-0.4-incubating-SNAPSHOT.pom
[JENKINS] Archiving <https://builds.apache.org/job/DeltaSpike_TomEE/ws/deltaspike/examples/jse-examples/pom.xml>
to /home/hudson/hudson/jobs/DeltaSpike_TomEE/modules/org.apache.deltaspike.examples$deltaspike-jse-example/builds/2013-05-11_02-52-16/archive/org.apache.deltaspike.examples/deltaspike-jse-example/0.4-incubating-SNAPSHOT/deltaspike-jse-example-0.4-incubating-SNAPSHOT.pom
[JENKINS] Archiving <https://builds.apache.org/job/DeltaSpike_TomEE/ws/deltaspike/modules/partial-bean/api/pom.xml>
to /home/hudson/hudson/jobs/DeltaSpike_TomEE/modules/org.apache.deltaspike.modules$deltaspike-partial-bean-module-api/builds/2013-05-11_02-52-16/archive/org.apache.deltaspike.modules/deltaspike-partial-bean-module-api/0.4-incubating-SNAPSHOT/deltaspike-partial-bean-module-api-0.4-incubating-SNAPSHOT.pom
[JENKINS] Archiving <https://builds.apache.org/job/DeltaSpike_TomEE/ws/deltaspike/modules/security/pom.xml>
to /home/hudson/hudson/jobs/DeltaSpike_TomEE/modules/org.apache.deltaspike.modules$security-module-project/builds/2013-05-11_02-52-16/archive/org.apache.deltaspike.modules/security-module-project/0.4-incubating-SNAPSHOT/security-module-project-0.4-incubating-SNAPSHOT.pom
[JENKINS] Archiving <https://builds.apache.org/job/DeltaSpike_TomEE/ws/deltaspike/cdictrl/impl-owb/pom.xml>
to /home/hudson/hudson/jobs/DeltaSpike_TomEE/modules/org.apache.deltaspike.cdictrl$deltaspike-cdictrl-owb/builds/2013-05-11_02-52-16/archive/org.apache.deltaspike.cdictrl/deltaspike-cdictrl-owb/0.4-incubating-SNAPSHOT/deltaspike-cdictrl-owb-0.4-incubating-SNAPSHOT.pom
[JENKINS] Archiving <https://builds.apache.org/job/DeltaSpike_TomEE/ws/deltaspike/modules/jsf/pom.xml>
to /home/hudson/hudson/jobs/DeltaSpike_TomEE/modules/org.apache.deltaspike.modules$jsf-module-project/builds/2013-05-11_02-52-16/archive/org.apache.deltaspike.modules/jsf-module-project/0.4-incubating-SNAPSHOT/jsf-module-project-0.4-incubating-SNAPSHOT.pom
[JENKINS] Archiving <https://builds.apache.org/job/DeltaSpike_TomEE/ws/deltaspike/core/api/pom.xml>
to /home/hudson/hudson/jobs/DeltaSpike_TomEE/modules/org.apache.deltaspike.core$deltaspike-core-api/builds/2013-05-11_02-52-16/archive/org.apache.deltaspike.core/deltaspike-core-api/0.4-incubating-SNAPSHOT/deltaspike-core-api-0.4-incubating-SNAPSHOT.pom
[JENKINS] Archiving <https://builds.apache.org/job/DeltaSpike_TomEE/ws/deltaspike/parent/code/pom.xml>
to /home/hudson/hudson/jobs/DeltaSpike_TomEE/modules/org.apache.deltaspike$parent-code/builds/2013-05-11_02-52-16/archive/org.apache.deltaspike/parent-code/0.4-incubating-SNAPSHOT/parent-code-0.4-incubating-SNAPSHOT.pom
[JENKINS] Archiving <https://builds.apache.org/job/DeltaSpike_TomEE/ws/deltaspike/parent/code/target/parent-code-0.4-incubating-SNAPSHOT-tests.jar>
to /home/hudson/hudson/jobs/DeltaSpike_TomEE/modules/org.apache.deltaspike$parent-code/builds/2013-05-11_02-52-16/archive/org.apache.deltaspike/parent-code/0.4-incubating-SNAPSHOT/parent-code-0.4-incubating-SNAPSHOT-tests.jar
[JENKINS] Archiving <https://builds.apache.org/job/DeltaSpike_TomEE/ws/deltaspike/modules/pom.xml>
to /home/hudson/hudson/jobs/DeltaSpike_TomEE/modules/org.apache.deltaspike.modules$modules-project/builds/2013-05-11_02-52-16/archive/org.apache.deltaspike.modules/modules-project/0.4-incubating-SNAPSHOT/modules-project-0.4-incubating-SNAPSHOT.pom
[JENKINS] Archiving <https://builds.apache.org/job/DeltaSpike_TomEE/ws/deltaspike/modules/jpa/impl/pom.xml>
to /home/hudson/hudson/jobs/DeltaSpike_TomEE/modules/org.apache.deltaspike.modules$deltaspike-jpa-module-impl/builds/2013-05-11_02-52-16/archive/org.apache.deltaspike.modules/deltaspike-jpa-module-impl/0.4-incubating-SNAPSHOT/deltaspike-jpa-module-impl-0.4-incubating-SNAPSHOT.pom
[JENKINS] Archiving <https://builds.apache.org/job/DeltaSpike_TomEE/ws/deltaspike/modules/security/impl/pom.xml>
to /home/hudson/hudson/jobs/DeltaSpike_TomEE/modules/org.apache.deltaspike.modules$deltaspike-security-module-impl/builds/2013-05-11_02-52-16/archive/org.apache.deltaspike.modules/deltaspike-security-module-impl/0.4-incubating-SNAPSHOT/deltaspike-security-module-impl-0.4-incubating-SNAPSHOT.pom
[JENKINS] Archiving <https://builds.apache.org/job/DeltaSpike_TomEE/ws/deltaspike/modules/jpa/api/pom.xml>
to /home/hudson/hudson/jobs/DeltaSpike_TomEE/modules/org.apache.deltaspike.modules$deltaspike-jpa-module-api/builds/2013-05-11_02-52-16/archive/org.apache.deltaspike.modules/deltaspike-jpa-module-api/0.4-incubating-SNAPSHOT/deltaspike-jpa-module-api-0.4-incubating-SNAPSHOT.pom
[JENKINS] Archiving <https://builds.apache.org/job/DeltaSpike_TomEE/ws/deltaspike/modules/jsf/api/pom.xml>
to /home/hudson/hudson/jobs/DeltaSpike_TomEE/modules/org.apache.deltaspike.modules$deltaspike-jsf-module-api/builds/2013-05-11_02-52-16/archive/org.apache.deltaspike.modules/deltaspike-jsf-module-api/0.4-incubating-SNAPSHOT/deltaspike-jsf-module-api-0.4-incubating-SNAPSHOT.pom
[JENKINS] Archiving <https://builds.apache.org/job/DeltaSpike_TomEE/ws/deltaspike/examples/pom.xml>
to /home/hudson/hudson/jobs/DeltaSpike_TomEE/modules/org.apache.deltaspike.examples$examples-project/builds/2013-05-11_02-52-16/archive/org.apache.deltaspike.examples/examples-project/0.4-incubating-SNAPSHOT/examples-project-0.4-incubating-SNAPSHOT.pom
[JENKINS] Archiving <https://builds.apache.org/job/DeltaSpike_TomEE/ws/deltaspike/cdictrl/pom.xml>
to /home/hudson/hudson/jobs/DeltaSpike_TomEE/modules/org.apache.deltaspike.cdictrl$cdictrl-project/builds/2013-05-11_02-52-16/archive/org.apache.deltaspike.cdictrl/cdictrl-project/0.4-incubating-SNAPSHOT/cdictrl-project-0.4-incubating-SNAPSHOT.pom
Waiting for Jenkins to finish collecting data
mavenExecutionResult exceptions not empty
message : Failed to execute goal org.apache.maven.plugins:maven-compiler-plugin:2.5:compile
(default-compile) on project deltaspike-core-api: Compilation failure
cause : Compilation failure
Stack trace : 
org.apache.maven.lifecycle.LifecycleExecutionException: Failed to execute goal org.apache.maven.plugins:maven-compiler-plugin:2.5:compile
(default-compile) on project deltaspike-core-api: Compilation failure
	at org.apache.maven.lifecycle.internal.MojoExecutor.execute(MojoExecutor.java:213)
	at org.apache.maven.lifecycle.internal.MojoExecutor.execute(MojoExecutor.java:153)
	at org.apache.maven.lifecycle.internal.MojoExecutor.execute(MojoExecutor.java:145)
	at org.apache.maven.lifecycle.internal.LifecycleModuleBuilder.buildProject(LifecycleModuleBuilder.java:84)
	at org.apache.maven.lifecycle.internal.LifecycleModuleBuilder.buildProject(LifecycleModuleBuilder.java:59)
	at org.apache.maven.lifecycle.internal.LifecycleStarter.singleThreadedBuild(LifecycleStarter.java:183)
	at org.apache.maven.lifecycle.internal.LifecycleStarter.execute(LifecycleStarter.java:161)
	at org.apache.maven.DefaultMaven.doExecute(DefaultMaven.java:320)
	at org.apache.maven.DefaultMaven.execute(DefaultMaven.java:156)
	at org.jvnet.hudson.maven3.launcher.Maven3Launcher.main(Maven3Launcher.java:79)
	at sun.reflect.NativeMethodAccessorImpl.invoke0(Native Method)
	at sun.reflect.NativeMethodAccessorImpl.invoke(NativeMethodAccessorImpl.java:39)
	at sun.reflect.DelegatingMethodAccessorImpl.invoke(DelegatingMethodAccessorImpl.java:25)
	at java.lang.reflect.Method.invoke(Method.java:597)
	at org.codehaus.plexus.classworlds.launcher.Launcher.launchStandard(Launcher.java:329)
	at org.codehaus.plexus.classworlds.launcher.Launcher.launch(Launcher.java:239)
	at org.jvnet.hudson.maven3.agent.Maven3Main.launch(Maven3Main.java:158)
	at hudson.maven.Maven3Builder.call(Maven3Builder.java:100)
	at hudson.maven.Maven3Builder.call(Maven3Builder.java:66)
	at hudson.remoting.UserRequest.perform(UserRequest.java:118)
	at hudson.remoting.UserRequest.perform(UserRequest.java:48)
	at hudson.remoting.Request$2.run(Request.java:326)
	at hudson.remoting.InterceptingExecutorService$1.call(InterceptingExecutorService.java:72)
	at java.util.concurrent.FutureTask$Sync.innerRun(FutureTask.java:303)
	at java.util.concurrent.FutureTask.run(FutureTask.java:138)
	at java.util.concurrent.ThreadPoolExecutor$Worker.runTask(ThreadPoolExecutor.java:886)
	at java.util.concurrent.ThreadPoolExecutor$Worker.run(ThreadPoolExecutor.java:908)
	at java.lang.Thread.run(Thread.java:662)
Caused by: org.apache.maven.plugin.CompilationFailureException: Compilation failure
	at org.apache.maven.plugin.AbstractCompilerMojo.execute(AbstractCompilerMojo.java:729)
	at org.apache.maven.plugin.CompilerMojo.execute(CompilerMojo.java:128)
	at org.apache.maven.plugin.DefaultBuildPluginManager.executeMojo(DefaultBuildPluginManager.java:101)
	at org.apache.maven.lifecycle.internal.MojoExecutor.execute(MojoExecutor.java:209)
	... 27 more
Sending e-mails to: deltaspike-commits@incubator.apache.org
channel stopped

Mime
View raw message