deltaspike-commits mailing list archives

Site index · List index
Message view « Date » · « Thread »
Top « Date » · « Thread »
From Apache Jenkins Server <jenk...@builds.apache.org>
Subject Build failed in Jenkins: DeltaSpike RAT-Check #497
Date Sun, 19 May 2013 00:09:29 GMT
See <https://builds.apache.org/job/DeltaSpike%20RAT-Check/497/>

------------------------------------------
[...truncated 1043 lines...]
May 19, 2013 12:07:52 AM org.apache.deltaspike.test.utils.ShrinkWrapArchiveUtil getArchives
INFO: Test org.apache.deltaspike.test.core.impl.exception.control.flow.RethrowTest Adding
Java ClassPath URL as JavaArchive <https://builds.apache.org/job/DeltaSpike%20RAT-Check/ws/deltaspike/core/impl/target/classes/META-INF/beans.xml>
May 19, 2013 12:07:52 AM org.apache.deltaspike.test.utils.ShrinkWrapArchiveUtil getArchives
INFO: Test org.apache.deltaspike.test.core.impl.exception.control.flow.RethrowTest Adding
Java ClassPath URL as JavaArchive jar:<https://builds.apache.org/job/DeltaSpike%20RAT-Check/ws/deltaspike/core/api/target/deltaspike-core-api-0.4-incubating-SNAPSHOT.jar!/META-INF/beans.xml>
May 19, 2013 12:07:52 AM org.apache.deltaspike.test.utils.ShrinkWrapArchiveUtil getArchives
INFO: Test org.apache.deltaspike.test.core.impl.exception.control.flow.RethrowTest Adding
Java ClassPath URL as JavaArchive jar:<https://builds.apache.org/job/DeltaSpike%20RAT-Check/ws/deltaspike/test-utils/target/test-utils-0.4-incubating-SNAPSHOT.jar!/META-INF/beans.xml>
May 19, 2013 12:07:52 AM org.apache.webbeans.lifecycle.AbstractLifeCycle startApplication
INFO: OpenWebBeans Container is starting...
May 19, 2013 12:07:52 AM org.apache.webbeans.config.BeansDeployer validateInjectionPoints
INFO: All injection points were validated successfully.
May 19, 2013 12:07:52 AM org.apache.deltaspike.core.impl.config.EnvironmentPropertyConfigSourceProvider
<init>
INFO: Custom config found by DeltaSpike. Name: 'META-INF/apache-deltaspike.properties', URL:
'<https://builds.apache.org/job/DeltaSpike%20RAT-Check/ws/deltaspike/core/impl/target/test-classes/META-INF/apache-deltaspike.properties'>
May 19, 2013 12:07:52 AM org.apache.webbeans.lifecycle.AbstractLifeCycle startApplication
INFO: OpenWebBeans Container has started, it took [57] ms.
Running org.apache.deltaspike.test.core.impl.exception.control.flow.HandledExceptionHandlerTest
Tests run: 2, Failures: 0, Errors: 0, Skipped: 0, Time elapsed: 0.011 sec
May 19, 2013 12:07:52 AM org.apache.deltaspike.test.utils.ShrinkWrapArchiveUtil getArchives
INFO: Test org.apache.deltaspike.test.core.impl.exception.control.flow.BreadthFirstAbortControlTest
Adding Java ClassPath URL as JavaArchive <https://builds.apache.org/job/DeltaSpike%20RAT-Check/ws/deltaspike/core/impl/target/classes/META-INF/beans.xml>
May 19, 2013 12:07:52 AM org.apache.deltaspike.test.utils.ShrinkWrapArchiveUtil getArchives
INFO: Test org.apache.deltaspike.test.core.impl.exception.control.flow.BreadthFirstAbortControlTest
Adding Java ClassPath URL as JavaArchive jar:<https://builds.apache.org/job/DeltaSpike%20RAT-Check/ws/deltaspike/core/api/target/deltaspike-core-api-0.4-incubating-SNAPSHOT.jar!/META-INF/beans.xml>
May 19, 2013 12:07:52 AM org.apache.deltaspike.test.utils.ShrinkWrapArchiveUtil getArchives
INFO: Test org.apache.deltaspike.test.core.impl.exception.control.flow.BreadthFirstAbortControlTest
Adding Java ClassPath URL as JavaArchive jar:<https://builds.apache.org/job/DeltaSpike%20RAT-Check/ws/deltaspike/test-utils/target/test-utils-0.4-incubating-SNAPSHOT.jar!/META-INF/beans.xml>
May 19, 2013 12:07:52 AM org.apache.webbeans.lifecycle.AbstractLifeCycle startApplication
INFO: OpenWebBeans Container is starting...
May 19, 2013 12:07:52 AM org.apache.webbeans.config.BeansDeployer validateInjectionPoints
INFO: All injection points were validated successfully.
May 19, 2013 12:07:52 AM org.apache.deltaspike.core.impl.config.EnvironmentPropertyConfigSourceProvider
<init>
INFO: Custom config found by DeltaSpike. Name: 'META-INF/apache-deltaspike.properties', URL:
'<https://builds.apache.org/job/DeltaSpike%20RAT-Check/ws/deltaspike/core/impl/target/test-classes/META-INF/apache-deltaspike.properties'>
May 19, 2013 12:07:52 AM org.apache.webbeans.lifecycle.AbstractLifeCycle startApplication
INFO: OpenWebBeans Container has started, it took [58] ms.
Running org.apache.deltaspike.test.core.impl.exception.control.flow.RethrowTest
Tests run: 2, Failures: 0, Errors: 0, Skipped: 0, Time elapsed: 0.008 sec
May 19, 2013 12:07:52 AM org.apache.deltaspike.test.utils.ShrinkWrapArchiveUtil getArchives
INFO: Test org.apache.deltaspike.test.core.impl.exception.control.flow.ProceedCauseHandlerTest
Adding Java ClassPath URL as JavaArchive <https://builds.apache.org/job/DeltaSpike%20RAT-Check/ws/deltaspike/core/impl/target/classes/META-INF/beans.xml>
May 19, 2013 12:07:52 AM org.apache.deltaspike.test.utils.ShrinkWrapArchiveUtil getArchives
INFO: Test org.apache.deltaspike.test.core.impl.exception.control.flow.ProceedCauseHandlerTest
Adding Java ClassPath URL as JavaArchive jar:<https://builds.apache.org/job/DeltaSpike%20RAT-Check/ws/deltaspike/core/api/target/deltaspike-core-api-0.4-incubating-SNAPSHOT.jar!/META-INF/beans.xml>
May 19, 2013 12:07:52 AM org.apache.deltaspike.test.utils.ShrinkWrapArchiveUtil getArchives
INFO: Test org.apache.deltaspike.test.core.impl.exception.control.flow.ProceedCauseHandlerTest
Adding Java ClassPath URL as JavaArchive jar:<https://builds.apache.org/job/DeltaSpike%20RAT-Check/ws/deltaspike/test-utils/target/test-utils-0.4-incubating-SNAPSHOT.jar!/META-INF/beans.xml>
May 19, 2013 12:07:52 AM org.apache.webbeans.lifecycle.AbstractLifeCycle startApplication
INFO: OpenWebBeans Container is starting...
May 19, 2013 12:07:52 AM org.apache.webbeans.config.BeansDeployer validateInjectionPoints
INFO: All injection points were validated successfully.
May 19, 2013 12:07:52 AM org.apache.deltaspike.core.impl.config.EnvironmentPropertyConfigSourceProvider
<init>
INFO: Custom config found by DeltaSpike. Name: 'META-INF/apache-deltaspike.properties', URL:
'<https://builds.apache.org/job/DeltaSpike%20RAT-Check/ws/deltaspike/core/impl/target/test-classes/META-INF/apache-deltaspike.properties'>
May 19, 2013 12:07:52 AM org.apache.webbeans.lifecycle.AbstractLifeCycle startApplication
INFO: OpenWebBeans Container has started, it took [58] ms.
Running org.apache.deltaspike.test.core.impl.exception.control.flow.BreadthFirstAbortControlTest
Tests run: 1, Failures: 0, Errors: 0, Skipped: 0, Time elapsed: 0.006 sec
May 19, 2013 12:07:52 AM org.apache.deltaspike.test.utils.ShrinkWrapArchiveUtil getArchives
INFO: Test org.apache.deltaspike.test.core.impl.exception.control.flow.DepthAbortControlTest
Adding Java ClassPath URL as JavaArchive <https://builds.apache.org/job/DeltaSpike%20RAT-Check/ws/deltaspike/core/impl/target/classes/META-INF/beans.xml>
May 19, 2013 12:07:52 AM org.apache.deltaspike.test.utils.ShrinkWrapArchiveUtil getArchives
INFO: Test org.apache.deltaspike.test.core.impl.exception.control.flow.DepthAbortControlTest
Adding Java ClassPath URL as JavaArchive jar:<https://builds.apache.org/job/DeltaSpike%20RAT-Check/ws/deltaspike/core/api/target/deltaspike-core-api-0.4-incubating-SNAPSHOT.jar!/META-INF/beans.xml>
May 19, 2013 12:07:52 AM org.apache.deltaspike.test.utils.ShrinkWrapArchiveUtil getArchives
INFO: Test org.apache.deltaspike.test.core.impl.exception.control.flow.DepthAbortControlTest
Adding Java ClassPath URL as JavaArchive jar:<https://builds.apache.org/job/DeltaSpike%20RAT-Check/ws/deltaspike/test-utils/target/test-utils-0.4-incubating-SNAPSHOT.jar!/META-INF/beans.xml>
May 19, 2013 12:07:52 AM org.apache.webbeans.lifecycle.AbstractLifeCycle startApplication
INFO: OpenWebBeans Container is starting...
May 19, 2013 12:07:53 AM org.apache.webbeans.config.BeansDeployer validateInjectionPoints
INFO: All injection points were validated successfully.
May 19, 2013 12:07:53 AM org.apache.deltaspike.core.impl.config.EnvironmentPropertyConfigSourceProvider
<init>
INFO: Custom config found by DeltaSpike. Name: 'META-INF/apache-deltaspike.properties', URL:
'<https://builds.apache.org/job/DeltaSpike%20RAT-Check/ws/deltaspike/core/impl/target/test-classes/META-INF/apache-deltaspike.properties'>
May 19, 2013 12:07:53 AM org.apache.webbeans.lifecycle.AbstractLifeCycle startApplication
INFO: OpenWebBeans Container has started, it took [56] ms.
Running org.apache.deltaspike.test.core.impl.exception.control.flow.ProceedCauseHandlerTest
Tests run: 1, Failures: 0, Errors: 0, Skipped: 0, Time elapsed: 0.006 sec
May 19, 2013 12:07:53 AM org.apache.deltaspike.test.utils.ShrinkWrapArchiveUtil getArchives
INFO: Test org.apache.deltaspike.test.core.impl.jmx.SimpleRegistrationTest Adding Java ClassPath
URL as JavaArchive <https://builds.apache.org/job/DeltaSpike%20RAT-Check/ws/deltaspike/core/impl/target/classes/META-INF/beans.xml>
May 19, 2013 12:07:53 AM org.apache.deltaspike.test.utils.ShrinkWrapArchiveUtil getArchives
INFO: Test org.apache.deltaspike.test.core.impl.jmx.SimpleRegistrationTest Adding Java ClassPath
URL as JavaArchive jar:<https://builds.apache.org/job/DeltaSpike%20RAT-Check/ws/deltaspike/core/api/target/deltaspike-core-api-0.4-incubating-SNAPSHOT.jar!/META-INF/beans.xml>
May 19, 2013 12:07:53 AM org.apache.deltaspike.test.utils.ShrinkWrapArchiveUtil getArchives
INFO: Test org.apache.deltaspike.test.core.impl.jmx.SimpleRegistrationTest Adding Java ClassPath
URL as JavaArchive jar:<https://builds.apache.org/job/DeltaSpike%20RAT-Check/ws/deltaspike/test-utils/target/test-utils-0.4-incubating-SNAPSHOT.jar!/META-INF/beans.xml>
May 19, 2013 12:07:53 AM org.apache.webbeans.lifecycle.AbstractLifeCycle startApplication
INFO: OpenWebBeans Container is starting...
May 19, 2013 12:07:53 AM org.apache.deltaspike.core.impl.config.EnvironmentPropertyConfigSourceProvider
<init>
INFO: Custom config found by DeltaSpike. Name: 'META-INF/apache-deltaspike.properties', URL:
'<https://builds.apache.org/job/DeltaSpike%20RAT-Check/ws/deltaspike/core/impl/target/test-classes/META-INF/apache-deltaspike.properties'>
May 19, 2013 12:07:53 AM org.apache.deltaspike.core.impl.jmx.MBeanExtension registerObject
INFO: Registered MBean org.apache.deltaspike:name=org.apache.deltaspike.test.core.impl.jmx.MyMBean,type=MBeans
May 19, 2013 12:07:53 AM org.apache.webbeans.config.BeansDeployer validateInjectionPoints
INFO: All injection points were validated successfully.
May 19, 2013 12:07:53 AM org.apache.webbeans.lifecycle.AbstractLifeCycle startApplication
INFO: OpenWebBeans Container has started, it took [59] ms.
Running org.apache.deltaspike.test.core.impl.exception.control.flow.DepthAbortControlTest
Tests run: 1, Failures: 0, Errors: 0, Skipped: 0, Time elapsed: 0.005 sec
May 19, 2013 12:07:53 AM org.apache.deltaspike.core.impl.jmx.MBeanExtension shutdown
INFO: Unregistered MBean org.apache.deltaspike:name=org.apache.deltaspike.test.core.impl.jmx.MyMBean,type=MBeans
Running org.apache.deltaspike.test.core.impl.jmx.SimpleRegistrationTest
Tests run: 1, Failures: 0, Errors: 0, Skipped: 0, Time elapsed: 0.023 sec

Results :

Tests run: 83, Failures: 0, Errors: 0, Skipped: 0

[INFO] ------------------------------------------------------------------------
[INFO] Reactor Summary:
[INFO] 
[INFO] Apache DeltaSpike ................................. SUCCESS [34.100s]
[INFO] Apache DeltaSpike CheckStyle-rules ................ SUCCESS [4.562s]
[INFO] Apache DeltaSpike Parent .......................... SUCCESS [6.366s]
[INFO] Apache DeltaSpike Test-Utils ...................... SUCCESS [5.193s]
[INFO] Apache DeltaSpike Code Parent ..................... SUCCESS [6.219s]
[INFO] Apache DeltaSpike Core ............................ SUCCESS [3.311s]
[INFO] Apache DeltaSpike Core-API ........................ SUCCESS [15.523s]
[INFO] Apache DeltaSpike Core-Implementation ............. FAILURE [12.405s]
[INFO] Apache DeltaSpike ContainerControl parent ......... SKIPPED
[INFO] Apache DeltaSpike CDI ContainerControl API ........ SKIPPED
[INFO] Apache DeltaSpike CDI ContainerControl TCK ........ SKIPPED
[INFO] Apache DeltaSpike CDI OWB-ContainerControl ........ SKIPPED
[INFO] Apache DeltaSpike CDI Weld-ContainerControl ....... SKIPPED
[INFO] Apache DeltaSpike CDI OpenEJB-ContainerControl .... SKIPPED
[INFO] Apache DeltaSpike Modules ......................... SKIPPED
[INFO] Apache DeltaSpike Security-Module ................. SKIPPED
[INFO] Apache DeltaSpike Security-Module API ............. SKIPPED
[INFO] Apache DeltaSpike Security-Module Impl ............ SKIPPED
[INFO] Apache DeltaSpike JPA-Module ...................... SKIPPED
[INFO] Apache DeltaSpike JPA-Module API .................. SKIPPED
[INFO] Apache DeltaSpike JPA-Module Impl ................. SKIPPED
[INFO] Apache DeltaSpike JSF-Module ...................... SKIPPED
[INFO] Apache DeltaSpike JSF-Module API .................. SKIPPED
[INFO] Apache DeltaSpike JSF-Module Impl ................. SKIPPED
[INFO] Apache DeltaSpike Partial-Bean-Module ............. SKIPPED
[INFO] Apache DeltaSpike Partial-Bean-Module API ......... SKIPPED
[INFO] Apache DeltaSpike Partial-Bean-Module Impl ........ SKIPPED
[INFO] Apache DeltaSpike Examples ........................ SKIPPED
[INFO] Apache DeltaSpike Java-SE Examples ................ SKIPPED
[INFO] Apache DeltaSpike JSF Examples .................... SKIPPED
[INFO] ------------------------------------------------------------------------
[INFO] BUILD FAILURE
[INFO] ------------------------------------------------------------------------
[INFO] Total time: 1:33.087s
[INFO] Finished at: Sun May 19 00:07:53 UTC 2013
[INFO] Final Memory: 35M/172M
[INFO] ------------------------------------------------------------------------
[JENKINS] Archiving <https://builds.apache.org/job/DeltaSpike%20RAT-Check/ws/deltaspike/pom.xml>
to /home/hudson/hudson/jobs/DeltaSpike RAT-Check/modules/org.apache.deltaspike$deltaspike-project/builds/2013-05-19_00-06-07/archive/org.apache.deltaspike/deltaspike-project/0.4-incubating-SNAPSHOT/deltaspike-project-0.4-incubating-SNAPSHOT.pom
[JENKINS] Archiving <https://builds.apache.org/job/DeltaSpike%20RAT-Check/ws/deltaspike/modules/partial-bean/impl/pom.xml>
to /home/hudson/hudson/jobs/DeltaSpike RAT-Check/modules/org.apache.deltaspike.modules$deltaspike-partial-bean-module-impl/builds/2013-05-19_00-06-07/archive/org.apache.deltaspike.modules/deltaspike-partial-bean-module-impl/0.4-incubating-SNAPSHOT/deltaspike-partial-bean-module-impl-0.4-incubating-SNAPSHOT.pom
[JENKINS] Archiving <https://builds.apache.org/job/DeltaSpike%20RAT-Check/ws/deltaspike/cdictrl/impl-openejb/pom.xml>
to /home/hudson/hudson/jobs/DeltaSpike RAT-Check/modules/org.apache.deltaspike.cdictrl$deltaspike-cdictrl-openejb/builds/2013-05-19_00-06-07/archive/org.apache.deltaspike.cdictrl/deltaspike-cdictrl-openejb/0.4-incubating-SNAPSHOT/deltaspike-cdictrl-openejb-0.4-incubating-SNAPSHOT.pom
[JENKINS] Archiving <https://builds.apache.org/job/DeltaSpike%20RAT-Check/ws/deltaspike/cdictrl/api/pom.xml>
to /home/hudson/hudson/jobs/DeltaSpike RAT-Check/modules/org.apache.deltaspike.cdictrl$deltaspike-cdictrl-api/builds/2013-05-19_00-06-07/archive/org.apache.deltaspike.cdictrl/deltaspike-cdictrl-api/0.4-incubating-SNAPSHOT/deltaspike-cdictrl-api-0.4-incubating-SNAPSHOT.pom
[JENKINS] Archiving <https://builds.apache.org/job/DeltaSpike%20RAT-Check/ws/deltaspike/test-utils/pom.xml>
to /home/hudson/hudson/jobs/DeltaSpike RAT-Check/modules/org.apache.deltaspike.test$test-utils/builds/2013-05-19_00-06-07/archive/org.apache.deltaspike.test/test-utils/0.4-incubating-SNAPSHOT/test-utils-0.4-incubating-SNAPSHOT.pom
[JENKINS] Archiving <https://builds.apache.org/job/DeltaSpike%20RAT-Check/ws/deltaspike/test-utils/target/test-utils-0.4-incubating-SNAPSHOT.jar>
to /home/hudson/hudson/jobs/DeltaSpike RAT-Check/modules/org.apache.deltaspike.test$test-utils/builds/2013-05-19_00-06-07/archive/org.apache.deltaspike.test/test-utils/0.4-incubating-SNAPSHOT/test-utils-0.4-incubating-SNAPSHOT.jar
[JENKINS] Archiving <https://builds.apache.org/job/DeltaSpike%20RAT-Check/ws/deltaspike/test-utils/target/test-utils-0.4-incubating-SNAPSHOT-sources.jar>
to /home/hudson/hudson/jobs/DeltaSpike RAT-Check/modules/org.apache.deltaspike.test$test-utils/builds/2013-05-19_00-06-07/archive/org.apache.deltaspike.test/test-utils/0.4-incubating-SNAPSHOT/test-utils-0.4-incubating-SNAPSHOT-sources.jar
[JENKINS] Archiving <https://builds.apache.org/job/DeltaSpike%20RAT-Check/ws/deltaspike/core/impl/pom.xml>
to /home/hudson/hudson/jobs/DeltaSpike RAT-Check/modules/org.apache.deltaspike.core$deltaspike-core-impl/builds/2013-05-19_00-06-07/archive/org.apache.deltaspike.core/deltaspike-core-impl/0.4-incubating-SNAPSHOT/deltaspike-core-impl-0.4-incubating-SNAPSHOT.pom
[JENKINS] Archiving <https://builds.apache.org/job/DeltaSpike%20RAT-Check/ws/deltaspike/modules/jsf/impl/pom.xml>
to /home/hudson/hudson/jobs/DeltaSpike RAT-Check/modules/org.apache.deltaspike.modules$deltaspike-jsf-module-impl/builds/2013-05-19_00-06-07/archive/org.apache.deltaspike.modules/deltaspike-jsf-module-impl/0.4-incubating-SNAPSHOT/deltaspike-jsf-module-impl-0.4-incubating-SNAPSHOT.pom
[JENKINS] Archiving <https://builds.apache.org/job/DeltaSpike%20RAT-Check/ws/deltaspike/modules/partial-bean/pom.xml>
to /home/hudson/hudson/jobs/DeltaSpike RAT-Check/modules/org.apache.deltaspike.modules$partial-bean-module-project/builds/2013-05-19_00-06-07/archive/org.apache.deltaspike.modules/partial-bean-module-project/0.4-incubating-SNAPSHOT/partial-bean-module-project-0.4-incubating-SNAPSHOT.pom
[JENKINS] Archiving <https://builds.apache.org/job/DeltaSpike%20RAT-Check/ws/deltaspike/cdictrl/tck/pom.xml>
to /home/hudson/hudson/jobs/DeltaSpike RAT-Check/modules/org.apache.deltaspike.test$deltaspike-cdictrl-tck/builds/2013-05-19_00-06-07/archive/org.apache.deltaspike.test/deltaspike-cdictrl-tck/0.4-incubating-SNAPSHOT/deltaspike-cdictrl-tck-0.4-incubating-SNAPSHOT.pom
[JENKINS] Archiving <https://builds.apache.org/job/DeltaSpike%20RAT-Check/ws/deltaspike/core/pom.xml>
to /home/hudson/hudson/jobs/DeltaSpike RAT-Check/modules/org.apache.deltaspike.core$core-project/builds/2013-05-19_00-06-07/archive/org.apache.deltaspike.core/core-project/0.4-incubating-SNAPSHOT/core-project-0.4-incubating-SNAPSHOT.pom
[JENKINS] Archiving <https://builds.apache.org/job/DeltaSpike%20RAT-Check/ws/deltaspike/core/target/core-project-0.4-incubating-SNAPSHOT-tests.jar>
to /home/hudson/hudson/jobs/DeltaSpike RAT-Check/modules/org.apache.deltaspike.core$core-project/builds/2013-05-19_00-06-07/archive/org.apache.deltaspike.core/core-project/0.4-incubating-SNAPSHOT/core-project-0.4-incubating-SNAPSHOT-tests.jar
[JENKINS] Archiving <https://builds.apache.org/job/DeltaSpike%20RAT-Check/ws/deltaspike/checkstyle-rules/pom.xml>
to /home/hudson/hudson/jobs/DeltaSpike RAT-Check/modules/org.apache.deltaspike$checkstyle-rules/builds/2013-05-19_00-06-07/archive/org.apache.deltaspike/checkstyle-rules/0.4-incubating-SNAPSHOT/checkstyle-rules-0.4-incubating-SNAPSHOT.pom
[JENKINS] Archiving <https://builds.apache.org/job/DeltaSpike%20RAT-Check/ws/deltaspike/checkstyle-rules/target/checkstyle-rules-0.4-incubating-SNAPSHOT.jar>
to /home/hudson/hudson/jobs/DeltaSpike RAT-Check/modules/org.apache.deltaspike$checkstyle-rules/builds/2013-05-19_00-06-07/archive/org.apache.deltaspike/checkstyle-rules/0.4-incubating-SNAPSHOT/checkstyle-rules-0.4-incubating-SNAPSHOT.jar
[JENKINS] Archiving <https://builds.apache.org/job/DeltaSpike%20RAT-Check/ws/deltaspike/examples/jsf-examples/pom.xml>
to /home/hudson/hudson/jobs/DeltaSpike RAT-Check/modules/org.apache.deltaspike.examples$deltaspike-jsf-example/builds/2013-05-19_00-06-07/archive/org.apache.deltaspike.examples/deltaspike-jsf-example/0.4-incubating-SNAPSHOT/deltaspike-jsf-example-0.4-incubating-SNAPSHOT.pom
[JENKINS] Archiving <https://builds.apache.org/job/DeltaSpike%20RAT-Check/ws/deltaspike/modules/security/api/pom.xml>
to /home/hudson/hudson/jobs/DeltaSpike RAT-Check/modules/org.apache.deltaspike.modules$deltaspike-security-module-api/builds/2013-05-19_00-06-07/archive/org.apache.deltaspike.modules/deltaspike-security-module-api/0.4-incubating-SNAPSHOT/deltaspike-security-module-api-0.4-incubating-SNAPSHOT.pom
[JENKINS] Archiving <https://builds.apache.org/job/DeltaSpike%20RAT-Check/ws/deltaspike/modules/jpa/pom.xml>
to /home/hudson/hudson/jobs/DeltaSpike RAT-Check/modules/org.apache.deltaspike.modules$jpa-module-project/builds/2013-05-19_00-06-07/archive/org.apache.deltaspike.modules/jpa-module-project/0.4-incubating-SNAPSHOT/jpa-module-project-0.4-incubating-SNAPSHOT.pom
[JENKINS] Archiving <https://builds.apache.org/job/DeltaSpike%20RAT-Check/ws/deltaspike/parent/pom.xml>
to /home/hudson/hudson/jobs/DeltaSpike RAT-Check/modules/org.apache.deltaspike$parent/builds/2013-05-19_00-06-07/archive/org.apache.deltaspike/parent/0.4-incubating-SNAPSHOT/parent-0.4-incubating-SNAPSHOT.pom
[JENKINS] Archiving <https://builds.apache.org/job/DeltaSpike%20RAT-Check/ws/deltaspike/cdictrl/impl-weld/pom.xml>
to /home/hudson/hudson/jobs/DeltaSpike RAT-Check/modules/org.apache.deltaspike.cdictrl$deltaspike-cdictrl-weld/builds/2013-05-19_00-06-07/archive/org.apache.deltaspike.cdictrl/deltaspike-cdictrl-weld/0.4-incubating-SNAPSHOT/deltaspike-cdictrl-weld-0.4-incubating-SNAPSHOT.pom
[JENKINS] Archiving <https://builds.apache.org/job/DeltaSpike%20RAT-Check/ws/deltaspike/examples/jse-examples/pom.xml>
to /home/hudson/hudson/jobs/DeltaSpike RAT-Check/modules/org.apache.deltaspike.examples$deltaspike-jse-example/builds/2013-05-19_00-06-07/archive/org.apache.deltaspike.examples/deltaspike-jse-example/0.4-incubating-SNAPSHOT/deltaspike-jse-example-0.4-incubating-SNAPSHOT.pom
[JENKINS] Archiving <https://builds.apache.org/job/DeltaSpike%20RAT-Check/ws/deltaspike/modules/partial-bean/api/pom.xml>
to /home/hudson/hudson/jobs/DeltaSpike RAT-Check/modules/org.apache.deltaspike.modules$deltaspike-partial-bean-module-api/builds/2013-05-19_00-06-07/archive/org.apache.deltaspike.modules/deltaspike-partial-bean-module-api/0.4-incubating-SNAPSHOT/deltaspike-partial-bean-module-api-0.4-incubating-SNAPSHOT.pom
[JENKINS] Archiving <https://builds.apache.org/job/DeltaSpike%20RAT-Check/ws/deltaspike/modules/security/pom.xml>
to /home/hudson/hudson/jobs/DeltaSpike RAT-Check/modules/org.apache.deltaspike.modules$security-module-project/builds/2013-05-19_00-06-07/archive/org.apache.deltaspike.modules/security-module-project/0.4-incubating-SNAPSHOT/security-module-project-0.4-incubating-SNAPSHOT.pom
[JENKINS] Archiving <https://builds.apache.org/job/DeltaSpike%20RAT-Check/ws/deltaspike/cdictrl/impl-owb/pom.xml>
to /home/hudson/hudson/jobs/DeltaSpike RAT-Check/modules/org.apache.deltaspike.cdictrl$deltaspike-cdictrl-owb/builds/2013-05-19_00-06-07/archive/org.apache.deltaspike.cdictrl/deltaspike-cdictrl-owb/0.4-incubating-SNAPSHOT/deltaspike-cdictrl-owb-0.4-incubating-SNAPSHOT.pom
[JENKINS] Archiving <https://builds.apache.org/job/DeltaSpike%20RAT-Check/ws/deltaspike/modules/jsf/pom.xml>
to /home/hudson/hudson/jobs/DeltaSpike RAT-Check/modules/org.apache.deltaspike.modules$jsf-module-project/builds/2013-05-19_00-06-07/archive/org.apache.deltaspike.modules/jsf-module-project/0.4-incubating-SNAPSHOT/jsf-module-project-0.4-incubating-SNAPSHOT.pom
[JENKINS] Archiving <https://builds.apache.org/job/DeltaSpike%20RAT-Check/ws/deltaspike/core/api/pom.xml>
to /home/hudson/hudson/jobs/DeltaSpike RAT-Check/modules/org.apache.deltaspike.core$deltaspike-core-api/builds/2013-05-19_00-06-07/archive/org.apache.deltaspike.core/deltaspike-core-api/0.4-incubating-SNAPSHOT/deltaspike-core-api-0.4-incubating-SNAPSHOT.pom
[JENKINS] Archiving <https://builds.apache.org/job/DeltaSpike%20RAT-Check/ws/deltaspike/core/api/target/deltaspike-core-api-0.4-incubating-SNAPSHOT.jar>
to /home/hudson/hudson/jobs/DeltaSpike RAT-Check/modules/org.apache.deltaspike.core$deltaspike-core-api/builds/2013-05-19_00-06-07/archive/org.apache.deltaspike.core/deltaspike-core-api/0.4-incubating-SNAPSHOT/deltaspike-core-api-0.4-incubating-SNAPSHOT.jar
[JENKINS] Archiving <https://builds.apache.org/job/DeltaSpike%20RAT-Check/ws/deltaspike/core/api/target/deltaspike-core-api-0.4-incubating-SNAPSHOT-tests.jar>
to /home/hudson/hudson/jobs/DeltaSpike RAT-Check/modules/org.apache.deltaspike.core$deltaspike-core-api/builds/2013-05-19_00-06-07/archive/org.apache.deltaspike.core/deltaspike-core-api/0.4-incubating-SNAPSHOT/deltaspike-core-api-0.4-incubating-SNAPSHOT-tests.jar
[JENKINS] Archiving <https://builds.apache.org/job/DeltaSpike%20RAT-Check/ws/deltaspike/core/api/target/deltaspike-core-api-0.4-incubating-SNAPSHOT-sources.jar>
to /home/hudson/hudson/jobs/DeltaSpike RAT-Check/modules/org.apache.deltaspike.core$deltaspike-core-api/builds/2013-05-19_00-06-07/archive/org.apache.deltaspike.core/deltaspike-core-api/0.4-incubating-SNAPSHOT/deltaspike-core-api-0.4-incubating-SNAPSHOT-sources.jar
[JENKINS] Archiving <https://builds.apache.org/job/DeltaSpike%20RAT-Check/ws/deltaspike/parent/code/pom.xml>
to /home/hudson/hudson/jobs/DeltaSpike RAT-Check/modules/org.apache.deltaspike$parent-code/builds/2013-05-19_00-06-07/archive/org.apache.deltaspike/parent-code/0.4-incubating-SNAPSHOT/parent-code-0.4-incubating-SNAPSHOT.pom
[JENKINS] Archiving <https://builds.apache.org/job/DeltaSpike%20RAT-Check/ws/deltaspike/parent/code/target/parent-code-0.4-incubating-SNAPSHOT-tests.jar>
to /home/hudson/hudson/jobs/DeltaSpike RAT-Check/modules/org.apache.deltaspike$parent-code/builds/2013-05-19_00-06-07/archive/org.apache.deltaspike/parent-code/0.4-incubating-SNAPSHOT/parent-code-0.4-incubating-SNAPSHOT-tests.jar
[JENKINS] Archiving <https://builds.apache.org/job/DeltaSpike%20RAT-Check/ws/deltaspike/modules/pom.xml>
to /home/hudson/hudson/jobs/DeltaSpike RAT-Check/modules/org.apache.deltaspike.modules$modules-project/builds/2013-05-19_00-06-07/archive/org.apache.deltaspike.modules/modules-project/0.4-incubating-SNAPSHOT/modules-project-0.4-incubating-SNAPSHOT.pom
[JENKINS] Archiving <https://builds.apache.org/job/DeltaSpike%20RAT-Check/ws/deltaspike/modules/jpa/impl/pom.xml>
to /home/hudson/hudson/jobs/DeltaSpike RAT-Check/modules/org.apache.deltaspike.modules$deltaspike-jpa-module-impl/builds/2013-05-19_00-06-07/archive/org.apache.deltaspike.modules/deltaspike-jpa-module-impl/0.4-incubating-SNAPSHOT/deltaspike-jpa-module-impl-0.4-incubating-SNAPSHOT.pom
[JENKINS] Archiving <https://builds.apache.org/job/DeltaSpike%20RAT-Check/ws/deltaspike/modules/security/impl/pom.xml>
to /home/hudson/hudson/jobs/DeltaSpike RAT-Check/modules/org.apache.deltaspike.modules$deltaspike-security-module-impl/builds/2013-05-19_00-06-07/archive/org.apache.deltaspike.modules/deltaspike-security-module-impl/0.4-incubating-SNAPSHOT/deltaspike-security-module-impl-0.4-incubating-SNAPSHOT.pom
[JENKINS] Archiving <https://builds.apache.org/job/DeltaSpike%20RAT-Check/ws/deltaspike/modules/jpa/api/pom.xml>
to /home/hudson/hudson/jobs/DeltaSpike RAT-Check/modules/org.apache.deltaspike.modules$deltaspike-jpa-module-api/builds/2013-05-19_00-06-07/archive/org.apache.deltaspike.modules/deltaspike-jpa-module-api/0.4-incubating-SNAPSHOT/deltaspike-jpa-module-api-0.4-incubating-SNAPSHOT.pom
[JENKINS] Archiving <https://builds.apache.org/job/DeltaSpike%20RAT-Check/ws/deltaspike/modules/jsf/api/pom.xml>
to /home/hudson/hudson/jobs/DeltaSpike RAT-Check/modules/org.apache.deltaspike.modules$deltaspike-jsf-module-api/builds/2013-05-19_00-06-07/archive/org.apache.deltaspike.modules/deltaspike-jsf-module-api/0.4-incubating-SNAPSHOT/deltaspike-jsf-module-api-0.4-incubating-SNAPSHOT.pom
[JENKINS] Archiving <https://builds.apache.org/job/DeltaSpike%20RAT-Check/ws/deltaspike/examples/pom.xml>
to /home/hudson/hudson/jobs/DeltaSpike RAT-Check/modules/org.apache.deltaspike.examples$examples-project/builds/2013-05-19_00-06-07/archive/org.apache.deltaspike.examples/examples-project/0.4-incubating-SNAPSHOT/examples-project-0.4-incubating-SNAPSHOT.pom
[JENKINS] Archiving <https://builds.apache.org/job/DeltaSpike%20RAT-Check/ws/deltaspike/cdictrl/pom.xml>
to /home/hudson/hudson/jobs/DeltaSpike RAT-Check/modules/org.apache.deltaspike.cdictrl$cdictrl-project/builds/2013-05-19_00-06-07/archive/org.apache.deltaspike.cdictrl/cdictrl-project/0.4-incubating-SNAPSHOT/cdictrl-project-0.4-incubating-SNAPSHOT.pom
Waiting for Jenkins to finish collecting data
mavenExecutionResult exceptions not empty
message : Internal error: java.lang.reflect.UndeclaredThrowableException
cause : null
Stack trace : 
org.apache.maven.InternalErrorException: Internal error: java.lang.reflect.UndeclaredThrowableException
	at org.apache.maven.lifecycle.internal.BuilderCommon.handleBuildError(BuilderCommon.java:128)
	at org.apache.maven.lifecycle.internal.LifecycleModuleBuilder.buildProject(LifecycleModuleBuilder.java:95)
	at org.apache.maven.lifecycle.internal.LifecycleModuleBuilder.buildProject(LifecycleModuleBuilder.java:59)
	at org.apache.maven.lifecycle.internal.LifecycleStarter.singleThreadedBuild(LifecycleStarter.java:183)
	at org.apache.maven.lifecycle.internal.LifecycleStarter.execute(LifecycleStarter.java:161)
	at org.apache.maven.DefaultMaven.doExecute(DefaultMaven.java:320)
	at org.apache.maven.DefaultMaven.execute(DefaultMaven.java:156)
	at org.jvnet.hudson.maven3.launcher.Maven3Launcher.main(Maven3Launcher.java:79)
	at sun.reflect.NativeMethodAccessorImpl.invoke0(Native Method)
	at sun.reflect.NativeMethodAccessorImpl.invoke(NativeMethodAccessorImpl.java:39)
	at sun.reflect.DelegatingMethodAccessorImpl.invoke(DelegatingMethodAccessorImpl.java:25)
	at java.lang.reflect.Method.invoke(Method.java:597)
	at org.codehaus.plexus.classworlds.launcher.Launcher.launchStandard(Launcher.java:329)
	at org.codehaus.plexus.classworlds.launcher.Launcher.launch(Launcher.java:239)
	at org.jvnet.hudson.maven3.agent.Maven3Main.launch(Maven3Main.java:158)
	at hudson.maven.Maven3Builder.call(Maven3Builder.java:100)
	at hudson.maven.Maven3Builder.call(Maven3Builder.java:66)
	at hudson.remoting.UserRequest.perform(UserRequest.java:118)
	at hudson.remoting.UserRequest.perform(UserRequest.java:48)
	at hudson.remoting.Request$2.run(Request.java:326)
	at hudson.remoting.InterceptingExecutorService$1.call(InterceptingExecutorService.java:72)
	at java.util.concurrent.FutureTask$Sync.innerRun(FutureTask.java:303)
	at java.util.concurrent.FutureTask.run(FutureTask.java:138)
	at java.util.concurrent.ThreadPoolExecutor$Worker.runTask(ThreadPoolExecutor.java:895)
	at java.util.concurrent.ThreadPoolExecutor$Worker.run(ThreadPoolExecutor.java:918)
	at java.lang.Thread.run(Thread.java:662)
Caused by: java.lang.reflect.UndeclaredThrowableException
	at com.sun.proxy.$Proxy2.setExecutedMojos(Unknown Source)
	at hudson.maven.MavenBuildProxy$Filter.setExecutedMojos(MavenBuildProxy.java:243)
	at hudson.maven.Maven3Builder$MavenExecutionListener.recordMojoEnded(Maven3Builder.java:439)
	at hudson.maven.Maven3Builder$MavenExecutionListener.mojoSucceeded(Maven3Builder.java:425)
	at org.apache.maven.lifecycle.internal.DefaultExecutionEventCatapult.fire(DefaultExecutionEventCatapult.java:87)
	at org.apache.maven.lifecycle.internal.DefaultExecutionEventCatapult.fire(DefaultExecutionEventCatapult.java:42)
	at org.apache.maven.lifecycle.internal.MojoExecutor.execute(MojoExecutor.java:228)
	at org.apache.maven.lifecycle.internal.MojoExecutor.execute(MojoExecutor.java:153)
	at org.apache.maven.lifecycle.internal.MojoExecutor.execute(MojoExecutor.java:145)
	at org.apache.maven.lifecycle.internal.LifecycleModuleBuilder.buildProject(LifecycleModuleBuilder.java:84)
	... 24 more
Caused by: java.io.StreamCorruptedException: invalid type code: 00
	at java.io.ObjectInputStream.readTypeString(ObjectInputStream.java:1422)
	at java.io.ObjectStreamClass.readNonProxy(ObjectStreamClass.java:692)
	at java.io.ObjectInputStream.readClassDescriptor(ObjectInputStream.java:827)
	at java.io.ObjectInputStream.readNonProxyDesc(ObjectInputStream.java:1583)
	at java.io.ObjectInputStream.readClassDesc(ObjectInputStream.java:1514)
	at java.io.ObjectInputStream.readOrdinaryObject(ObjectInputStream.java:1750)
	at java.io.ObjectInputStream.readObject0(ObjectInputStream.java:1347)
	at java.io.ObjectInputStream.readObject(ObjectInputStream.java:369)
	at java.util.concurrent.CopyOnWriteArrayList.readObject(CopyOnWriteArrayList.java:879)
	at sun.reflect.GeneratedMethodAccessor7878.invoke(Unknown Source)
	at sun.reflect.DelegatingMethodAccessorImpl.invoke(DelegatingMethodAccessorImpl.java:43)
	at java.lang.reflect.Method.invoke(Method.java:601)
	at java.io.ObjectStreamClass.invokeReadObject(ObjectStreamClass.java:1004)
	at java.io.ObjectInputStream.readSerialData(ObjectInputStream.java:1872)
	at java.io.ObjectInputStream.readOrdinaryObject(ObjectInputStream.java:1777)
	at java.io.ObjectInputStream.readObject0(ObjectInputStream.java:1347)
	at java.io.ObjectInputStream.readArray(ObjectInputStream.java:1685)
	at java.io.ObjectInputStream.readObject0(ObjectInputStream.java:1341)
	at java.io.ObjectInputStream.defaultReadFields(ObjectInputStream.java:1970)
	at java.io.ObjectInputStream.readSerialData(ObjectInputStream.java:1894)
	at java.io.ObjectInputStream.readOrdinaryObject(ObjectInputStream.java:1777)
	at java.io.ObjectInputStream.readObject0(ObjectInputStream.java:1347)
	at java.io.ObjectInputStream.readObject(ObjectInputStream.java:369)
	at hudson.remoting.UserRequest.deserialize(UserRequest.java:182)
	at hudson.remoting.UserRequest.perform(UserRequest.java:98)
	at hudson.remoting.UserRequest.perform(UserRequest.java:48)
	at hudson.remoting.Request$2.run(Request.java:326)
	at hudson.remoting.InterceptingExecutorService$1.call(InterceptingExecutorService.java:72)
	at java.util.concurrent.FutureTask$Sync.innerRun(FutureTask.java:334)
	at java.util.concurrent.FutureTask.run(FutureTask.java:166)
	at java.util.concurrent.ThreadPoolExecutor.runWorker(ThreadPoolExecutor.java:1145)
	at java.util.concurrent.ThreadPoolExecutor$Worker.run(ThreadPoolExecutor.java:615)
	at java.lang.Thread.run(Thread.java:722)
Sending e-mails to: deltaspike-commits@incubator.apache.org
channel stopped

Mime
View raw message