deltaspike-commits mailing list archives

Site index · List index
Message view « Date » · « Thread »
Top « Date » · « Thread »
From Apache Jenkins Server <jenk...@builds.apache.org>
Subject Build failed in Jenkins: DeltaSpike RAT-Check #493
Date Thu, 16 May 2013 06:10:19 GMT
See <https://builds.apache.org/job/DeltaSpike%20RAT-Check/493/>

------------------------------------------
[...truncated 2760 lines...]
[INFO] 
[INFO] --- maven-bundle-plugin:2.3.7:bundle (default-bundle) @ deltaspike-jpa-module-api ---
[WARNING] Bundle org.apache.deltaspike.modules:deltaspike-jpa-module-api:bundle:0.4-incubating-SNAPSHOT
: Did not find matching referal for !org.apache.deltaspike.jpa.*
[INFO] 
[INFO] --- maven-site-plugin:3.1:attach-descriptor (attach-descriptor) @ deltaspike-jpa-module-api
---
[INFO] [INFO] Building jar: <https://builds.apache.org/job/DeltaSpike%20RAT-Check/ws/deltaspike/modules/jpa/api/target/deltaspike-jpa-module-api-0.4-incubating-SNAPSHOT-tests.jar>

[INFO] --- maven-jar-plugin:2.4:test-jar (default) @ deltaspike-jpa-module-api ---
[INFO] [INFO] Exclude: .idea/**/*
[INFO] Exclude: readme/**/*
[INFO] Exclude: **/*.log

[INFO] --- apache-rat-plugin:0.8:check (default) @ deltaspike-jpa-module-api ---
[INFO] 
[INFO] --- maven-bundle-plugin:2.3.7:cleanVersions (versions) @ deltaspike-jpa-module-api
---
[INFO] [WARNING] Parameter tasks is deprecated, use target instead
[INFO] Executing tasks

main:
[INFO] Executed tasks

[INFO] --- maven-antrun-plugin:1.6:run (javadoc.resources) @ deltaspike-jpa-module-api ---
May 16, 2013 6:08:57 AM hudson.maven.ExecutedMojo <init>
WARNING: Failed to getClass for org.apache.maven.plugin.source.SourceJarMojo
[INFO] [INFO] META-INF already added, skipping
[INFO] META-INF/NOTICE already added, skipping
[INFO] META-INF/LICENSE already added, skipping
[INFO] META-INF/DISCLAIMER already added, skipping
[INFO] META-INF/DEPENDENCIES already added, skipping

[INFO] --- maven-source-plugin:2.1.2:jar (attach-sources) @ deltaspike-jpa-module-api ---
[INFO] META-INF already added, skipping
[INFO] META-INF already added, skipping
[INFO] META-INF/NOTICE already added, skipping
[INFO] META-INF/LICENSE already added, skipping
[INFO] META-INF/DISCLAIMER already added, skipping
[INFO] META-INF/DEPENDENCIES already added, skipping
[INFO] META-INF already added, skipping
[INFO] META-INF/NOTICE already added, skipping
[INFO] META-INF/LICENSE already added, skipping
[INFO] META-INF/DISCLAIMER already added, skipping
[INFO] META-INF/DEPENDENCIES already added, skipping
[INFO] Building jar: <https://builds.apache.org/job/DeltaSpike%20RAT-Check/ws/deltaspike/modules/jpa/api/target/deltaspike-jpa-module-api-0.4-incubating-SNAPSHOT-sources.jar>
[INFO] META-INF already added, skipping
[INFO] META-INF/NOTICE already added, skipping
[INFO] META-INF/LICENSE already added, skipping
[INFO] META-INF/DISCLAIMER already added, skipping
[INFO] META-INF/DEPENDENCIES already added, skipping
[INFO] META-INF already added, skipping
[INFO] META-INF already added, skipping
[INFO] META-INF/NOTICE already added, skipping
[INFO] META-INF/LICENSE already added, skipping
[INFO] META-INF/DISCLAIMER already added, skipping
[INFO] META-INF/DEPENDENCIES already added, skipping
[INFO] META-INF already added, skipping
[INFO] META-INF/NOTICE already added, skipping
[INFO] META-INF/LICENSE already added, skipping
[INFO] META-INF/DISCLAIMER already added, skipping
[INFO] META-INF/DEPENDENCIES already added, skipping
[INFO] 
[INFO] --- maven-checkstyle-plugin:2.9.1:check (verify-style) @ deltaspike-jpa-module-api
---
[INFO] Starting audit...
Audit done.

[INFO] ------------------------------------------------------------------------
[INFO] Reactor Summary:
[INFO] 
[INFO] Apache DeltaSpike ................................. SUCCESS [32.167s]
[INFO] Apache DeltaSpike CheckStyle-rules ................ SUCCESS [8.680s]
[INFO] Apache DeltaSpike Parent .......................... SUCCESS [6.501s]
[INFO] Apache DeltaSpike Test-Utils ...................... SUCCESS [7.176s]
[INFO] Apache DeltaSpike Code Parent ..................... SUCCESS [3.892s]
[INFO] Apache DeltaSpike Core ............................ SUCCESS [2.521s]
[INFO] Apache DeltaSpike Core-API ........................ SUCCESS [25.964s]
[INFO] Apache DeltaSpike Core-Implementation ............. SUCCESS [22.667s]
[INFO] Apache DeltaSpike ContainerControl parent ......... SUCCESS [2.648s]
[INFO] Apache DeltaSpike CDI ContainerControl API ........ SUCCESS [3.577s]
[INFO] Apache DeltaSpike CDI ContainerControl TCK ........ SUCCESS [3.564s]
[INFO] Apache DeltaSpike CDI OWB-ContainerControl ........ SUCCESS [6.022s]
[INFO] Apache DeltaSpike CDI Weld-ContainerControl ....... SUCCESS [6.273s]
[INFO] Apache DeltaSpike CDI OpenEJB-ContainerControl .... SUCCESS [15.975s]
[INFO] Apache DeltaSpike Modules ......................... SUCCESS [2.400s]
[INFO] Apache DeltaSpike Security-Module ................. SUCCESS [2.933s]
[INFO] Apache DeltaSpike Security-Module API ............. SUCCESS [4.264s]
[INFO] Apache DeltaSpike Security-Module Impl ............ SUCCESS [6.864s]
[INFO] Apache DeltaSpike JPA-Module ...................... SUCCESS [2.301s]
[INFO] Apache DeltaSpike JPA-Module API .................. FAILURE [3.295s]
[INFO] Apache DeltaSpike JPA-Module Impl ................. SKIPPED
[INFO] Apache DeltaSpike JSF-Module ...................... SKIPPED
[INFO] Apache DeltaSpike JSF-Module API .................. SKIPPED
[INFO] Apache DeltaSpike JSF-Module Impl ................. SKIPPED
[INFO] Apache DeltaSpike Partial-Bean-Module ............. SKIPPED
[INFO] Apache DeltaSpike Partial-Bean-Module API ......... SKIPPED
[INFO] Apache DeltaSpike Partial-Bean-Module Impl ........ SKIPPED
[INFO] Apache DeltaSpike Examples ........................ SKIPPED
[INFO] Apache DeltaSpike Java-SE Examples ................ SKIPPED
[INFO] Apache DeltaSpike JSF Examples .................... SKIPPED
[INFO] ------------------------------------------------------------------------
[INFO] BUILD FAILURE
[INFO] ------------------------------------------------------------------------
[INFO] Total time: 2:56.791s
[INFO] Finished at: Thu May 16 06:08:58 UTC 2013
[INFO] Final Memory: 48M/360M
[INFO] ------------------------------------------------------------------------
[JENKINS] Archiving <https://builds.apache.org/job/DeltaSpike%20RAT-Check/ws/deltaspike/pom.xml>
to /home/hudson/hudson/jobs/DeltaSpike RAT-Check/modules/org.apache.deltaspike$deltaspike-project/builds/2013-05-16_06-05-46/archive/org.apache.deltaspike/deltaspike-project/0.4-incubating-SNAPSHOT/deltaspike-project-0.4-incubating-SNAPSHOT.pom
[JENKINS] Archiving <https://builds.apache.org/job/DeltaSpike%20RAT-Check/ws/deltaspike/modules/partial-bean/impl/pom.xml>
to /home/hudson/hudson/jobs/DeltaSpike RAT-Check/modules/org.apache.deltaspike.modules$deltaspike-partial-bean-module-impl/builds/2013-05-16_06-05-46/archive/org.apache.deltaspike.modules/deltaspike-partial-bean-module-impl/0.4-incubating-SNAPSHOT/deltaspike-partial-bean-module-impl-0.4-incubating-SNAPSHOT.pom
[JENKINS] Archiving <https://builds.apache.org/job/DeltaSpike%20RAT-Check/ws/deltaspike/cdictrl/impl-openejb/pom.xml>
to /home/hudson/hudson/jobs/DeltaSpike RAT-Check/modules/org.apache.deltaspike.cdictrl$deltaspike-cdictrl-openejb/builds/2013-05-16_06-05-46/archive/org.apache.deltaspike.cdictrl/deltaspike-cdictrl-openejb/0.4-incubating-SNAPSHOT/deltaspike-cdictrl-openejb-0.4-incubating-SNAPSHOT.pom
[JENKINS] Archiving <https://builds.apache.org/job/DeltaSpike%20RAT-Check/ws/deltaspike/cdictrl/impl-openejb/target/deltaspike-cdictrl-openejb-0.4-incubating-SNAPSHOT.jar>
to /home/hudson/hudson/jobs/DeltaSpike RAT-Check/modules/org.apache.deltaspike.cdictrl$deltaspike-cdictrl-openejb/builds/2013-05-16_06-05-46/archive/org.apache.deltaspike.cdictrl/deltaspike-cdictrl-openejb/0.4-incubating-SNAPSHOT/deltaspike-cdictrl-openejb-0.4-incubating-SNAPSHOT.jar
[JENKINS] Archiving <https://builds.apache.org/job/DeltaSpike%20RAT-Check/ws/deltaspike/cdictrl/impl-openejb/target/deltaspike-cdictrl-openejb-0.4-incubating-SNAPSHOT-sources.jar>
to /home/hudson/hudson/jobs/DeltaSpike RAT-Check/modules/org.apache.deltaspike.cdictrl$deltaspike-cdictrl-openejb/builds/2013-05-16_06-05-46/archive/org.apache.deltaspike.cdictrl/deltaspike-cdictrl-openejb/0.4-incubating-SNAPSHOT/deltaspike-cdictrl-openejb-0.4-incubating-SNAPSHOT-sources.jar
[JENKINS] Archiving <https://builds.apache.org/job/DeltaSpike%20RAT-Check/ws/deltaspike/cdictrl/api/pom.xml>
to /home/hudson/hudson/jobs/DeltaSpike RAT-Check/modules/org.apache.deltaspike.cdictrl$deltaspike-cdictrl-api/builds/2013-05-16_06-05-46/archive/org.apache.deltaspike.cdictrl/deltaspike-cdictrl-api/0.4-incubating-SNAPSHOT/deltaspike-cdictrl-api-0.4-incubating-SNAPSHOT.pom
[JENKINS] Archiving <https://builds.apache.org/job/DeltaSpike%20RAT-Check/ws/deltaspike/cdictrl/api/target/deltaspike-cdictrl-api-0.4-incubating-SNAPSHOT.jar>
to /home/hudson/hudson/jobs/DeltaSpike RAT-Check/modules/org.apache.deltaspike.cdictrl$deltaspike-cdictrl-api/builds/2013-05-16_06-05-46/archive/org.apache.deltaspike.cdictrl/deltaspike-cdictrl-api/0.4-incubating-SNAPSHOT/deltaspike-cdictrl-api-0.4-incubating-SNAPSHOT.jar
[JENKINS] Archiving <https://builds.apache.org/job/DeltaSpike%20RAT-Check/ws/deltaspike/cdictrl/api/target/deltaspike-cdictrl-api-0.4-incubating-SNAPSHOT-sources.jar>
to /home/hudson/hudson/jobs/DeltaSpike RAT-Check/modules/org.apache.deltaspike.cdictrl$deltaspike-cdictrl-api/builds/2013-05-16_06-05-46/archive/org.apache.deltaspike.cdictrl/deltaspike-cdictrl-api/0.4-incubating-SNAPSHOT/deltaspike-cdictrl-api-0.4-incubating-SNAPSHOT-sources.jar
[JENKINS] Archiving <https://builds.apache.org/job/DeltaSpike%20RAT-Check/ws/deltaspike/test-utils/pom.xml>
to /home/hudson/hudson/jobs/DeltaSpike RAT-Check/modules/org.apache.deltaspike.test$test-utils/builds/2013-05-16_06-05-46/archive/org.apache.deltaspike.test/test-utils/0.4-incubating-SNAPSHOT/test-utils-0.4-incubating-SNAPSHOT.pom
[JENKINS] Archiving <https://builds.apache.org/job/DeltaSpike%20RAT-Check/ws/deltaspike/test-utils/target/test-utils-0.4-incubating-SNAPSHOT.jar>
to /home/hudson/hudson/jobs/DeltaSpike RAT-Check/modules/org.apache.deltaspike.test$test-utils/builds/2013-05-16_06-05-46/archive/org.apache.deltaspike.test/test-utils/0.4-incubating-SNAPSHOT/test-utils-0.4-incubating-SNAPSHOT.jar
[JENKINS] Archiving <https://builds.apache.org/job/DeltaSpike%20RAT-Check/ws/deltaspike/test-utils/target/test-utils-0.4-incubating-SNAPSHOT-sources.jar>
to /home/hudson/hudson/jobs/DeltaSpike RAT-Check/modules/org.apache.deltaspike.test$test-utils/builds/2013-05-16_06-05-46/archive/org.apache.deltaspike.test/test-utils/0.4-incubating-SNAPSHOT/test-utils-0.4-incubating-SNAPSHOT-sources.jar
[JENKINS] Archiving <https://builds.apache.org/job/DeltaSpike%20RAT-Check/ws/deltaspike/core/impl/pom.xml>
to /home/hudson/hudson/jobs/DeltaSpike RAT-Check/modules/org.apache.deltaspike.core$deltaspike-core-impl/builds/2013-05-16_06-05-46/archive/org.apache.deltaspike.core/deltaspike-core-impl/0.4-incubating-SNAPSHOT/deltaspike-core-impl-0.4-incubating-SNAPSHOT.pom
[JENKINS] Archiving <https://builds.apache.org/job/DeltaSpike%20RAT-Check/ws/deltaspike/core/impl/target/deltaspike-core-impl-0.4-incubating-SNAPSHOT.jar>
to /home/hudson/hudson/jobs/DeltaSpike RAT-Check/modules/org.apache.deltaspike.core$deltaspike-core-impl/builds/2013-05-16_06-05-46/archive/org.apache.deltaspike.core/deltaspike-core-impl/0.4-incubating-SNAPSHOT/deltaspike-core-impl-0.4-incubating-SNAPSHOT.jar
[JENKINS] Archiving <https://builds.apache.org/job/DeltaSpike%20RAT-Check/ws/deltaspike/core/impl/target/deltaspike-core-impl-0.4-incubating-SNAPSHOT-tests.jar>
to /home/hudson/hudson/jobs/DeltaSpike RAT-Check/modules/org.apache.deltaspike.core$deltaspike-core-impl/builds/2013-05-16_06-05-46/archive/org.apache.deltaspike.core/deltaspike-core-impl/0.4-incubating-SNAPSHOT/deltaspike-core-impl-0.4-incubating-SNAPSHOT-tests.jar
[JENKINS] Archiving <https://builds.apache.org/job/DeltaSpike%20RAT-Check/ws/deltaspike/core/impl/target/deltaspike-core-impl-0.4-incubating-SNAPSHOT-sources.jar>
to /home/hudson/hudson/jobs/DeltaSpike RAT-Check/modules/org.apache.deltaspike.core$deltaspike-core-impl/builds/2013-05-16_06-05-46/archive/org.apache.deltaspike.core/deltaspike-core-impl/0.4-incubating-SNAPSHOT/deltaspike-core-impl-0.4-incubating-SNAPSHOT-sources.jar
[JENKINS] Archiving <https://builds.apache.org/job/DeltaSpike%20RAT-Check/ws/deltaspike/modules/jsf/impl/pom.xml>
to /home/hudson/hudson/jobs/DeltaSpike RAT-Check/modules/org.apache.deltaspike.modules$deltaspike-jsf-module-impl/builds/2013-05-16_06-05-46/archive/org.apache.deltaspike.modules/deltaspike-jsf-module-impl/0.4-incubating-SNAPSHOT/deltaspike-jsf-module-impl-0.4-incubating-SNAPSHOT.pom
[JENKINS] Archiving <https://builds.apache.org/job/DeltaSpike%20RAT-Check/ws/deltaspike/modules/partial-bean/pom.xml>
to /home/hudson/hudson/jobs/DeltaSpike RAT-Check/modules/org.apache.deltaspike.modules$partial-bean-module-project/builds/2013-05-16_06-05-46/archive/org.apache.deltaspike.modules/partial-bean-module-project/0.4-incubating-SNAPSHOT/partial-bean-module-project-0.4-incubating-SNAPSHOT.pom
[JENKINS] Archiving <https://builds.apache.org/job/DeltaSpike%20RAT-Check/ws/deltaspike/cdictrl/tck/pom.xml>
to /home/hudson/hudson/jobs/DeltaSpike RAT-Check/modules/org.apache.deltaspike.test$deltaspike-cdictrl-tck/builds/2013-05-16_06-05-46/archive/org.apache.deltaspike.test/deltaspike-cdictrl-tck/0.4-incubating-SNAPSHOT/deltaspike-cdictrl-tck-0.4-incubating-SNAPSHOT.pom
[JENKINS] Archiving <https://builds.apache.org/job/DeltaSpike%20RAT-Check/ws/deltaspike/cdictrl/tck/target/deltaspike-cdictrl-tck-0.4-incubating-SNAPSHOT.jar>
to /home/hudson/hudson/jobs/DeltaSpike RAT-Check/modules/org.apache.deltaspike.test$deltaspike-cdictrl-tck/builds/2013-05-16_06-05-46/archive/org.apache.deltaspike.test/deltaspike-cdictrl-tck/0.4-incubating-SNAPSHOT/deltaspike-cdictrl-tck-0.4-incubating-SNAPSHOT.jar
[JENKINS] Archiving <https://builds.apache.org/job/DeltaSpike%20RAT-Check/ws/deltaspike/cdictrl/tck/target/deltaspike-cdictrl-tck-0.4-incubating-SNAPSHOT-sources.jar>
to /home/hudson/hudson/jobs/DeltaSpike RAT-Check/modules/org.apache.deltaspike.test$deltaspike-cdictrl-tck/builds/2013-05-16_06-05-46/archive/org.apache.deltaspike.test/deltaspike-cdictrl-tck/0.4-incubating-SNAPSHOT/deltaspike-cdictrl-tck-0.4-incubating-SNAPSHOT-sources.jar
[JENKINS] Archiving <https://builds.apache.org/job/DeltaSpike%20RAT-Check/ws/deltaspike/core/pom.xml>
to /home/hudson/hudson/jobs/DeltaSpike RAT-Check/modules/org.apache.deltaspike.core$core-project/builds/2013-05-16_06-05-46/archive/org.apache.deltaspike.core/core-project/0.4-incubating-SNAPSHOT/core-project-0.4-incubating-SNAPSHOT.pom
[JENKINS] Archiving <https://builds.apache.org/job/DeltaSpike%20RAT-Check/ws/deltaspike/core/target/core-project-0.4-incubating-SNAPSHOT-tests.jar>
to /home/hudson/hudson/jobs/DeltaSpike RAT-Check/modules/org.apache.deltaspike.core$core-project/builds/2013-05-16_06-05-46/archive/org.apache.deltaspike.core/core-project/0.4-incubating-SNAPSHOT/core-project-0.4-incubating-SNAPSHOT-tests.jar
[JENKINS] Archiving <https://builds.apache.org/job/DeltaSpike%20RAT-Check/ws/deltaspike/checkstyle-rules/pom.xml>
to /home/hudson/hudson/jobs/DeltaSpike RAT-Check/modules/org.apache.deltaspike$checkstyle-rules/builds/2013-05-16_06-05-46/archive/org.apache.deltaspike/checkstyle-rules/0.4-incubating-SNAPSHOT/checkstyle-rules-0.4-incubating-SNAPSHOT.pom
[JENKINS] Archiving <https://builds.apache.org/job/DeltaSpike%20RAT-Check/ws/deltaspike/checkstyle-rules/target/checkstyle-rules-0.4-incubating-SNAPSHOT.jar>
to /home/hudson/hudson/jobs/DeltaSpike RAT-Check/modules/org.apache.deltaspike$checkstyle-rules/builds/2013-05-16_06-05-46/archive/org.apache.deltaspike/checkstyle-rules/0.4-incubating-SNAPSHOT/checkstyle-rules-0.4-incubating-SNAPSHOT.jar
[JENKINS] Archiving <https://builds.apache.org/job/DeltaSpike%20RAT-Check/ws/deltaspike/examples/jsf-examples/pom.xml>
to /home/hudson/hudson/jobs/DeltaSpike RAT-Check/modules/org.apache.deltaspike.examples$deltaspike-jsf-example/builds/2013-05-16_06-05-46/archive/org.apache.deltaspike.examples/deltaspike-jsf-example/0.4-incubating-SNAPSHOT/deltaspike-jsf-example-0.4-incubating-SNAPSHOT.pom
[JENKINS] Archiving <https://builds.apache.org/job/DeltaSpike%20RAT-Check/ws/deltaspike/modules/security/api/pom.xml>
to /home/hudson/hudson/jobs/DeltaSpike RAT-Check/modules/org.apache.deltaspike.modules$deltaspike-security-module-api/builds/2013-05-16_06-05-46/archive/org.apache.deltaspike.modules/deltaspike-security-module-api/0.4-incubating-SNAPSHOT/deltaspike-security-module-api-0.4-incubating-SNAPSHOT.pom
[JENKINS] Archiving <https://builds.apache.org/job/DeltaSpike%20RAT-Check/ws/deltaspike/modules/security/api/target/deltaspike-security-module-api-0.4-incubating-SNAPSHOT.jar>
to /home/hudson/hudson/jobs/DeltaSpike RAT-Check/modules/org.apache.deltaspike.modules$deltaspike-security-module-api/builds/2013-05-16_06-05-46/archive/org.apache.deltaspike.modules/deltaspike-security-module-api/0.4-incubating-SNAPSHOT/deltaspike-security-module-api-0.4-incubating-SNAPSHOT.jar
[JENKINS] Archiving <https://builds.apache.org/job/DeltaSpike%20RAT-Check/ws/deltaspike/modules/security/api/target/deltaspike-security-module-api-0.4-incubating-SNAPSHOT-tests.jar>
to /home/hudson/hudson/jobs/DeltaSpike RAT-Check/modules/org.apache.deltaspike.modules$deltaspike-security-module-api/builds/2013-05-16_06-05-46/archive/org.apache.deltaspike.modules/deltaspike-security-module-api/0.4-incubating-SNAPSHOT/deltaspike-security-module-api-0.4-incubating-SNAPSHOT-tests.jar
[JENKINS] Archiving <https://builds.apache.org/job/DeltaSpike%20RAT-Check/ws/deltaspike/modules/security/api/target/deltaspike-security-module-api-0.4-incubating-SNAPSHOT-sources.jar>
to /home/hudson/hudson/jobs/DeltaSpike RAT-Check/modules/org.apache.deltaspike.modules$deltaspike-security-module-api/builds/2013-05-16_06-05-46/archive/org.apache.deltaspike.modules/deltaspike-security-module-api/0.4-incubating-SNAPSHOT/deltaspike-security-module-api-0.4-incubating-SNAPSHOT-sources.jar
[JENKINS] Archiving <https://builds.apache.org/job/DeltaSpike%20RAT-Check/ws/deltaspike/modules/jpa/pom.xml>
to /home/hudson/hudson/jobs/DeltaSpike RAT-Check/modules/org.apache.deltaspike.modules$jpa-module-project/builds/2013-05-16_06-05-46/archive/org.apache.deltaspike.modules/jpa-module-project/0.4-incubating-SNAPSHOT/jpa-module-project-0.4-incubating-SNAPSHOT.pom
[JENKINS] Archiving <https://builds.apache.org/job/DeltaSpike%20RAT-Check/ws/deltaspike/modules/jpa/target/jpa-module-project-0.4-incubating-SNAPSHOT-tests.jar>
to /home/hudson/hudson/jobs/DeltaSpike RAT-Check/modules/org.apache.deltaspike.modules$jpa-module-project/builds/2013-05-16_06-05-46/archive/org.apache.deltaspike.modules/jpa-module-project/0.4-incubating-SNAPSHOT/jpa-module-project-0.4-incubating-SNAPSHOT-tests.jar
[JENKINS] Archiving <https://builds.apache.org/job/DeltaSpike%20RAT-Check/ws/deltaspike/parent/pom.xml>
to /home/hudson/hudson/jobs/DeltaSpike RAT-Check/modules/org.apache.deltaspike$parent/builds/2013-05-16_06-05-46/archive/org.apache.deltaspike/parent/0.4-incubating-SNAPSHOT/parent-0.4-incubating-SNAPSHOT.pom
[JENKINS] Archiving <https://builds.apache.org/job/DeltaSpike%20RAT-Check/ws/deltaspike/cdictrl/impl-weld/pom.xml>
to /home/hudson/hudson/jobs/DeltaSpike RAT-Check/modules/org.apache.deltaspike.cdictrl$deltaspike-cdictrl-weld/builds/2013-05-16_06-05-46/archive/org.apache.deltaspike.cdictrl/deltaspike-cdictrl-weld/0.4-incubating-SNAPSHOT/deltaspike-cdictrl-weld-0.4-incubating-SNAPSHOT.pom
[JENKINS] Archiving <https://builds.apache.org/job/DeltaSpike%20RAT-Check/ws/deltaspike/cdictrl/impl-weld/target/deltaspike-cdictrl-weld-0.4-incubating-SNAPSHOT.jar>
to /home/hudson/hudson/jobs/DeltaSpike RAT-Check/modules/org.apache.deltaspike.cdictrl$deltaspike-cdictrl-weld/builds/2013-05-16_06-05-46/archive/org.apache.deltaspike.cdictrl/deltaspike-cdictrl-weld/0.4-incubating-SNAPSHOT/deltaspike-cdictrl-weld-0.4-incubating-SNAPSHOT.jar
[JENKINS] Archiving <https://builds.apache.org/job/DeltaSpike%20RAT-Check/ws/deltaspike/cdictrl/impl-weld/target/deltaspike-cdictrl-weld-0.4-incubating-SNAPSHOT-sources.jar>
to /home/hudson/hudson/jobs/DeltaSpike RAT-Check/modules/org.apache.deltaspike.cdictrl$deltaspike-cdictrl-weld/builds/2013-05-16_06-05-46/archive/org.apache.deltaspike.cdictrl/deltaspike-cdictrl-weld/0.4-incubating-SNAPSHOT/deltaspike-cdictrl-weld-0.4-incubating-SNAPSHOT-sources.jar
[JENKINS] Archiving <https://builds.apache.org/job/DeltaSpike%20RAT-Check/ws/deltaspike/examples/jse-examples/pom.xml>
to /home/hudson/hudson/jobs/DeltaSpike RAT-Check/modules/org.apache.deltaspike.examples$deltaspike-jse-example/builds/2013-05-16_06-05-46/archive/org.apache.deltaspike.examples/deltaspike-jse-example/0.4-incubating-SNAPSHOT/deltaspike-jse-example-0.4-incubating-SNAPSHOT.pom
[JENKINS] Archiving <https://builds.apache.org/job/DeltaSpike%20RAT-Check/ws/deltaspike/modules/partial-bean/api/pom.xml>
to /home/hudson/hudson/jobs/DeltaSpike RAT-Check/modules/org.apache.deltaspike.modules$deltaspike-partial-bean-module-api/builds/2013-05-16_06-05-46/archive/org.apache.deltaspike.modules/deltaspike-partial-bean-module-api/0.4-incubating-SNAPSHOT/deltaspike-partial-bean-module-api-0.4-incubating-SNAPSHOT.pom
[JENKINS] Archiving <https://builds.apache.org/job/DeltaSpike%20RAT-Check/ws/deltaspike/modules/security/pom.xml>
to /home/hudson/hudson/jobs/DeltaSpike RAT-Check/modules/org.apache.deltaspike.modules$security-module-project/builds/2013-05-16_06-05-46/archive/org.apache.deltaspike.modules/security-module-project/0.4-incubating-SNAPSHOT/security-module-project-0.4-incubating-SNAPSHOT.pom
[JENKINS] Archiving <https://builds.apache.org/job/DeltaSpike%20RAT-Check/ws/deltaspike/modules/security/target/security-module-project-0.4-incubating-SNAPSHOT-tests.jar>
to /home/hudson/hudson/jobs/DeltaSpike RAT-Check/modules/org.apache.deltaspike.modules$security-module-project/builds/2013-05-16_06-05-46/archive/org.apache.deltaspike.modules/security-module-project/0.4-incubating-SNAPSHOT/security-module-project-0.4-incubating-SNAPSHOT-tests.jar
[JENKINS] Archiving <https://builds.apache.org/job/DeltaSpike%20RAT-Check/ws/deltaspike/cdictrl/impl-owb/pom.xml>
to /home/hudson/hudson/jobs/DeltaSpike RAT-Check/modules/org.apache.deltaspike.cdictrl$deltaspike-cdictrl-owb/builds/2013-05-16_06-05-46/archive/org.apache.deltaspike.cdictrl/deltaspike-cdictrl-owb/0.4-incubating-SNAPSHOT/deltaspike-cdictrl-owb-0.4-incubating-SNAPSHOT.pom
[JENKINS] Archiving <https://builds.apache.org/job/DeltaSpike%20RAT-Check/ws/deltaspike/cdictrl/impl-owb/target/deltaspike-cdictrl-owb-0.4-incubating-SNAPSHOT.jar>
to /home/hudson/hudson/jobs/DeltaSpike RAT-Check/modules/org.apache.deltaspike.cdictrl$deltaspike-cdictrl-owb/builds/2013-05-16_06-05-46/archive/org.apache.deltaspike.cdictrl/deltaspike-cdictrl-owb/0.4-incubating-SNAPSHOT/deltaspike-cdictrl-owb-0.4-incubating-SNAPSHOT.jar
[JENKINS] Archiving <https://builds.apache.org/job/DeltaSpike%20RAT-Check/ws/deltaspike/cdictrl/impl-owb/target/deltaspike-cdictrl-owb-0.4-incubating-SNAPSHOT-sources.jar>
to /home/hudson/hudson/jobs/DeltaSpike RAT-Check/modules/org.apache.deltaspike.cdictrl$deltaspike-cdictrl-owb/builds/2013-05-16_06-05-46/archive/org.apache.deltaspike.cdictrl/deltaspike-cdictrl-owb/0.4-incubating-SNAPSHOT/deltaspike-cdictrl-owb-0.4-incubating-SNAPSHOT-sources.jar
[JENKINS] Archiving <https://builds.apache.org/job/DeltaSpike%20RAT-Check/ws/deltaspike/modules/jsf/pom.xml>
to /home/hudson/hudson/jobs/DeltaSpike RAT-Check/modules/org.apache.deltaspike.modules$jsf-module-project/builds/2013-05-16_06-05-46/archive/org.apache.deltaspike.modules/jsf-module-project/0.4-incubating-SNAPSHOT/jsf-module-project-0.4-incubating-SNAPSHOT.pom
[JENKINS] Archiving <https://builds.apache.org/job/DeltaSpike%20RAT-Check/ws/deltaspike/core/api/pom.xml>
to /home/hudson/hudson/jobs/DeltaSpike RAT-Check/modules/org.apache.deltaspike.core$deltaspike-core-api/builds/2013-05-16_06-05-46/archive/org.apache.deltaspike.core/deltaspike-core-api/0.4-incubating-SNAPSHOT/deltaspike-core-api-0.4-incubating-SNAPSHOT.pom
[JENKINS] Archiving <https://builds.apache.org/job/DeltaSpike%20RAT-Check/ws/deltaspike/core/api/target/deltaspike-core-api-0.4-incubating-SNAPSHOT.jar>
to /home/hudson/hudson/jobs/DeltaSpike RAT-Check/modules/org.apache.deltaspike.core$deltaspike-core-api/builds/2013-05-16_06-05-46/archive/org.apache.deltaspike.core/deltaspike-core-api/0.4-incubating-SNAPSHOT/deltaspike-core-api-0.4-incubating-SNAPSHOT.jar
[JENKINS] Archiving <https://builds.apache.org/job/DeltaSpike%20RAT-Check/ws/deltaspike/core/api/target/deltaspike-core-api-0.4-incubating-SNAPSHOT-tests.jar>
to /home/hudson/hudson/jobs/DeltaSpike RAT-Check/modules/org.apache.deltaspike.core$deltaspike-core-api/builds/2013-05-16_06-05-46/archive/org.apache.deltaspike.core/deltaspike-core-api/0.4-incubating-SNAPSHOT/deltaspike-core-api-0.4-incubating-SNAPSHOT-tests.jar
[JENKINS] Archiving <https://builds.apache.org/job/DeltaSpike%20RAT-Check/ws/deltaspike/core/api/target/deltaspike-core-api-0.4-incubating-SNAPSHOT-sources.jar>
to /home/hudson/hudson/jobs/DeltaSpike RAT-Check/modules/org.apache.deltaspike.core$deltaspike-core-api/builds/2013-05-16_06-05-46/archive/org.apache.deltaspike.core/deltaspike-core-api/0.4-incubating-SNAPSHOT/deltaspike-core-api-0.4-incubating-SNAPSHOT-sources.jar
[JENKINS] Archiving <https://builds.apache.org/job/DeltaSpike%20RAT-Check/ws/deltaspike/parent/code/pom.xml>
to /home/hudson/hudson/jobs/DeltaSpike RAT-Check/modules/org.apache.deltaspike$parent-code/builds/2013-05-16_06-05-46/archive/org.apache.deltaspike/parent-code/0.4-incubating-SNAPSHOT/parent-code-0.4-incubating-SNAPSHOT.pom
[JENKINS] Archiving <https://builds.apache.org/job/DeltaSpike%20RAT-Check/ws/deltaspike/parent/code/target/parent-code-0.4-incubating-SNAPSHOT-tests.jar>
to /home/hudson/hudson/jobs/DeltaSpike RAT-Check/modules/org.apache.deltaspike$parent-code/builds/2013-05-16_06-05-46/archive/org.apache.deltaspike/parent-code/0.4-incubating-SNAPSHOT/parent-code-0.4-incubating-SNAPSHOT-tests.jar
[JENKINS] Archiving <https://builds.apache.org/job/DeltaSpike%20RAT-Check/ws/deltaspike/modules/pom.xml>
to /home/hudson/hudson/jobs/DeltaSpike RAT-Check/modules/org.apache.deltaspike.modules$modules-project/builds/2013-05-16_06-05-46/archive/org.apache.deltaspike.modules/modules-project/0.4-incubating-SNAPSHOT/modules-project-0.4-incubating-SNAPSHOT.pom
[JENKINS] Archiving <https://builds.apache.org/job/DeltaSpike%20RAT-Check/ws/deltaspike/modules/target/modules-project-0.4-incubating-SNAPSHOT-tests.jar>
to /home/hudson/hudson/jobs/DeltaSpike RAT-Check/modules/org.apache.deltaspike.modules$modules-project/builds/2013-05-16_06-05-46/archive/org.apache.deltaspike.modules/modules-project/0.4-incubating-SNAPSHOT/modules-project-0.4-incubating-SNAPSHOT-tests.jar
[JENKINS] Archiving <https://builds.apache.org/job/DeltaSpike%20RAT-Check/ws/deltaspike/modules/jpa/impl/pom.xml>
to /home/hudson/hudson/jobs/DeltaSpike RAT-Check/modules/org.apache.deltaspike.modules$deltaspike-jpa-module-impl/builds/2013-05-16_06-05-46/archive/org.apache.deltaspike.modules/deltaspike-jpa-module-impl/0.4-incubating-SNAPSHOT/deltaspike-jpa-module-impl-0.4-incubating-SNAPSHOT.pom
[JENKINS] Archiving <https://builds.apache.org/job/DeltaSpike%20RAT-Check/ws/deltaspike/modules/security/impl/pom.xml>
to /home/hudson/hudson/jobs/DeltaSpike RAT-Check/modules/org.apache.deltaspike.modules$deltaspike-security-module-impl/builds/2013-05-16_06-05-46/archive/org.apache.deltaspike.modules/deltaspike-security-module-impl/0.4-incubating-SNAPSHOT/deltaspike-security-module-impl-0.4-incubating-SNAPSHOT.pom
[JENKINS] Archiving <https://builds.apache.org/job/DeltaSpike%20RAT-Check/ws/deltaspike/modules/security/impl/target/deltaspike-security-module-impl-0.4-incubating-SNAPSHOT.jar>
to /home/hudson/hudson/jobs/DeltaSpike RAT-Check/modules/org.apache.deltaspike.modules$deltaspike-security-module-impl/builds/2013-05-16_06-05-46/archive/org.apache.deltaspike.modules/deltaspike-security-module-impl/0.4-incubating-SNAPSHOT/deltaspike-security-module-impl-0.4-incubating-SNAPSHOT.jar
[JENKINS] Archiving <https://builds.apache.org/job/DeltaSpike%20RAT-Check/ws/deltaspike/modules/security/impl/target/deltaspike-security-module-impl-0.4-incubating-SNAPSHOT-tests.jar>
to /home/hudson/hudson/jobs/DeltaSpike RAT-Check/modules/org.apache.deltaspike.modules$deltaspike-security-module-impl/builds/2013-05-16_06-05-46/archive/org.apache.deltaspike.modules/deltaspike-security-module-impl/0.4-incubating-SNAPSHOT/deltaspike-security-module-impl-0.4-incubating-SNAPSHOT-tests.jar
[JENKINS] Archiving <https://builds.apache.org/job/DeltaSpike%20RAT-Check/ws/deltaspike/modules/security/impl/target/deltaspike-security-module-impl-0.4-incubating-SNAPSHOT-sources.jar>
to /home/hudson/hudson/jobs/DeltaSpike RAT-Check/modules/org.apache.deltaspike.modules$deltaspike-security-module-impl/builds/2013-05-16_06-05-46/archive/org.apache.deltaspike.modules/deltaspike-security-module-impl/0.4-incubating-SNAPSHOT/deltaspike-security-module-impl-0.4-incubating-SNAPSHOT-sources.jar
[JENKINS] Archiving <https://builds.apache.org/job/DeltaSpike%20RAT-Check/ws/deltaspike/modules/jpa/api/pom.xml>
to /home/hudson/hudson/jobs/DeltaSpike RAT-Check/modules/org.apache.deltaspike.modules$deltaspike-jpa-module-api/builds/2013-05-16_06-05-46/archive/org.apache.deltaspike.modules/deltaspike-jpa-module-api/0.4-incubating-SNAPSHOT/deltaspike-jpa-module-api-0.4-incubating-SNAPSHOT.pom
[JENKINS] Archiving <https://builds.apache.org/job/DeltaSpike%20RAT-Check/ws/deltaspike/modules/jpa/api/target/deltaspike-jpa-module-api-0.4-incubating-SNAPSHOT.jar>
to /home/hudson/hudson/jobs/DeltaSpike RAT-Check/modules/org.apache.deltaspike.modules$deltaspike-jpa-module-api/builds/2013-05-16_06-05-46/archive/org.apache.deltaspike.modules/deltaspike-jpa-module-api/0.4-incubating-SNAPSHOT/deltaspike-jpa-module-api-0.4-incubating-SNAPSHOT.jar
[JENKINS] Archiving <https://builds.apache.org/job/DeltaSpike%20RAT-Check/ws/deltaspike/modules/jpa/api/target/deltaspike-jpa-module-api-0.4-incubating-SNAPSHOT-tests.jar>
to /home/hudson/hudson/jobs/DeltaSpike RAT-Check/modules/org.apache.deltaspike.modules$deltaspike-jpa-module-api/builds/2013-05-16_06-05-46/archive/org.apache.deltaspike.modules/deltaspike-jpa-module-api/0.4-incubating-SNAPSHOT/deltaspike-jpa-module-api-0.4-incubating-SNAPSHOT-tests.jar
[JENKINS] Archiving <https://builds.apache.org/job/DeltaSpike%20RAT-Check/ws/deltaspike/modules/jpa/api/target/deltaspike-jpa-module-api-0.4-incubating-SNAPSHOT-sources.jar>
to /home/hudson/hudson/jobs/DeltaSpike RAT-Check/modules/org.apache.deltaspike.modules$deltaspike-jpa-module-api/builds/2013-05-16_06-05-46/archive/org.apache.deltaspike.modules/deltaspike-jpa-module-api/0.4-incubating-SNAPSHOT/deltaspike-jpa-module-api-0.4-incubating-SNAPSHOT-sources.jar
[JENKINS] Archiving <https://builds.apache.org/job/DeltaSpike%20RAT-Check/ws/deltaspike/modules/jsf/api/pom.xml>
to /home/hudson/hudson/jobs/DeltaSpike RAT-Check/modules/org.apache.deltaspike.modules$deltaspike-jsf-module-api/builds/2013-05-16_06-05-46/archive/org.apache.deltaspike.modules/deltaspike-jsf-module-api/0.4-incubating-SNAPSHOT/deltaspike-jsf-module-api-0.4-incubating-SNAPSHOT.pom
[JENKINS] Archiving <https://builds.apache.org/job/DeltaSpike%20RAT-Check/ws/deltaspike/examples/pom.xml>
to /home/hudson/hudson/jobs/DeltaSpike RAT-Check/modules/org.apache.deltaspike.examples$examples-project/builds/2013-05-16_06-05-46/archive/org.apache.deltaspike.examples/examples-project/0.4-incubating-SNAPSHOT/examples-project-0.4-incubating-SNAPSHOT.pom
[JENKINS] Archiving <https://builds.apache.org/job/DeltaSpike%20RAT-Check/ws/deltaspike/cdictrl/pom.xml>
to /home/hudson/hudson/jobs/DeltaSpike RAT-Check/modules/org.apache.deltaspike.cdictrl$cdictrl-project/builds/2013-05-16_06-05-46/archive/org.apache.deltaspike.cdictrl/cdictrl-project/0.4-incubating-SNAPSHOT/cdictrl-project-0.4-incubating-SNAPSHOT.pom
Waiting for Jenkins to finish collecting data
mavenExecutionResult exceptions not empty
message : Internal error: java.lang.reflect.UndeclaredThrowableException
cause : null
Stack trace : 
org.apache.maven.InternalErrorException: Internal error: java.lang.reflect.UndeclaredThrowableException
	at org.apache.maven.lifecycle.internal.BuilderCommon.handleBuildError(BuilderCommon.java:128)
	at org.apache.maven.lifecycle.internal.LifecycleModuleBuilder.buildProject(LifecycleModuleBuilder.java:95)
	at org.apache.maven.lifecycle.internal.LifecycleModuleBuilder.buildProject(LifecycleModuleBuilder.java:59)
	at org.apache.maven.lifecycle.internal.LifecycleStarter.singleThreadedBuild(LifecycleStarter.java:183)
	at org.apache.maven.lifecycle.internal.LifecycleStarter.execute(LifecycleStarter.java:161)
	at org.apache.maven.DefaultMaven.doExecute(DefaultMaven.java:320)
	at org.apache.maven.DefaultMaven.execute(DefaultMaven.java:156)
	at org.jvnet.hudson.maven3.launcher.Maven3Launcher.main(Maven3Launcher.java:79)
	at sun.reflect.NativeMethodAccessorImpl.invoke0(Native Method)
	at sun.reflect.NativeMethodAccessorImpl.invoke(NativeMethodAccessorImpl.java:39)
	at sun.reflect.DelegatingMethodAccessorImpl.invoke(DelegatingMethodAccessorImpl.java:25)
	at java.lang.reflect.Method.invoke(Method.java:597)
	at org.codehaus.plexus.classworlds.launcher.Launcher.launchStandard(Launcher.java:329)
	at org.codehaus.plexus.classworlds.launcher.Launcher.launch(Launcher.java:239)
	at org.jvnet.hudson.maven3.agent.Maven3Main.launch(Maven3Main.java:158)
	at hudson.maven.Maven3Builder.call(Maven3Builder.java:100)
	at hudson.maven.Maven3Builder.call(Maven3Builder.java:66)
	at hudson.remoting.UserRequest.perform(UserRequest.java:118)
	at hudson.remoting.UserRequest.perform(UserRequest.java:48)
	at hudson.remoting.Request$2.run(Request.java:326)
	at hudson.remoting.InterceptingExecutorService$1.call(InterceptingExecutorService.java:72)
	at java.util.concurrent.FutureTask$Sync.innerRun(FutureTask.java:303)
	at java.util.concurrent.FutureTask.run(FutureTask.java:138)
	at java.util.concurrent.ThreadPoolExecutor$Worker.runTask(ThreadPoolExecutor.java:895)
	at java.util.concurrent.ThreadPoolExecutor$Worker.run(ThreadPoolExecutor.java:918)
	at java.lang.Thread.run(Thread.java:662)
Caused by: java.lang.reflect.UndeclaredThrowableException
	at com.sun.proxy.$Proxy2.setExecutedMojos(Unknown Source)
	at hudson.maven.MavenBuildProxy$Filter.setExecutedMojos(MavenBuildProxy.java:243)
	at hudson.maven.Maven3Builder$MavenExecutionListener.recordMojoEnded(Maven3Builder.java:439)
	at hudson.maven.Maven3Builder$MavenExecutionListener.mojoSucceeded(Maven3Builder.java:425)
	at org.apache.maven.lifecycle.internal.DefaultExecutionEventCatapult.fire(DefaultExecutionEventCatapult.java:87)
	at org.apache.maven.lifecycle.internal.DefaultExecutionEventCatapult.fire(DefaultExecutionEventCatapult.java:42)
	at org.apache.maven.lifecycle.internal.MojoExecutor.execute(MojoExecutor.java:228)
	at org.apache.maven.lifecycle.internal.MojoExecutor.execute(MojoExecutor.java:153)
	at org.apache.maven.lifecycle.internal.MojoExecutor.execute(MojoExecutor.java:145)
	at org.apache.maven.lifecycle.internal.LifecycleModuleBuilder.buildProject(LifecycleModuleBuilder.java:84)
	... 24 more
Caused by: java.io.UTFDataFormatException
	at java.io.ObjectInputStream$BlockDataInputStream.readUTFSpan(ObjectInputStream.java:3105)
	at java.io.ObjectInputStream$BlockDataInputStream.readUTFBody(ObjectInputStream.java:3030)
	at java.io.ObjectInputStream$BlockDataInputStream.readUTF(ObjectInputStream.java:2843)
	at java.io.ObjectInputStream.readString(ObjectInputStream.java:1617)
	at java.io.ObjectInputStream.readObject0(ObjectInputStream.java:1338)
	at java.io.ObjectInputStream.defaultReadFields(ObjectInputStream.java:1970)
	at java.io.ObjectInputStream.readSerialData(ObjectInputStream.java:1894)
	at java.io.ObjectInputStream.readOrdinaryObject(ObjectInputStream.java:1777)
	at java.io.ObjectInputStream.readObject0(ObjectInputStream.java:1347)
	at java.io.ObjectInputStream.readObject(ObjectInputStream.java:369)
	at java.util.concurrent.CopyOnWriteArrayList.readObject(CopyOnWriteArrayList.java:879)
	at sun.reflect.GeneratedMethodAccessor5032.invoke(Unknown Source)
	at sun.reflect.DelegatingMethodAccessorImpl.invoke(DelegatingMethodAccessorImpl.java:43)
	at java.lang.reflect.Method.invoke(Method.java:601)
	at java.io.ObjectStreamClass.invokeReadObject(ObjectStreamClass.java:1004)
	at java.io.ObjectInputStream.readSerialData(ObjectInputStream.java:1872)
	at java.io.ObjectInputStream.readOrdinaryObject(ObjectInputStream.java:1777)
	at java.io.ObjectInputStream.readObject0(ObjectInputStream.java:1347)
	at java.io.ObjectInputStream.readArray(ObjectInputStream.java:1685)
	at java.io.ObjectInputStream.readObject0(ObjectInputStream.java:1341)
	at java.io.ObjectInputStream.defaultReadFields(ObjectInputStream.java:1970)
	at java.io.ObjectInputStream.readSerialData(ObjectInputStream.java:1894)
	at java.io.ObjectInputStream.readOrdinaryObject(ObjectInputStream.java:1777)
	at java.io.ObjectInputStream.readObject0(ObjectInputStream.java:1347)
	at java.io.ObjectInputStream.readObject(ObjectInputStream.java:369)
	at hudson.remoting.UserRequest.deserialize(UserRequest.java:182)
	at hudson.remoting.UserRequest.perform(UserRequest.java:98)
	at hudson.remoting.UserRequest.perform(UserRequest.java:48)
	at hudson.remoting.Request$2.run(Request.java:326)
	at hudson.remoting.InterceptingExecutorService$1.call(InterceptingExecutorService.java:72)
	at java.util.concurrent.FutureTask$Sync.innerRun(FutureTask.java:334)
	at java.util.concurrent.FutureTask.run(FutureTask.java:166)
	at java.util.concurrent.ThreadPoolExecutor.runWorker(ThreadPoolExecutor.java:1145)
	at java.util.concurrent.ThreadPoolExecutor$Worker.run(ThreadPoolExecutor.java:615)
	at java.lang.Thread.run(Thread.java:722)
Sending e-mails to: deltaspike-commits@incubator.apache.org
channel stopped

Mime
View raw message