deltaspike-commits mailing list archives

Site index · List index
Message view « Date » · « Thread »
Top « Date » · « Thread »
From Apache Jenkins Server <jenk...@builds.apache.org>
Subject Build failed in Jenkins: DeltaSpike_TomEE_latest #56
Date Thu, 23 May 2013 08:30:55 GMT
See <https://builds.apache.org/job/DeltaSpike_TomEE_latest/56/changes>

Changes:

[struberg] DELTASPIKE-208 explicitely enable global alternatives

------------------------------------------
[...truncated 7369 lines...]
Downloading: https://repository.apache.org/content/repositories/orgapacheopenwebbeans-013/org/apache/openwebbeans/openwebbeans-web/1.2.0-SNAPSHOT/maven-metadata.xml
Downloading: http://repository.apache.org/snapshots/org/apache/openwebbeans/openwebbeans-web/1.2.0-SNAPSHOT/maven-metadata.xml
Downloading: http://repository.apache.org/content/groups/snapshots-group/org/apache/openwebbeans/openwebbeans-web/1.2.0-SNAPSHOT/maven-metadata.xml
Downloading: https://oss.sonatype.org/content/repositories/snapshots/org/apache/openwebbeans/openwebbeans-web/1.2.0-SNAPSHOT/maven-metadata.xml
Downloading: https://repository.jboss.org/nexus/content/groups/public-jboss/org/apache/openwebbeans/openwebbeans-web/1.2.0-SNAPSHOT/maven-metadata.xml
Downloading: http://repository.apache.org/snapshots/org/apache/openwebbeans/openwebbeans-web/1.2.0-SNAPSHOT/maven-metadata.xml
Downloading: http://repo.terracotta.org/maven2/org/apache/openwebbeans/openwebbeans-web/1.2.0-SNAPSHOT/maven-metadata.xml
Downloading: https://repository.apache.org/content/repositories/snapshots/org/apache/openwebbeans/openwebbeans-el22/1.2.0-SNAPSHOT/maven-metadata.xml
Downloading: https://repository.apache.org/content/repositories/releases/org/apache/openwebbeans/openwebbeans-el22/1.2.0-SNAPSHOT/maven-metadata.xml
Downloading: http://repository.apache.org/snapshots/org/apache/openwebbeans/openwebbeans-el22/1.2.0-SNAPSHOT/maven-metadata.xml
Downloading: https://repository.apache.org/content/repositories/orgapacheopenwebbeans-013/org/apache/openwebbeans/openwebbeans-el22/1.2.0-SNAPSHOT/maven-metadata.xml
Downloading: http://repository.apache.org/content/groups/snapshots-group/org/apache/openwebbeans/openwebbeans-el22/1.2.0-SNAPSHOT/maven-metadata.xml
Downloading: https://oss.sonatype.org/content/repositories/snapshots/org/apache/openwebbeans/openwebbeans-el22/1.2.0-SNAPSHOT/maven-metadata.xml
Downloading: https://repository.jboss.org/nexus/content/groups/public-jboss/org/apache/openwebbeans/openwebbeans-el22/1.2.0-SNAPSHOT/maven-metadata.xml
Downloading: http://repository.apache.org/snapshots/org/apache/openwebbeans/openwebbeans-el22/1.2.0-SNAPSHOT/maven-metadata.xml
Downloading: http://repo.terracotta.org/maven2/org/apache/openwebbeans/openwebbeans-el22/1.2.0-SNAPSHOT/maven-metadata.xml
Downloading: https://repository.apache.org/content/repositories/snapshots/org/apache/openjpa/openjpa/2.3.0-SNAPSHOT/maven-metadata.xml
Downloading: https://repository.apache.org/content/repositories/releases/org/apache/openjpa/openjpa/2.3.0-SNAPSHOT/maven-metadata.xml
Downloading: https://repository.apache.org/content/repositories/orgapacheopenwebbeans-013/org/apache/openjpa/openjpa/2.3.0-SNAPSHOT/maven-metadata.xml
Downloading: http://repository.apache.org/snapshots/org/apache/openjpa/openjpa/2.3.0-SNAPSHOT/maven-metadata.xml
Downloading: http://repository.apache.org/content/groups/snapshots-group/org/apache/openjpa/openjpa/2.3.0-SNAPSHOT/maven-metadata.xml
Downloading: https://oss.sonatype.org/content/repositories/snapshots/org/apache/openjpa/openjpa/2.3.0-SNAPSHOT/maven-metadata.xml
Downloaded: http://repository.apache.org/snapshots/org/apache/openjpa/openjpa/2.3.0-SNAPSHOT/maven-metadata.xml
(781 B at 6.6 KB/sec)
Downloading: https://repository.jboss.org/nexus/content/groups/public-jboss/org/apache/openjpa/openjpa/2.3.0-SNAPSHOT/maven-metadata.xml
Downloading: http://repository.apache.org/snapshots/org/apache/openjpa/openjpa/2.3.0-SNAPSHOT/maven-metadata.xml
Downloaded: http://repository.apache.org/content/groups/snapshots-group/org/apache/openjpa/openjpa/2.3.0-SNAPSHOT/maven-metadata.xml
(781 B at 5.8 KB/sec)
Downloading: http://repo.terracotta.org/maven2/org/apache/openjpa/openjpa/2.3.0-SNAPSHOT/maven-metadata.xml
Downloaded: https://repository.apache.org/content/repositories/snapshots/org/apache/openjpa/openjpa/2.3.0-SNAPSHOT/maven-metadata.xml
(781 B at 2.7 KB/sec)
Downloaded: http://repository.apache.org/snapshots/org/apache/openjpa/openjpa/2.3.0-SNAPSHOT/maven-metadata.xml
(781 B at 9.1 KB/sec)
Downloading: https://repository.apache.org/content/repositories/releases/org/apache/openjpa/openjpa/2.3.0-SNAPSHOT/openjpa-2.3.0-20130522.112625-116.pom
Downloading: https://repository.apache.org/content/repositories/snapshots/org/apache/openjpa/openjpa/2.3.0-SNAPSHOT/openjpa-2.3.0-20130522.112625-116.pom
Downloaded: https://repository.apache.org/content/repositories/snapshots/org/apache/openjpa/openjpa/2.3.0-SNAPSHOT/openjpa-2.3.0-20130522.112625-116.pom
(8 KB at 33.0 KB/sec)
Downloading: https://repository.apache.org/content/repositories/releases/org/apache/openjpa/openjpa-parent/2.3.0-SNAPSHOT/maven-metadata.xml
Downloading: http://repository.apache.org/snapshots/org/apache/openjpa/openjpa-parent/2.3.0-SNAPSHOT/maven-metadata.xml
Downloading: https://repository.apache.org/content/repositories/snapshots/org/apache/openjpa/openjpa-parent/2.3.0-SNAPSHOT/maven-metadata.xml
Downloading: https://repository.apache.org/content/repositories/orgapacheopenwebbeans-013/org/apache/openjpa/openjpa-parent/2.3.0-SNAPSHOT/maven-metadata.xml
Downloading: http://repository.apache.org/content/groups/snapshots-group/org/apache/openjpa/openjpa-parent/2.3.0-SNAPSHOT/maven-metadata.xml
Downloaded: http://repository.apache.org/snapshots/org/apache/openjpa/openjpa-parent/2.3.0-SNAPSHOT/maven-metadata.xml
(826 B at 9.2 KB/sec)
Downloading: https://oss.sonatype.org/content/repositories/snapshots/org/apache/openjpa/openjpa-parent/2.3.0-SNAPSHOT/maven-metadata.xml
Downloading: https://repository.jboss.org/nexus/content/groups/public-jboss/org/apache/openjpa/openjpa-parent/2.3.0-SNAPSHOT/maven-metadata.xml
Downloaded: http://repository.apache.org/content/groups/snapshots-group/org/apache/openjpa/openjpa-parent/2.3.0-SNAPSHOT/maven-metadata.xml
(826 B at 9.5 KB/sec)
Downloading: http://repository.apache.org/snapshots/org/apache/openjpa/openjpa-parent/2.3.0-SNAPSHOT/maven-metadata.xml
Downloading: http://repo.terracotta.org/maven2/org/apache/openjpa/openjpa-parent/2.3.0-SNAPSHOT/maven-metadata.xml
Downloaded: http://repository.apache.org/snapshots/org/apache/openjpa/openjpa-parent/2.3.0-SNAPSHOT/maven-metadata.xml
(826 B at 9.6 KB/sec)
Downloaded: https://repository.apache.org/content/repositories/snapshots/org/apache/openjpa/openjpa-parent/2.3.0-SNAPSHOT/maven-metadata.xml
(826 B at 3.6 KB/sec)
Downloading: https://repository.apache.org/content/repositories/snapshots/org/apache/openjpa/openjpa-parent/2.3.0-SNAPSHOT/openjpa-parent-2.3.0-20130522.112625-139.pom
Downloaded: https://repository.apache.org/content/repositories/snapshots/org/apache/openjpa/openjpa-parent/2.3.0-SNAPSHOT/openjpa-parent-2.3.0-20130522.112625-139.pom
(53 KB at 228.3 KB/sec)
Downloading: https://repository.apache.org/content/repositories/snapshots/org/apache/openejb/openejb-core/4.6.0-SNAPSHOT/openejb-core-4.6.0-20130523.040750-86.jar
Downloading: https://repository.apache.org/content/repositories/snapshots/org/apache/openejb/mbean-annotation-api/4.6.0-SNAPSHOT/mbean-annotation-api-4.6.0-20130523.040702-91.jar
Downloading: https://repository.apache.org/content/repositories/snapshots/org/apache/openejb/openejb-jpa-integration/4.6.0-SNAPSHOT/openejb-jpa-integration-4.6.0-20130523.040725-88.jar
Downloading: https://repository.apache.org/content/repositories/snapshots/org/apache/openejb/openejb-api/4.6.0-SNAPSHOT/openejb-api-4.6.0-20130523.040726-88.jar
Downloading: https://repository.apache.org/content/repositories/snapshots/org/apache/openejb/openejb-loader/4.6.0-SNAPSHOT/openejb-loader-4.6.0-20130523.040723-88.jar
Downloaded: https://repository.apache.org/content/repositories/snapshots/org/apache/openejb/mbean-annotation-api/4.6.0-SNAPSHOT/mbean-annotation-api-4.6.0-20130523.040702-91.jar
(10 KB at 48.7 KB/sec)
Downloading: https://repository.apache.org/content/repositories/snapshots/org/apache/openejb/openejb-javaagent/4.6.0-SNAPSHOT/openejb-javaagent-4.6.0-20130523.040726-88.jar
Downloaded: https://repository.apache.org/content/repositories/snapshots/org/apache/openejb/openejb-api/4.6.0-SNAPSHOT/openejb-api-4.6.0-20130523.040726-88.jar
(13 KB at 46.4 KB/sec)
Downloading: https://repository.apache.org/content/repositories/snapshots/org/apache/openejb/openejb-jee/4.6.0-SNAPSHOT/openejb-jee-4.6.0-20130523.040731-88.jar
Downloaded: https://repository.apache.org/content/repositories/snapshots/org/apache/openejb/openejb-jpa-integration/4.6.0-SNAPSHOT/openejb-jpa-integration-4.6.0-20130523.040725-88.jar
(19 KB at 52.0 KB/sec)
Downloading: https://repository.apache.org/content/repositories/snapshots/org/apache/openejb/openejb-jee-accessors/4.6.0-SNAPSHOT/openejb-jee-accessors-4.6.0-20130523.040734-87.jar
Downloaded: https://repository.apache.org/content/repositories/snapshots/org/apache/openejb/openejb-javaagent/4.6.0-SNAPSHOT/openejb-javaagent-4.6.0-20130523.040726-88.jar
(14 KB at 77.6 KB/sec)
Downloading: https://repository.apache.org/content/repositories/snapshots/org/apache/xbean/xbean-asm-shaded/3.14-SNAPSHOT/xbean-asm-shaded-3.14-20130517.215924-15.jar
Downloaded: https://repository.apache.org/content/repositories/snapshots/org/apache/openejb/openejb-loader/4.6.0-SNAPSHOT/openejb-loader-4.6.0-20130523.040723-88.jar
(83 KB at 140.2 KB/sec)
Downloading: https://repository.apache.org/content/repositories/snapshots/org/apache/xbean/xbean-finder-shaded/3.14-SNAPSHOT/xbean-finder-shaded-3.14-20130517.215924-15.jar
Downloaded: https://repository.apache.org/content/repositories/snapshots/org/apache/xbean/xbean-asm-shaded/3.14-SNAPSHOT/xbean-asm-shaded-3.14-20130517.215924-15.jar
(120 KB at 268.5 KB/sec)
Downloading: https://repository.apache.org/content/repositories/snapshots/org/apache/xbean/xbean-reflect/3.14-SNAPSHOT/xbean-reflect-3.14-20130517.215924-15.jar
Downloaded: https://repository.apache.org/content/repositories/snapshots/org/apache/openejb/openejb-jee/4.6.0-SNAPSHOT/openejb-jee-4.6.0-20130523.040731-88.jar
(1179 KB at 1487.9 KB/sec)
Downloading: https://repository.apache.org/content/repositories/snapshots/org/apache/xbean/xbean-naming/3.14-SNAPSHOT/xbean-naming-3.14-20130517.215924-15.jar
Downloaded: https://repository.apache.org/content/repositories/snapshots/org/apache/xbean/xbean-finder-shaded/3.14-SNAPSHOT/xbean-finder-shaded-3.14-20130517.215924-15.jar
(155 KB at 296.5 KB/sec)
Downloading: https://repository.apache.org/content/repositories/snapshots/org/apache/xbean/xbean-bundleutils/3.14-SNAPSHOT/xbean-bundleutils-3.14-20130517.215924-15.jar
Downloaded: https://repository.apache.org/content/repositories/snapshots/org/apache/xbean/xbean-reflect/3.14-SNAPSHOT/xbean-reflect-3.14-20130517.215924-15.jar
(145 KB at 443.9 KB/sec)
Downloading: https://repository.apache.org/content/repositories/snapshots/org/apache/openjpa/openjpa/2.3.0-SNAPSHOT/openjpa-2.3.0-20130522.112625-116.jar
Downloaded: https://repository.apache.org/content/repositories/snapshots/org/apache/openejb/openejb-jee-accessors/4.6.0-SNAPSHOT/openejb-jee-accessors-4.6.0-20130523.040734-87.jar
(822 KB at 930.2 KB/sec)
Downloaded: https://repository.apache.org/content/repositories/snapshots/org/apache/xbean/xbean-naming/3.14-SNAPSHOT/xbean-naming-3.14-20130517.215924-15.jar
(55 KB at 209.0 KB/sec)
Downloaded: https://repository.apache.org/content/repositories/snapshots/org/apache/openejb/openejb-core/4.6.0-SNAPSHOT/openejb-core-4.6.0-20130523.040750-86.jar
(2613 KB at 1932.6 KB/sec)
Downloaded: https://repository.apache.org/content/repositories/snapshots/org/apache/xbean/xbean-bundleutils/3.14-SNAPSHOT/xbean-bundleutils-3.14-20130517.215924-15.jar
(71 KB at 280.3 KB/sec)
Downloaded: https://repository.apache.org/content/repositories/snapshots/org/apache/openjpa/openjpa/2.3.0-SNAPSHOT/openjpa-2.3.0-20130522.112625-116.jar
(4572 KB at 1256.6 KB/sec)
Downloading: https://repository.apache.org/content/repositories/releases/org/apache/openwebbeans/openwebbeans-ejb/1.2.0-SNAPSHOT/openwebbeans-ejb-1.2.0-SNAPSHOT.jar
Downloading: https://repository.apache.org/content/repositories/releases/org/apache/openwebbeans/openwebbeans-ee/1.2.0-SNAPSHOT/openwebbeans-ee-1.2.0-SNAPSHOT.jar
Downloading: https://repository.apache.org/content/repositories/releases/org/apache/openwebbeans/openwebbeans-ee-common/1.2.0-SNAPSHOT/openwebbeans-ee-common-1.2.0-SNAPSHOT.jar
Downloading: https://repository.apache.org/content/repositories/snapshots/org/apache/openwebbeans/openwebbeans-ejb/1.2.0-SNAPSHOT/openwebbeans-ejb-1.2.0-SNAPSHOT.jar
Downloading: https://repository.apache.org/content/repositories/snapshots/org/apache/openwebbeans/openwebbeans-ee/1.2.0-SNAPSHOT/openwebbeans-ee-1.2.0-SNAPSHOT.jar
Downloading: https://repository.apache.org/content/repositories/snapshots/org/apache/openwebbeans/openwebbeans-ee-common/1.2.0-SNAPSHOT/openwebbeans-ee-common-1.2.0-SNAPSHOT.jar
Downloading: http://repository.apache.org/snapshots/org/apache/openwebbeans/openwebbeans-ejb/1.2.0-SNAPSHOT/openwebbeans-ejb-1.2.0-SNAPSHOT.jar
Downloading: http://repository.apache.org/snapshots/org/apache/openwebbeans/openwebbeans-ee/1.2.0-SNAPSHOT/openwebbeans-ee-1.2.0-SNAPSHOT.jar
Downloading: http://repository.apache.org/snapshots/org/apache/openwebbeans/openwebbeans-ee-common/1.2.0-SNAPSHOT/openwebbeans-ee-common-1.2.0-SNAPSHOT.jar
Downloading: https://repository.apache.org/content/repositories/orgapacheopenwebbeans-013/org/apache/openwebbeans/openwebbeans-ejb/1.2.0-SNAPSHOT/openwebbeans-ejb-1.2.0-SNAPSHOT.jar
Downloading: https://repository.apache.org/content/repositories/orgapacheopenwebbeans-013/org/apache/openwebbeans/openwebbeans-ee/1.2.0-SNAPSHOT/openwebbeans-ee-1.2.0-SNAPSHOT.jar
Downloading: https://repository.apache.org/content/repositories/orgapacheopenwebbeans-013/org/apache/openwebbeans/openwebbeans-ee-common/1.2.0-SNAPSHOT/openwebbeans-ee-common-1.2.0-SNAPSHOT.jar
Downloading: http://repository.apache.org/content/groups/snapshots-group/org/apache/openwebbeans/openwebbeans-ejb/1.2.0-SNAPSHOT/openwebbeans-ejb-1.2.0-SNAPSHOT.jar
Downloading: http://repository.apache.org/content/groups/snapshots-group/org/apache/openwebbeans/openwebbeans-ee/1.2.0-SNAPSHOT/openwebbeans-ee-1.2.0-SNAPSHOT.jar
Downloading: http://repository.apache.org/content/groups/snapshots-group/org/apache/openwebbeans/openwebbeans-ee-common/1.2.0-SNAPSHOT/openwebbeans-ee-common-1.2.0-SNAPSHOT.jar
Downloading: https://oss.sonatype.org/content/repositories/snapshots/org/apache/openwebbeans/openwebbeans-ejb/1.2.0-SNAPSHOT/openwebbeans-ejb-1.2.0-SNAPSHOT.jar
Downloading: https://oss.sonatype.org/content/repositories/snapshots/org/apache/openwebbeans/openwebbeans-ee/1.2.0-SNAPSHOT/openwebbeans-ee-1.2.0-SNAPSHOT.jar
Downloading: https://oss.sonatype.org/content/repositories/snapshots/org/apache/openwebbeans/openwebbeans-ee-common/1.2.0-SNAPSHOT/openwebbeans-ee-common-1.2.0-SNAPSHOT.jar
Downloading: https://repository.jboss.org/nexus/content/groups/public-jboss/org/apache/openwebbeans/openwebbeans-ejb/1.2.0-SNAPSHOT/openwebbeans-ejb-1.2.0-SNAPSHOT.jar
Downloading: https://repository.jboss.org/nexus/content/groups/public-jboss/org/apache/openwebbeans/openwebbeans-ee/1.2.0-SNAPSHOT/openwebbeans-ee-1.2.0-SNAPSHOT.jar
Downloading: https://repository.jboss.org/nexus/content/groups/public-jboss/org/apache/openwebbeans/openwebbeans-ee-common/1.2.0-SNAPSHOT/openwebbeans-ee-common-1.2.0-SNAPSHOT.jar
Downloading: http://repository.apache.org/snapshots/org/apache/openwebbeans/openwebbeans-ejb/1.2.0-SNAPSHOT/openwebbeans-ejb-1.2.0-SNAPSHOT.jar
Downloading: http://repository.apache.org/snapshots/org/apache/openwebbeans/openwebbeans-ee/1.2.0-SNAPSHOT/openwebbeans-ee-1.2.0-SNAPSHOT.jar
Downloading: http://repository.apache.org/snapshots/org/apache/openwebbeans/openwebbeans-ee-common/1.2.0-SNAPSHOT/openwebbeans-ee-common-1.2.0-SNAPSHOT.jar
Downloading: http://repo.terracotta.org/maven2/org/apache/openwebbeans/openwebbeans-ejb/1.2.0-SNAPSHOT/openwebbeans-ejb-1.2.0-SNAPSHOT.jar
Downloading: http://repo.terracotta.org/maven2/org/apache/openwebbeans/openwebbeans-ee/1.2.0-SNAPSHOT/openwebbeans-ee-1.2.0-SNAPSHOT.jar
Downloading: http://repo.terracotta.org/maven2/org/apache/openwebbeans/openwebbeans-ee-common/1.2.0-SNAPSHOT/openwebbeans-ee-common-1.2.0-SNAPSHOT.jar
[INFO] ------------------------------------------------------------------------
[INFO] Reactor Summary:
[INFO] 
[INFO] Apache DeltaSpike ................................. SUCCESS [17.495s]
[INFO] Apache DeltaSpike CheckStyle-rules ................ SUCCESS [2.698s]
[INFO] Apache DeltaSpike Parent .......................... SUCCESS [4.229s]
[INFO] Apache DeltaSpike Test-Utils ...................... SUCCESS [5.141s]
[INFO] Apache DeltaSpike Code Parent ..................... SUCCESS [1:04.329s]
[INFO] Apache DeltaSpike Core ............................ SUCCESS [4.023s]
[INFO] Apache DeltaSpike Core-API ........................ SUCCESS [20.780s]
[INFO] Apache DeltaSpike Core-Implementation ............. SUCCESS [1:05.732s]
[INFO] Apache DeltaSpike ContainerControl parent ......... SUCCESS [1.773s]
[INFO] Apache DeltaSpike CDI ContainerControl API ........ SUCCESS [2.710s]
[INFO] Apache DeltaSpike CDI ContainerControl TCK ........ SUCCESS [3.407s]
[INFO] Apache DeltaSpike CDI OWB-ContainerControl ........ SUCCESS [4.840s]
[INFO] Apache DeltaSpike CDI Weld-ContainerControl ....... SUCCESS [4.611s]
[INFO] Apache DeltaSpike CDI OpenEJB-ContainerControl .... FAILURE [26.679s]
[INFO] Apache DeltaSpike Modules ......................... SKIPPED
[INFO] Apache DeltaSpike Security-Module ................. SKIPPED
[INFO] Apache DeltaSpike Security-Module API ............. SKIPPED
[INFO] Apache DeltaSpike Security-Module Impl ............ SKIPPED
[INFO] Apache DeltaSpike JPA-Module ...................... SKIPPED
[INFO] Apache DeltaSpike JPA-Module API .................. SKIPPED
[INFO] Apache DeltaSpike JPA-Module Impl ................. SKIPPED
[INFO] Apache DeltaSpike JSF-Module ...................... SKIPPED
[INFO] Apache DeltaSpike JSF-Module API .................. SKIPPED
[INFO] Apache DeltaSpike JSF-Module Impl ................. SKIPPED
[INFO] Apache DeltaSpike Partial-Bean-Module ............. SKIPPED
[INFO] Apache DeltaSpike Partial-Bean-Module API ......... SKIPPED
[INFO] Apache DeltaSpike Partial-Bean-Module Impl ........ SKIPPED
[INFO] Apache DeltaSpike Examples ........................ SKIPPED
[INFO] Apache DeltaSpike Java-SE Examples ................ SKIPPED
[INFO] Apache DeltaSpike JSF Examples .................... SKIPPED
[INFO] ------------------------------------------------------------------------
[INFO] BUILD FAILURE
[INFO] ------------------------------------------------------------------------
[INFO] Total time: 3:53.745s
[INFO] Finished at: Thu May 23 08:29:48 UTC 2013
[INFO] Final Memory: 56M/377M
[INFO] ------------------------------------------------------------------------
[JENKINS] Archiving <https://builds.apache.org/job/DeltaSpike_TomEE_latest/ws/deltaspike/pom.xml>
to /home/hudson/hudson/jobs/DeltaSpike_TomEE_latest/modules/org.apache.deltaspike$deltaspike-project/builds/2013-05-23_08-25-41/archive/org.apache.deltaspike/deltaspike-project/0.4-incubating-SNAPSHOT/deltaspike-project-0.4-incubating-SNAPSHOT.pom
[JENKINS] Archiving <https://builds.apache.org/job/DeltaSpike_TomEE_latest/ws/deltaspike/modules/partial-bean/impl/pom.xml>
to /home/hudson/hudson/jobs/DeltaSpike_TomEE_latest/modules/org.apache.deltaspike.modules$deltaspike-partial-bean-module-impl/builds/2013-05-23_08-25-41/archive/org.apache.deltaspike.modules/deltaspike-partial-bean-module-impl/0.4-incubating-SNAPSHOT/deltaspike-partial-bean-module-impl-0.4-incubating-SNAPSHOT.pom
[JENKINS] Archiving <https://builds.apache.org/job/DeltaSpike_TomEE_latest/ws/deltaspike/cdictrl/impl-openejb/pom.xml>
to /home/hudson/hudson/jobs/DeltaSpike_TomEE_latest/modules/org.apache.deltaspike.cdictrl$deltaspike-cdictrl-openejb/builds/2013-05-23_08-25-41/archive/org.apache.deltaspike.cdictrl/deltaspike-cdictrl-openejb/0.4-incubating-SNAPSHOT/deltaspike-cdictrl-openejb-0.4-incubating-SNAPSHOT.pom
[JENKINS] Archiving <https://builds.apache.org/job/DeltaSpike_TomEE_latest/ws/deltaspike/cdictrl/api/pom.xml>
to /home/hudson/hudson/jobs/DeltaSpike_TomEE_latest/modules/org.apache.deltaspike.cdictrl$deltaspike-cdictrl-api/builds/2013-05-23_08-25-41/archive/org.apache.deltaspike.cdictrl/deltaspike-cdictrl-api/0.4-incubating-SNAPSHOT/deltaspike-cdictrl-api-0.4-incubating-SNAPSHOT.pom
[JENKINS] Archiving <https://builds.apache.org/job/DeltaSpike_TomEE_latest/ws/deltaspike/cdictrl/api/target/deltaspike-cdictrl-api-0.4-incubating-SNAPSHOT.jar>
to /home/hudson/hudson/jobs/DeltaSpike_TomEE_latest/modules/org.apache.deltaspike.cdictrl$deltaspike-cdictrl-api/builds/2013-05-23_08-25-41/archive/org.apache.deltaspike.cdictrl/deltaspike-cdictrl-api/0.4-incubating-SNAPSHOT/deltaspike-cdictrl-api-0.4-incubating-SNAPSHOT.jar
[JENKINS] Archiving <https://builds.apache.org/job/DeltaSpike_TomEE_latest/ws/deltaspike/cdictrl/api/target/deltaspike-cdictrl-api-0.4-incubating-SNAPSHOT-sources.jar>
to /home/hudson/hudson/jobs/DeltaSpike_TomEE_latest/modules/org.apache.deltaspike.cdictrl$deltaspike-cdictrl-api/builds/2013-05-23_08-25-41/archive/org.apache.deltaspike.cdictrl/deltaspike-cdictrl-api/0.4-incubating-SNAPSHOT/deltaspike-cdictrl-api-0.4-incubating-SNAPSHOT-sources.jar
[JENKINS] Archiving <https://builds.apache.org/job/DeltaSpike_TomEE_latest/ws/deltaspike/test-utils/pom.xml>
to /home/hudson/hudson/jobs/DeltaSpike_TomEE_latest/modules/org.apache.deltaspike.test$test-utils/builds/2013-05-23_08-25-41/archive/org.apache.deltaspike.test/test-utils/0.4-incubating-SNAPSHOT/test-utils-0.4-incubating-SNAPSHOT.pom
[JENKINS] Archiving <https://builds.apache.org/job/DeltaSpike_TomEE_latest/ws/deltaspike/test-utils/target/test-utils-0.4-incubating-SNAPSHOT.jar>
to /home/hudson/hudson/jobs/DeltaSpike_TomEE_latest/modules/org.apache.deltaspike.test$test-utils/builds/2013-05-23_08-25-41/archive/org.apache.deltaspike.test/test-utils/0.4-incubating-SNAPSHOT/test-utils-0.4-incubating-SNAPSHOT.jar
[JENKINS] Archiving <https://builds.apache.org/job/DeltaSpike_TomEE_latest/ws/deltaspike/test-utils/target/test-utils-0.4-incubating-SNAPSHOT-sources.jar>
to /home/hudson/hudson/jobs/DeltaSpike_TomEE_latest/modules/org.apache.deltaspike.test$test-utils/builds/2013-05-23_08-25-41/archive/org.apache.deltaspike.test/test-utils/0.4-incubating-SNAPSHOT/test-utils-0.4-incubating-SNAPSHOT-sources.jar
[JENKINS] Archiving <https://builds.apache.org/job/DeltaSpike_TomEE_latest/ws/deltaspike/core/impl/pom.xml>
to /home/hudson/hudson/jobs/DeltaSpike_TomEE_latest/modules/org.apache.deltaspike.core$deltaspike-core-impl/builds/2013-05-23_08-25-41/archive/org.apache.deltaspike.core/deltaspike-core-impl/0.4-incubating-SNAPSHOT/deltaspike-core-impl-0.4-incubating-SNAPSHOT.pom
[JENKINS] Archiving <https://builds.apache.org/job/DeltaSpike_TomEE_latest/ws/deltaspike/core/impl/target/deltaspike-core-impl-0.4-incubating-SNAPSHOT.jar>
to /home/hudson/hudson/jobs/DeltaSpike_TomEE_latest/modules/org.apache.deltaspike.core$deltaspike-core-impl/builds/2013-05-23_08-25-41/archive/org.apache.deltaspike.core/deltaspike-core-impl/0.4-incubating-SNAPSHOT/deltaspike-core-impl-0.4-incubating-SNAPSHOT.jar
[JENKINS] Archiving <https://builds.apache.org/job/DeltaSpike_TomEE_latest/ws/deltaspike/core/impl/target/deltaspike-core-impl-0.4-incubating-SNAPSHOT-tests.jar>
to /home/hudson/hudson/jobs/DeltaSpike_TomEE_latest/modules/org.apache.deltaspike.core$deltaspike-core-impl/builds/2013-05-23_08-25-41/archive/org.apache.deltaspike.core/deltaspike-core-impl/0.4-incubating-SNAPSHOT/deltaspike-core-impl-0.4-incubating-SNAPSHOT-tests.jar
[JENKINS] Archiving <https://builds.apache.org/job/DeltaSpike_TomEE_latest/ws/deltaspike/core/impl/target/deltaspike-core-impl-0.4-incubating-SNAPSHOT-sources.jar>
to /home/hudson/hudson/jobs/DeltaSpike_TomEE_latest/modules/org.apache.deltaspike.core$deltaspike-core-impl/builds/2013-05-23_08-25-41/archive/org.apache.deltaspike.core/deltaspike-core-impl/0.4-incubating-SNAPSHOT/deltaspike-core-impl-0.4-incubating-SNAPSHOT-sources.jar
[JENKINS] Archiving <https://builds.apache.org/job/DeltaSpike_TomEE_latest/ws/deltaspike/modules/jsf/impl/pom.xml>
to /home/hudson/hudson/jobs/DeltaSpike_TomEE_latest/modules/org.apache.deltaspike.modules$deltaspike-jsf-module-impl/builds/2013-05-23_08-25-41/archive/org.apache.deltaspike.modules/deltaspike-jsf-module-impl/0.4-incubating-SNAPSHOT/deltaspike-jsf-module-impl-0.4-incubating-SNAPSHOT.pom
[JENKINS] Archiving <https://builds.apache.org/job/DeltaSpike_TomEE_latest/ws/deltaspike/modules/partial-bean/pom.xml>
to /home/hudson/hudson/jobs/DeltaSpike_TomEE_latest/modules/org.apache.deltaspike.modules$partial-bean-module-project/builds/2013-05-23_08-25-41/archive/org.apache.deltaspike.modules/partial-bean-module-project/0.4-incubating-SNAPSHOT/partial-bean-module-project-0.4-incubating-SNAPSHOT.pom
[JENKINS] Archiving <https://builds.apache.org/job/DeltaSpike_TomEE_latest/ws/deltaspike/cdictrl/tck/pom.xml>
to /home/hudson/hudson/jobs/DeltaSpike_TomEE_latest/modules/org.apache.deltaspike.test$deltaspike-cdictrl-tck/builds/2013-05-23_08-25-41/archive/org.apache.deltaspike.test/deltaspike-cdictrl-tck/0.4-incubating-SNAPSHOT/deltaspike-cdictrl-tck-0.4-incubating-SNAPSHOT.pom
[JENKINS] Archiving <https://builds.apache.org/job/DeltaSpike_TomEE_latest/ws/deltaspike/cdictrl/tck/target/deltaspike-cdictrl-tck-0.4-incubating-SNAPSHOT.jar>
to /home/hudson/hudson/jobs/DeltaSpike_TomEE_latest/modules/org.apache.deltaspike.test$deltaspike-cdictrl-tck/builds/2013-05-23_08-25-41/archive/org.apache.deltaspike.test/deltaspike-cdictrl-tck/0.4-incubating-SNAPSHOT/deltaspike-cdictrl-tck-0.4-incubating-SNAPSHOT.jar
[JENKINS] Archiving <https://builds.apache.org/job/DeltaSpike_TomEE_latest/ws/deltaspike/cdictrl/tck/target/deltaspike-cdictrl-tck-0.4-incubating-SNAPSHOT-sources.jar>
to /home/hudson/hudson/jobs/DeltaSpike_TomEE_latest/modules/org.apache.deltaspike.test$deltaspike-cdictrl-tck/builds/2013-05-23_08-25-41/archive/org.apache.deltaspike.test/deltaspike-cdictrl-tck/0.4-incubating-SNAPSHOT/deltaspike-cdictrl-tck-0.4-incubating-SNAPSHOT-sources.jar
[JENKINS] Archiving <https://builds.apache.org/job/DeltaSpike_TomEE_latest/ws/deltaspike/core/pom.xml>
to /home/hudson/hudson/jobs/DeltaSpike_TomEE_latest/modules/org.apache.deltaspike.core$core-project/builds/2013-05-23_08-25-41/archive/org.apache.deltaspike.core/core-project/0.4-incubating-SNAPSHOT/core-project-0.4-incubating-SNAPSHOT.pom
[JENKINS] Archiving <https://builds.apache.org/job/DeltaSpike_TomEE_latest/ws/deltaspike/core/target/core-project-0.4-incubating-SNAPSHOT-tests.jar>
to /home/hudson/hudson/jobs/DeltaSpike_TomEE_latest/modules/org.apache.deltaspike.core$core-project/builds/2013-05-23_08-25-41/archive/org.apache.deltaspike.core/core-project/0.4-incubating-SNAPSHOT/core-project-0.4-incubating-SNAPSHOT-tests.jar
[JENKINS] Archiving <https://builds.apache.org/job/DeltaSpike_TomEE_latest/ws/deltaspike/checkstyle-rules/pom.xml>
to /home/hudson/hudson/jobs/DeltaSpike_TomEE_latest/modules/org.apache.deltaspike$checkstyle-rules/builds/2013-05-23_08-25-41/archive/org.apache.deltaspike/checkstyle-rules/0.4-incubating-SNAPSHOT/checkstyle-rules-0.4-incubating-SNAPSHOT.pom
[JENKINS] Archiving <https://builds.apache.org/job/DeltaSpike_TomEE_latest/ws/deltaspike/checkstyle-rules/target/checkstyle-rules-0.4-incubating-SNAPSHOT.jar>
to /home/hudson/hudson/jobs/DeltaSpike_TomEE_latest/modules/org.apache.deltaspike$checkstyle-rules/builds/2013-05-23_08-25-41/archive/org.apache.deltaspike/checkstyle-rules/0.4-incubating-SNAPSHOT/checkstyle-rules-0.4-incubating-SNAPSHOT.jar
[JENKINS] Archiving <https://builds.apache.org/job/DeltaSpike_TomEE_latest/ws/deltaspike/examples/jsf-examples/pom.xml>
to /home/hudson/hudson/jobs/DeltaSpike_TomEE_latest/modules/org.apache.deltaspike.examples$deltaspike-jsf-example/builds/2013-05-23_08-25-41/archive/org.apache.deltaspike.examples/deltaspike-jsf-example/0.4-incubating-SNAPSHOT/deltaspike-jsf-example-0.4-incubating-SNAPSHOT.pom
[JENKINS] Archiving <https://builds.apache.org/job/DeltaSpike_TomEE_latest/ws/deltaspike/modules/security/api/pom.xml>
to /home/hudson/hudson/jobs/DeltaSpike_TomEE_latest/modules/org.apache.deltaspike.modules$deltaspike-security-module-api/builds/2013-05-23_08-25-41/archive/org.apache.deltaspike.modules/deltaspike-security-module-api/0.4-incubating-SNAPSHOT/deltaspike-security-module-api-0.4-incubating-SNAPSHOT.pom
[JENKINS] Archiving <https://builds.apache.org/job/DeltaSpike_TomEE_latest/ws/deltaspike/modules/jpa/pom.xml>
to /home/hudson/hudson/jobs/DeltaSpike_TomEE_latest/modules/org.apache.deltaspike.modules$jpa-module-project/builds/2013-05-23_08-25-41/archive/org.apache.deltaspike.modules/jpa-module-project/0.4-incubating-SNAPSHOT/jpa-module-project-0.4-incubating-SNAPSHOT.pom
[JENKINS] Archiving <https://builds.apache.org/job/DeltaSpike_TomEE_latest/ws/deltaspike/parent/pom.xml>
to /home/hudson/hudson/jobs/DeltaSpike_TomEE_latest/modules/org.apache.deltaspike$parent/builds/2013-05-23_08-25-41/archive/org.apache.deltaspike/parent/0.4-incubating-SNAPSHOT/parent-0.4-incubating-SNAPSHOT.pom
[JENKINS] Archiving <https://builds.apache.org/job/DeltaSpike_TomEE_latest/ws/deltaspike/cdictrl/impl-weld/pom.xml>
to /home/hudson/hudson/jobs/DeltaSpike_TomEE_latest/modules/org.apache.deltaspike.cdictrl$deltaspike-cdictrl-weld/builds/2013-05-23_08-25-41/archive/org.apache.deltaspike.cdictrl/deltaspike-cdictrl-weld/0.4-incubating-SNAPSHOT/deltaspike-cdictrl-weld-0.4-incubating-SNAPSHOT.pom
[JENKINS] Archiving <https://builds.apache.org/job/DeltaSpike_TomEE_latest/ws/deltaspike/cdictrl/impl-weld/target/deltaspike-cdictrl-weld-0.4-incubating-SNAPSHOT.jar>
to /home/hudson/hudson/jobs/DeltaSpike_TomEE_latest/modules/org.apache.deltaspike.cdictrl$deltaspike-cdictrl-weld/builds/2013-05-23_08-25-41/archive/org.apache.deltaspike.cdictrl/deltaspike-cdictrl-weld/0.4-incubating-SNAPSHOT/deltaspike-cdictrl-weld-0.4-incubating-SNAPSHOT.jar
[JENKINS] Archiving <https://builds.apache.org/job/DeltaSpike_TomEE_latest/ws/deltaspike/cdictrl/impl-weld/target/deltaspike-cdictrl-weld-0.4-incubating-SNAPSHOT-sources.jar>
to /home/hudson/hudson/jobs/DeltaSpike_TomEE_latest/modules/org.apache.deltaspike.cdictrl$deltaspike-cdictrl-weld/builds/2013-05-23_08-25-41/archive/org.apache.deltaspike.cdictrl/deltaspike-cdictrl-weld/0.4-incubating-SNAPSHOT/deltaspike-cdictrl-weld-0.4-incubating-SNAPSHOT-sources.jar
[JENKINS] Archiving <https://builds.apache.org/job/DeltaSpike_TomEE_latest/ws/deltaspike/examples/jse-examples/pom.xml>
to /home/hudson/hudson/jobs/DeltaSpike_TomEE_latest/modules/org.apache.deltaspike.examples$deltaspike-jse-example/builds/2013-05-23_08-25-41/archive/org.apache.deltaspike.examples/deltaspike-jse-example/0.4-incubating-SNAPSHOT/deltaspike-jse-example-0.4-incubating-SNAPSHOT.pom
[JENKINS] Archiving <https://builds.apache.org/job/DeltaSpike_TomEE_latest/ws/deltaspike/modules/partial-bean/api/pom.xml>
to /home/hudson/hudson/jobs/DeltaSpike_TomEE_latest/modules/org.apache.deltaspike.modules$deltaspike-partial-bean-module-api/builds/2013-05-23_08-25-41/archive/org.apache.deltaspike.modules/deltaspike-partial-bean-module-api/0.4-incubating-SNAPSHOT/deltaspike-partial-bean-module-api-0.4-incubating-SNAPSHOT.pom
[JENKINS] Archiving <https://builds.apache.org/job/DeltaSpike_TomEE_latest/ws/deltaspike/modules/security/pom.xml>
to /home/hudson/hudson/jobs/DeltaSpike_TomEE_latest/modules/org.apache.deltaspike.modules$security-module-project/builds/2013-05-23_08-25-41/archive/org.apache.deltaspike.modules/security-module-project/0.4-incubating-SNAPSHOT/security-module-project-0.4-incubating-SNAPSHOT.pom
[JENKINS] Archiving <https://builds.apache.org/job/DeltaSpike_TomEE_latest/ws/deltaspike/cdictrl/impl-owb/pom.xml>
to /home/hudson/hudson/jobs/DeltaSpike_TomEE_latest/modules/org.apache.deltaspike.cdictrl$deltaspike-cdictrl-owb/builds/2013-05-23_08-25-41/archive/org.apache.deltaspike.cdictrl/deltaspike-cdictrl-owb/0.4-incubating-SNAPSHOT/deltaspike-cdictrl-owb-0.4-incubating-SNAPSHOT.pom
[JENKINS] Archiving <https://builds.apache.org/job/DeltaSpike_TomEE_latest/ws/deltaspike/cdictrl/impl-owb/target/deltaspike-cdictrl-owb-0.4-incubating-SNAPSHOT.jar>
to /home/hudson/hudson/jobs/DeltaSpike_TomEE_latest/modules/org.apache.deltaspike.cdictrl$deltaspike-cdictrl-owb/builds/2013-05-23_08-25-41/archive/org.apache.deltaspike.cdictrl/deltaspike-cdictrl-owb/0.4-incubating-SNAPSHOT/deltaspike-cdictrl-owb-0.4-incubating-SNAPSHOT.jar
[JENKINS] Archiving <https://builds.apache.org/job/DeltaSpike_TomEE_latest/ws/deltaspike/cdictrl/impl-owb/target/deltaspike-cdictrl-owb-0.4-incubating-SNAPSHOT-sources.jar>
to /home/hudson/hudson/jobs/DeltaSpike_TomEE_latest/modules/org.apache.deltaspike.cdictrl$deltaspike-cdictrl-owb/builds/2013-05-23_08-25-41/archive/org.apache.deltaspike.cdictrl/deltaspike-cdictrl-owb/0.4-incubating-SNAPSHOT/deltaspike-cdictrl-owb-0.4-incubating-SNAPSHOT-sources.jar
[JENKINS] Archiving <https://builds.apache.org/job/DeltaSpike_TomEE_latest/ws/deltaspike/modules/jsf/pom.xml>
to /home/hudson/hudson/jobs/DeltaSpike_TomEE_latest/modules/org.apache.deltaspike.modules$jsf-module-project/builds/2013-05-23_08-25-41/archive/org.apache.deltaspike.modules/jsf-module-project/0.4-incubating-SNAPSHOT/jsf-module-project-0.4-incubating-SNAPSHOT.pom
[JENKINS] Archiving <https://builds.apache.org/job/DeltaSpike_TomEE_latest/ws/deltaspike/core/api/pom.xml>
to /home/hudson/hudson/jobs/DeltaSpike_TomEE_latest/modules/org.apache.deltaspike.core$deltaspike-core-api/builds/2013-05-23_08-25-41/archive/org.apache.deltaspike.core/deltaspike-core-api/0.4-incubating-SNAPSHOT/deltaspike-core-api-0.4-incubating-SNAPSHOT.pom
[JENKINS] Archiving <https://builds.apache.org/job/DeltaSpike_TomEE_latest/ws/deltaspike/core/api/target/deltaspike-core-api-0.4-incubating-SNAPSHOT.jar>
to /home/hudson/hudson/jobs/DeltaSpike_TomEE_latest/modules/org.apache.deltaspike.core$deltaspike-core-api/builds/2013-05-23_08-25-41/archive/org.apache.deltaspike.core/deltaspike-core-api/0.4-incubating-SNAPSHOT/deltaspike-core-api-0.4-incubating-SNAPSHOT.jar
[JENKINS] Archiving <https://builds.apache.org/job/DeltaSpike_TomEE_latest/ws/deltaspike/core/api/target/deltaspike-core-api-0.4-incubating-SNAPSHOT-tests.jar>
to /home/hudson/hudson/jobs/DeltaSpike_TomEE_latest/modules/org.apache.deltaspike.core$deltaspike-core-api/builds/2013-05-23_08-25-41/archive/org.apache.deltaspike.core/deltaspike-core-api/0.4-incubating-SNAPSHOT/deltaspike-core-api-0.4-incubating-SNAPSHOT-tests.jar
[JENKINS] Archiving <https://builds.apache.org/job/DeltaSpike_TomEE_latest/ws/deltaspike/core/api/target/deltaspike-core-api-0.4-incubating-SNAPSHOT-sources.jar>
to /home/hudson/hudson/jobs/DeltaSpike_TomEE_latest/modules/org.apache.deltaspike.core$deltaspike-core-api/builds/2013-05-23_08-25-41/archive/org.apache.deltaspike.core/deltaspike-core-api/0.4-incubating-SNAPSHOT/deltaspike-core-api-0.4-incubating-SNAPSHOT-sources.jar
[JENKINS] Archiving <https://builds.apache.org/job/DeltaSpike_TomEE_latest/ws/deltaspike/parent/code/pom.xml>
to /home/hudson/hudson/jobs/DeltaSpike_TomEE_latest/modules/org.apache.deltaspike$parent-code/builds/2013-05-23_08-25-41/archive/org.apache.deltaspike/parent-code/0.4-incubating-SNAPSHOT/parent-code-0.4-incubating-SNAPSHOT.pom
[JENKINS] Archiving <https://builds.apache.org/job/DeltaSpike_TomEE_latest/ws/deltaspike/parent/code/target/parent-code-0.4-incubating-SNAPSHOT-tests.jar>
to /home/hudson/hudson/jobs/DeltaSpike_TomEE_latest/modules/org.apache.deltaspike$parent-code/builds/2013-05-23_08-25-41/archive/org.apache.deltaspike/parent-code/0.4-incubating-SNAPSHOT/parent-code-0.4-incubating-SNAPSHOT-tests.jar
[JENKINS] Archiving <https://builds.apache.org/job/DeltaSpike_TomEE_latest/ws/deltaspike/modules/pom.xml>
to /home/hudson/hudson/jobs/DeltaSpike_TomEE_latest/modules/org.apache.deltaspike.modules$modules-project/builds/2013-05-23_08-25-41/archive/org.apache.deltaspike.modules/modules-project/0.4-incubating-SNAPSHOT/modules-project-0.4-incubating-SNAPSHOT.pom
[JENKINS] Archiving <https://builds.apache.org/job/DeltaSpike_TomEE_latest/ws/deltaspike/modules/jpa/impl/pom.xml>
to /home/hudson/hudson/jobs/DeltaSpike_TomEE_latest/modules/org.apache.deltaspike.modules$deltaspike-jpa-module-impl/builds/2013-05-23_08-25-41/archive/org.apache.deltaspike.modules/deltaspike-jpa-module-impl/0.4-incubating-SNAPSHOT/deltaspike-jpa-module-impl-0.4-incubating-SNAPSHOT.pom
[JENKINS] Archiving <https://builds.apache.org/job/DeltaSpike_TomEE_latest/ws/deltaspike/modules/security/impl/pom.xml>
to /home/hudson/hudson/jobs/DeltaSpike_TomEE_latest/modules/org.apache.deltaspike.modules$deltaspike-security-module-impl/builds/2013-05-23_08-25-41/archive/org.apache.deltaspike.modules/deltaspike-security-module-impl/0.4-incubating-SNAPSHOT/deltaspike-security-module-impl-0.4-incubating-SNAPSHOT.pom
[JENKINS] Archiving <https://builds.apache.org/job/DeltaSpike_TomEE_latest/ws/deltaspike/modules/jpa/api/pom.xml>
to /home/hudson/hudson/jobs/DeltaSpike_TomEE_latest/modules/org.apache.deltaspike.modules$deltaspike-jpa-module-api/builds/2013-05-23_08-25-41/archive/org.apache.deltaspike.modules/deltaspike-jpa-module-api/0.4-incubating-SNAPSHOT/deltaspike-jpa-module-api-0.4-incubating-SNAPSHOT.pom
[JENKINS] Archiving <https://builds.apache.org/job/DeltaSpike_TomEE_latest/ws/deltaspike/modules/jsf/api/pom.xml>
to /home/hudson/hudson/jobs/DeltaSpike_TomEE_latest/modules/org.apache.deltaspike.modules$deltaspike-jsf-module-api/builds/2013-05-23_08-25-41/archive/org.apache.deltaspike.modules/deltaspike-jsf-module-api/0.4-incubating-SNAPSHOT/deltaspike-jsf-module-api-0.4-incubating-SNAPSHOT.pom
[JENKINS] Archiving <https://builds.apache.org/job/DeltaSpike_TomEE_latest/ws/deltaspike/examples/pom.xml>
to /home/hudson/hudson/jobs/DeltaSpike_TomEE_latest/modules/org.apache.deltaspike.examples$examples-project/builds/2013-05-23_08-25-41/archive/org.apache.deltaspike.examples/examples-project/0.4-incubating-SNAPSHOT/examples-project-0.4-incubating-SNAPSHOT.pom
[JENKINS] Archiving <https://builds.apache.org/job/DeltaSpike_TomEE_latest/ws/deltaspike/cdictrl/pom.xml>
to /home/hudson/hudson/jobs/DeltaSpike_TomEE_latest/modules/org.apache.deltaspike.cdictrl$cdictrl-project/builds/2013-05-23_08-25-41/archive/org.apache.deltaspike.cdictrl/cdictrl-project/0.4-incubating-SNAPSHOT/cdictrl-project-0.4-incubating-SNAPSHOT.pom
Waiting for Jenkins to finish collecting data
mavenExecutionResult exceptions not empty
message : Failed to execute goal on project deltaspike-cdictrl-openejb: Could not resolve
dependencies for project org.apache.deltaspike.cdictrl:deltaspike-cdictrl-openejb:jar:0.4-incubating-SNAPSHOT:
The following artifacts could not be resolved: org.apache.openwebbeans:openwebbeans-ejb:jar:1.2.0-SNAPSHOT,
org.apache.openwebbeans:openwebbeans-ee:jar:1.2.0-SNAPSHOT, org.apache.openwebbeans:openwebbeans-ee-common:jar:1.2.0-SNAPSHOT:
Could not find artifact org.apache.openwebbeans:openwebbeans-ejb:jar:1.2.0-SNAPSHOT in Apache
Repository (https://repository.apache.org/content/repositories/releases)
cause : Could not resolve dependencies for project org.apache.deltaspike.cdictrl:deltaspike-cdictrl-openejb:jar:0.4-incubating-SNAPSHOT:
The following artifacts could not be resolved: org.apache.openwebbeans:openwebbeans-ejb:jar:1.2.0-SNAPSHOT,
org.apache.openwebbeans:openwebbeans-ee:jar:1.2.0-SNAPSHOT, org.apache.openwebbeans:openwebbeans-ee-common:jar:1.2.0-SNAPSHOT:
Could not find artifact org.apache.openwebbeans:openwebbeans-ejb:jar:1.2.0-SNAPSHOT in Apache
Repository (https://repository.apache.org/content/repositories/releases)
Stack trace : 
org.apache.maven.lifecycle.LifecycleExecutionException: Failed to execute goal on project
deltaspike-cdictrl-openejb: Could not resolve dependencies for project org.apache.deltaspike.cdictrl:deltaspike-cdictrl-openejb:jar:0.4-incubating-SNAPSHOT:
The following artifacts could not be resolved: org.apache.openwebbeans:openwebbeans-ejb:jar:1.2.0-SNAPSHOT,
org.apache.openwebbeans:openwebbeans-ee:jar:1.2.0-SNAPSHOT, org.apache.openwebbeans:openwebbeans-ee-common:jar:1.2.0-SNAPSHOT:
Could not find artifact org.apache.openwebbeans:openwebbeans-ejb:jar:1.2.0-SNAPSHOT in Apache
Repository (https://repository.apache.org/content/repositories/releases)
	at org.apache.maven.lifecycle.internal.LifecycleDependencyResolver.getDependencies(LifecycleDependencyResolver.java:210)
	at org.apache.maven.lifecycle.internal.LifecycleDependencyResolver.resolveProjectDependencies(LifecycleDependencyResolver.java:117)
	at org.apache.maven.lifecycle.internal.MojoExecutor.ensureDependenciesAreResolved(MojoExecutor.java:258)
	at org.apache.maven.lifecycle.internal.MojoExecutor.execute(MojoExecutor.java:201)
	at org.apache.maven.lifecycle.internal.MojoExecutor.execute(MojoExecutor.java:153)
	at org.apache.maven.lifecycle.internal.MojoExecutor.execute(MojoExecutor.java:145)
	at org.apache.maven.lifecycle.internal.LifecycleModuleBuilder.buildProject(LifecycleModuleBuilder.java:84)
	at org.apache.maven.lifecycle.internal.LifecycleModuleBuilder.buildProject(LifecycleModuleBuilder.java:59)
	at org.apache.maven.lifecycle.internal.LifecycleStarter.singleThreadedBuild(LifecycleStarter.java:183)
	at org.apache.maven.lifecycle.internal.LifecycleStarter.execute(LifecycleStarter.java:161)
	at org.apache.maven.DefaultMaven.doExecute(DefaultMaven.java:320)
	at org.apache.maven.DefaultMaven.execute(DefaultMaven.java:156)
	at org.jvnet.hudson.maven3.launcher.Maven3Launcher.main(Maven3Launcher.java:79)
	at sun.reflect.NativeMethodAccessorImpl.invoke0(Native Method)
	at sun.reflect.NativeMethodAccessorImpl.invoke(NativeMethodAccessorImpl.java:39)
	at sun.reflect.DelegatingMethodAccessorImpl.invoke(DelegatingMethodAccessorImpl.java:25)
	at java.lang.reflect.Method.invoke(Method.java:597)
	at org.codehaus.plexus.classworlds.launcher.Launcher.launchStandard(Launcher.java:329)
	at org.codehaus.plexus.classworlds.launcher.Launcher.launch(Launcher.java:239)
	at org.jvnet.hudson.maven3.agent.Maven3Main.launch(Maven3Main.java:158)
	at hudson.maven.Maven3Builder.call(Maven3Builder.java:100)
	at hudson.maven.Maven3Builder.call(Maven3Builder.java:66)
	at hudson.remoting.UserRequest.perform(UserRequest.java:118)
	at hudson.remoting.UserRequest.perform(UserRequest.java:48)
	at hudson.remoting.Request$2.run(Request.java:326)
	at hudson.remoting.InterceptingExecutorService$1.call(InterceptingExecutorService.java:72)
	at java.util.concurrent.FutureTask$Sync.innerRun(FutureTask.java:303)
	at java.util.concurrent.FutureTask.run(FutureTask.java:138)
	at java.util.concurrent.ThreadPoolExecutor$Worker.runTask(ThreadPoolExecutor.java:895)
	at java.util.concurrent.ThreadPoolExecutor$Worker.run(ThreadPoolExecutor.java:918)
	at java.lang.Thread.run(Thread.java:662)
Caused by: org.apache.maven.project.DependencyResolutionException: Could not resolve dependencies
for project org.apache.deltaspike.cdictrl:deltaspike-cdictrl-openejb:jar:0.4-incubating-SNAPSHOT:
The following artifacts could not be resolved: org.apache.openwebbeans:openwebbeans-ejb:jar:1.2.0-SNAPSHOT,
org.apache.openwebbeans:openwebbeans-ee:jar:1.2.0-SNAPSHOT, org.apache.openwebbeans:openwebbeans-ee-common:jar:1.2.0-SNAPSHOT:
Could not find artifact org.apache.openwebbeans:openwebbeans-ejb:jar:1.2.0-SNAPSHOT in Apache
Repository (https://repository.apache.org/content/repositories/releases)
	at org.apache.maven.project.DefaultProjectDependenciesResolver.resolve(DefaultProjectDependenciesResolver.java:189)
	at org.apache.maven.lifecycle.internal.LifecycleDependencyResolver.getDependencies(LifecycleDependencyResolver.java:185)
	... 30 more
Caused by: org.sonatype.aether.resolution.DependencyResolutionException: The following artifacts
could not be resolved: org.apache.openwebbeans:openwebbeans-ejb:jar:1.2.0-SNAPSHOT, org.apache.openwebbeans:openwebbeans-ee:jar:1.2.0-SNAPSHOT,
org.apache.openwebbeans:openwebbeans-ee-common:jar:1.2.0-SNAPSHOT: Could not find artifact
org.apache.openwebbeans:openwebbeans-ejb:jar:1.2.0-SNAPSHOT in Apache Repository (https://repository.apache.org/content/repositories/releases)
	at org.sonatype.aether.impl.internal.DefaultRepositorySystem.resolveDependencies(DefaultRepositorySystem.java:375)
	at org.apache.maven.project.DefaultProjectDependenciesResolver.resolve(DefaultProjectDependenciesResolver.java:183)
	... 31 more
Caused by: org.sonatype.aether.resolution.ArtifactResolutionException: The following artifacts
could not be resolved: org.apache.openwebbeans:openwebbeans-ejb:jar:1.2.0-SNAPSHOT, org.apache.openwebbeans:openwebbeans-ee:jar:1.2.0-SNAPSHOT,
org.apache.openwebbeans:openwebbeans-ee-common:jar:1.2.0-SNAPSHOT: Could not find artifact
org.apache.openwebbeans:openwebbeans-ejb:jar:1.2.0-SNAPSHOT in Apache Repository (https://repository.apache.org/content/repositories/releases)
	at org.sonatype.aether.impl.internal.DefaultArtifactResolver.resolve(DefaultArtifactResolver.java:538)
	at org.sonatype.aether.impl.internal.DefaultArtifactResolver.resolveArtifacts(DefaultArtifactResolver.java:216)
	at org.sonatype.aether.impl.internal.DefaultRepositorySystem.resolveDependencies(DefaultRepositorySystem.java:358)
	... 32 more
Caused by: org.sonatype.aether.transfer.ArtifactNotFoundException: Could not find artifact
org.apache.openwebbeans:openwebbeans-ejb:jar:1.2.0-SNAPSHOT in Apache Repository (https://repository.apache.org/content/repositories/releases)
	at org.sonatype.aether.connector.wagon.WagonRepositoryConnector$4.wrap(WagonRepositoryConnector.java:947)
	at org.sonatype.aether.connector.wagon.WagonRepositoryConnector$4.wrap(WagonRepositoryConnector.java:941)
	at org.sonatype.aether.connector.wagon.WagonRepositoryConnector$GetTask.run(WagonRepositoryConnector.java:669)
	at org.sonatype.aether.util.concurrency.RunnableErrorForwarder$1.run(RunnableErrorForwarder.java:60)
	... 3 more
Sending e-mails to: deltaspike-commits@incubator.apache.org
channel stopped

Mime
View raw message