deltaspike-commits mailing list archives

Site index · List index
Message view « Date » · « Thread »
Top « Date » · « Thread »
From Apache Jenkins Server <jenk...@builds.apache.org>
Subject Build failed in Jenkins: DeltaSpike_AS7 #7
Date Sat, 18 May 2013 03:01:59 GMT
See <https://builds.apache.org/job/DeltaSpike_AS7/7/changes>

Changes:

[rmannibucau] forcing xbean finder shaded version for cdictrl openejb

[rmannibucau] xbean should come transitively and not explcitely to avoid issue between owb,
openejb versions

[struberg] DELTASPIKE-289 add sample ClientWindowConfig

[struberg] DELTASPIKE-367 upgrade to owb-arquillian-1.2.0-SNAPTHOT

------------------------------------------
[...truncated 2899 lines...]
May 18, 2013 3:00:54 AM org.apache.deltaspike.test.utils.ShrinkWrapArchiveUtil getArchives
INFO: Test org.apache.deltaspike.test.jsf.impl.scope.view.ViewScopedContextTest Adding Java
ClassPath URL as JavaArchive <https://builds.apache.org/job/DeltaSpike_AS7/ws/deltaspike/modules/jsf/impl/target/classes/META-INF/beans.xml>
May 18, 2013 3:00:54 AM org.apache.deltaspike.test.utils.ShrinkWrapArchiveUtil getArchives
INFO: Test org.apache.deltaspike.test.jsf.impl.scope.view.ViewScopedContextTest Adding Java
ClassPath URL as JavaArchive jar:<https://builds.apache.org/job/DeltaSpike_AS7/ws/deltaspike/core/api/target/deltaspike-core-api-0.4-incubating-SNAPSHOT.jar!/META-INF/beans.xml>
May 18, 2013 3:00:54 AM org.apache.deltaspike.test.utils.ShrinkWrapArchiveUtil getArchives
INFO: Test org.apache.deltaspike.test.jsf.impl.scope.view.ViewScopedContextTest Adding Java
ClassPath URL as JavaArchive jar:<https://builds.apache.org/job/DeltaSpike_AS7/ws/deltaspike/core/impl/target/deltaspike-core-impl-0.4-incubating-SNAPSHOT.jar!/META-INF/beans.xml>
May 18, 2013 3:00:54 AM org.apache.deltaspike.test.utils.ShrinkWrapArchiveUtil getArchives
INFO: Test org.apache.deltaspike.test.jsf.impl.scope.view.ViewScopedContextTest Adding Java
ClassPath URL as JavaArchive jar:<https://builds.apache.org/job/DeltaSpike_AS7/ws/deltaspike/modules/jsf/api/target/deltaspike-jsf-module-api-0.4-incubating-SNAPSHOT.jar!/META-INF/beans.xml>
May 18, 2013 3:00:54 AM org.apache.deltaspike.test.utils.ShrinkWrapArchiveUtil getArchives
INFO: Test org.apache.deltaspike.test.jsf.impl.scope.view.ViewScopedContextTest Adding Java
ClassPath URL as JavaArchive jar:<https://builds.apache.org/job/DeltaSpike_AS7/ws/deltaspike/modules/security/api/target/deltaspike-security-module-api-0.4-incubating-SNAPSHOT.jar!/META-INF/beans.xml>
May 18, 2013 3:00:54 AM org.apache.deltaspike.test.utils.ShrinkWrapArchiveUtil getArchives
INFO: Test org.apache.deltaspike.test.jsf.impl.scope.view.ViewScopedContextTest Adding Java
ClassPath URL as JavaArchive jar:<https://builds.apache.org/job/DeltaSpike_AS7/ws/deltaspike/modules/security/impl/target/deltaspike-security-module-impl-0.4-incubating-SNAPSHOT.jar!/META-INF/beans.xml>
May 18, 2013 3:00:56 AM org.jboss.arquillian.drone.webdriver.factory.WebDriverFactory createInstance
INFO: Property "browserCapabilities" was not specified, using default value of htmlUnit
Running org.apache.deltaspike.test.jsf.impl.scope.mapped.MappedJsfContextTest
Tests run: 1, Failures: 0, Errors: 0, Skipped: 0, Time elapsed: 0.832 sec
May 18, 2013 3:00:57 AM org.apache.deltaspike.test.utils.ShrinkWrapArchiveUtil getArchives
INFO: Test org.apache.deltaspike.test.jsf.impl.scope.window.WindowScopedContextTest Adding
Java ClassPath URL as JavaArchive <https://builds.apache.org/job/DeltaSpike_AS7/ws/deltaspike/modules/jsf/impl/target/classes/META-INF/beans.xml>
May 18, 2013 3:00:57 AM org.apache.deltaspike.test.utils.ShrinkWrapArchiveUtil getArchives
INFO: Test org.apache.deltaspike.test.jsf.impl.scope.window.WindowScopedContextTest Adding
Java ClassPath URL as JavaArchive jar:<https://builds.apache.org/job/DeltaSpike_AS7/ws/deltaspike/core/api/target/deltaspike-core-api-0.4-incubating-SNAPSHOT.jar!/META-INF/beans.xml>
May 18, 2013 3:00:57 AM org.apache.deltaspike.test.utils.ShrinkWrapArchiveUtil getArchives
INFO: Test org.apache.deltaspike.test.jsf.impl.scope.window.WindowScopedContextTest Adding
Java ClassPath URL as JavaArchive jar:<https://builds.apache.org/job/DeltaSpike_AS7/ws/deltaspike/core/impl/target/deltaspike-core-impl-0.4-incubating-SNAPSHOT.jar!/META-INF/beans.xml>
May 18, 2013 3:00:57 AM org.apache.deltaspike.test.utils.ShrinkWrapArchiveUtil getArchives
INFO: Test org.apache.deltaspike.test.jsf.impl.scope.window.WindowScopedContextTest Adding
Java ClassPath URL as JavaArchive jar:<https://builds.apache.org/job/DeltaSpike_AS7/ws/deltaspike/modules/jsf/api/target/deltaspike-jsf-module-api-0.4-incubating-SNAPSHOT.jar!/META-INF/beans.xml>
May 18, 2013 3:00:57 AM org.apache.deltaspike.test.utils.ShrinkWrapArchiveUtil getArchives
INFO: Test org.apache.deltaspike.test.jsf.impl.scope.window.WindowScopedContextTest Adding
Java ClassPath URL as JavaArchive jar:<https://builds.apache.org/job/DeltaSpike_AS7/ws/deltaspike/modules/security/api/target/deltaspike-security-module-api-0.4-incubating-SNAPSHOT.jar!/META-INF/beans.xml>
May 18, 2013 3:00:57 AM org.apache.deltaspike.test.utils.ShrinkWrapArchiveUtil getArchives
INFO: Test org.apache.deltaspike.test.jsf.impl.scope.window.WindowScopedContextTest Adding
Java ClassPath URL as JavaArchive jar:<https://builds.apache.org/job/DeltaSpike_AS7/ws/deltaspike/modules/security/impl/target/deltaspike-security-module-impl-0.4-incubating-SNAPSHOT.jar!/META-INF/beans.xml>
May 18, 2013 3:00:59 AM org.jboss.arquillian.drone.webdriver.factory.WebDriverFactory createInstance
INFO: Property "browserCapabilities" was not specified, using default value of htmlUnit
Running org.apache.deltaspike.test.jsf.impl.scope.view.ViewScopedContextTest
Tests run: 1, Failures: 0, Errors: 0, Skipped: 0, Time elapsed: 0.243 sec
May 18, 2013 3:01:00 AM org.apache.deltaspike.test.utils.ShrinkWrapArchiveUtil getArchives
INFO: Test org.apache.deltaspike.test.jsf.impl.message.JsfMessageTest Adding Java ClassPath
URL as JavaArchive <https://builds.apache.org/job/DeltaSpike_AS7/ws/deltaspike/modules/jsf/impl/target/classes/META-INF/beans.xml>
May 18, 2013 3:01:00 AM org.apache.deltaspike.test.utils.ShrinkWrapArchiveUtil getArchives
INFO: Test org.apache.deltaspike.test.jsf.impl.message.JsfMessageTest Adding Java ClassPath
URL as JavaArchive jar:<https://builds.apache.org/job/DeltaSpike_AS7/ws/deltaspike/core/api/target/deltaspike-core-api-0.4-incubating-SNAPSHOT.jar!/META-INF/beans.xml>
May 18, 2013 3:01:00 AM org.apache.deltaspike.test.utils.ShrinkWrapArchiveUtil getArchives
INFO: Test org.apache.deltaspike.test.jsf.impl.message.JsfMessageTest Adding Java ClassPath
URL as JavaArchive jar:<https://builds.apache.org/job/DeltaSpike_AS7/ws/deltaspike/core/impl/target/deltaspike-core-impl-0.4-incubating-SNAPSHOT.jar!/META-INF/beans.xml>
May 18, 2013 3:01:00 AM org.apache.deltaspike.test.utils.ShrinkWrapArchiveUtil getArchives
INFO: Test org.apache.deltaspike.test.jsf.impl.message.JsfMessageTest Adding Java ClassPath
URL as JavaArchive jar:<https://builds.apache.org/job/DeltaSpike_AS7/ws/deltaspike/modules/jsf/api/target/deltaspike-jsf-module-api-0.4-incubating-SNAPSHOT.jar!/META-INF/beans.xml>
May 18, 2013 3:01:00 AM org.apache.deltaspike.test.utils.ShrinkWrapArchiveUtil getArchives
INFO: Test org.apache.deltaspike.test.jsf.impl.message.JsfMessageTest Adding Java ClassPath
URL as JavaArchive jar:<https://builds.apache.org/job/DeltaSpike_AS7/ws/deltaspike/modules/security/api/target/deltaspike-security-module-api-0.4-incubating-SNAPSHOT.jar!/META-INF/beans.xml>
May 18, 2013 3:01:00 AM org.apache.deltaspike.test.utils.ShrinkWrapArchiveUtil getArchives
INFO: Test org.apache.deltaspike.test.jsf.impl.message.JsfMessageTest Adding Java ClassPath
URL as JavaArchive jar:<https://builds.apache.org/job/DeltaSpike_AS7/ws/deltaspike/modules/security/impl/target/deltaspike-security-module-impl-0.4-incubating-SNAPSHOT.jar!/META-INF/beans.xml>
May 18, 2013 3:01:03 AM org.jboss.arquillian.drone.webdriver.factory.WebDriverFactory createInstance
INFO: Property "browserCapabilities" was not specified, using default value of htmlUnit
Running org.apache.deltaspike.test.jsf.impl.scope.window.WindowScopedContextTest
contextpath= http://127.0.0.1:8080/windowScopedContextTest/
Tests run: 1, Failures: 0, Errors: 0, Skipped: 0, Time elapsed: 0.31 sec
Running org.apache.deltaspike.test.jsf.impl.message.JsfMessageTest
Tests run: 2, Failures: 0, Errors: 0, Skipped: 0, Time elapsed: 0.289 sec

Results :

Tests run: 53, Failures: 0, Errors: 0, Skipped: 0

[INFO] ------------------------------------------------------------------------
[INFO] Reactor Summary:
[INFO] 
[INFO] Apache DeltaSpike ................................. SUCCESS [22.688s]
[INFO] Apache DeltaSpike CheckStyle-rules ................ SUCCESS [2.972s]
[INFO] Apache DeltaSpike Parent .......................... SUCCESS [3.858s]
[INFO] Apache DeltaSpike Test-Utils ...................... SUCCESS [4.973s]
[INFO] Apache DeltaSpike Code Parent ..................... SUCCESS [21.352s]
[INFO] Apache DeltaSpike Core ............................ SUCCESS [11.898s]
[INFO] Apache DeltaSpike Core-API ........................ SUCCESS [23.428s]
[INFO] Apache DeltaSpike Core-Implementation ............. SUCCESS [48.682s]
[INFO] Apache DeltaSpike ContainerControl parent ......... SUCCESS [2.380s]
[INFO] Apache DeltaSpike CDI ContainerControl API ........ SUCCESS [3.215s]
[INFO] Apache DeltaSpike CDI ContainerControl TCK ........ SUCCESS [3.354s]
[INFO] Apache DeltaSpike CDI OWB-ContainerControl ........ SUCCESS [4.754s]
[INFO] Apache DeltaSpike CDI Weld-ContainerControl ....... SUCCESS [5.681s]
[INFO] Apache DeltaSpike CDI OpenEJB-ContainerControl .... SUCCESS [8.484s]
[INFO] Apache DeltaSpike Modules ......................... SUCCESS [8.997s]
[INFO] Apache DeltaSpike Security-Module ................. SUCCESS [8.548s]
[INFO] Apache DeltaSpike Security-Module API ............. SUCCESS [14.628s]
[INFO] Apache DeltaSpike Security-Module Impl ............ SUCCESS [34.141s]
[INFO] Apache DeltaSpike JPA-Module ...................... SUCCESS [15.354s]
[INFO] Apache DeltaSpike JPA-Module API .................. SUCCESS [23.278s]
[INFO] Apache DeltaSpike JPA-Module Impl ................. SUCCESS [15.572s]
[INFO] Apache DeltaSpike JSF-Module ...................... SUCCESS [16.974s]
[INFO] Apache DeltaSpike JSF-Module API .................. SUCCESS [14.384s]
[INFO] Apache DeltaSpike JSF-Module Impl ................. FAILURE [49.230s]
[INFO] Apache DeltaSpike Partial-Bean-Module ............. SKIPPED
[INFO] Apache DeltaSpike Partial-Bean-Module API ......... SKIPPED
[INFO] Apache DeltaSpike Partial-Bean-Module Impl ........ SKIPPED
[INFO] Apache DeltaSpike Examples ........................ SKIPPED
[INFO] Apache DeltaSpike Java-SE Examples ................ SKIPPED
[INFO] Apache DeltaSpike JSF Examples .................... SKIPPED
[INFO] ------------------------------------------------------------------------
[INFO] BUILD FAILURE
[INFO] ------------------------------------------------------------------------
[INFO] Total time: 6:16.200s
[INFO] Finished at: Sat May 18 03:01:07 UTC 2013
[INFO] Final Memory: 55M/116M
[INFO] ------------------------------------------------------------------------
[JENKINS] Archiving <https://builds.apache.org/job/DeltaSpike_AS7/ws/deltaspike/pom.xml>
to /home/hudson/hudson/jobs/DeltaSpike_AS7/modules/org.apache.deltaspike$deltaspike-project/builds/2013-05-18_02-54-35/archive/org.apache.deltaspike/deltaspike-project/0.4-incubating-SNAPSHOT/deltaspike-project-0.4-incubating-SNAPSHOT.pom
[JENKINS] Archiving <https://builds.apache.org/job/DeltaSpike_AS7/ws/deltaspike/modules/partial-bean/impl/pom.xml>
to /home/hudson/hudson/jobs/DeltaSpike_AS7/modules/org.apache.deltaspike.modules$deltaspike-partial-bean-module-impl/builds/2013-05-18_02-54-35/archive/org.apache.deltaspike.modules/deltaspike-partial-bean-module-impl/0.4-incubating-SNAPSHOT/deltaspike-partial-bean-module-impl-0.4-incubating-SNAPSHOT.pom
[JENKINS] Archiving <https://builds.apache.org/job/DeltaSpike_AS7/ws/deltaspike/cdictrl/impl-openejb/pom.xml>
to /home/hudson/hudson/jobs/DeltaSpike_AS7/modules/org.apache.deltaspike.cdictrl$deltaspike-cdictrl-openejb/builds/2013-05-18_02-54-35/archive/org.apache.deltaspike.cdictrl/deltaspike-cdictrl-openejb/0.4-incubating-SNAPSHOT/deltaspike-cdictrl-openejb-0.4-incubating-SNAPSHOT.pom
[JENKINS] Archiving <https://builds.apache.org/job/DeltaSpike_AS7/ws/deltaspike/cdictrl/impl-openejb/target/deltaspike-cdictrl-openejb-0.4-incubating-SNAPSHOT.jar>
to /home/hudson/hudson/jobs/DeltaSpike_AS7/modules/org.apache.deltaspike.cdictrl$deltaspike-cdictrl-openejb/builds/2013-05-18_02-54-35/archive/org.apache.deltaspike.cdictrl/deltaspike-cdictrl-openejb/0.4-incubating-SNAPSHOT/deltaspike-cdictrl-openejb-0.4-incubating-SNAPSHOT.jar
[JENKINS] Archiving <https://builds.apache.org/job/DeltaSpike_AS7/ws/deltaspike/cdictrl/impl-openejb/target/deltaspike-cdictrl-openejb-0.4-incubating-SNAPSHOT-sources.jar>
to /home/hudson/hudson/jobs/DeltaSpike_AS7/modules/org.apache.deltaspike.cdictrl$deltaspike-cdictrl-openejb/builds/2013-05-18_02-54-35/archive/org.apache.deltaspike.cdictrl/deltaspike-cdictrl-openejb/0.4-incubating-SNAPSHOT/deltaspike-cdictrl-openejb-0.4-incubating-SNAPSHOT-sources.jar
[JENKINS] Archiving <https://builds.apache.org/job/DeltaSpike_AS7/ws/deltaspike/cdictrl/api/pom.xml>
to /home/hudson/hudson/jobs/DeltaSpike_AS7/modules/org.apache.deltaspike.cdictrl$deltaspike-cdictrl-api/builds/2013-05-18_02-54-35/archive/org.apache.deltaspike.cdictrl/deltaspike-cdictrl-api/0.4-incubating-SNAPSHOT/deltaspike-cdictrl-api-0.4-incubating-SNAPSHOT.pom
[JENKINS] Archiving <https://builds.apache.org/job/DeltaSpike_AS7/ws/deltaspike/cdictrl/api/target/deltaspike-cdictrl-api-0.4-incubating-SNAPSHOT.jar>
to /home/hudson/hudson/jobs/DeltaSpike_AS7/modules/org.apache.deltaspike.cdictrl$deltaspike-cdictrl-api/builds/2013-05-18_02-54-35/archive/org.apache.deltaspike.cdictrl/deltaspike-cdictrl-api/0.4-incubating-SNAPSHOT/deltaspike-cdictrl-api-0.4-incubating-SNAPSHOT.jar
[JENKINS] Archiving <https://builds.apache.org/job/DeltaSpike_AS7/ws/deltaspike/cdictrl/api/target/deltaspike-cdictrl-api-0.4-incubating-SNAPSHOT-sources.jar>
to /home/hudson/hudson/jobs/DeltaSpike_AS7/modules/org.apache.deltaspike.cdictrl$deltaspike-cdictrl-api/builds/2013-05-18_02-54-35/archive/org.apache.deltaspike.cdictrl/deltaspike-cdictrl-api/0.4-incubating-SNAPSHOT/deltaspike-cdictrl-api-0.4-incubating-SNAPSHOT-sources.jar
[JENKINS] Archiving <https://builds.apache.org/job/DeltaSpike_AS7/ws/deltaspike/test-utils/pom.xml>
to /home/hudson/hudson/jobs/DeltaSpike_AS7/modules/org.apache.deltaspike.test$test-utils/builds/2013-05-18_02-54-35/archive/org.apache.deltaspike.test/test-utils/0.4-incubating-SNAPSHOT/test-utils-0.4-incubating-SNAPSHOT.pom
[JENKINS] Archiving <https://builds.apache.org/job/DeltaSpike_AS7/ws/deltaspike/test-utils/target/test-utils-0.4-incubating-SNAPSHOT.jar>
to /home/hudson/hudson/jobs/DeltaSpike_AS7/modules/org.apache.deltaspike.test$test-utils/builds/2013-05-18_02-54-35/archive/org.apache.deltaspike.test/test-utils/0.4-incubating-SNAPSHOT/test-utils-0.4-incubating-SNAPSHOT.jar
[JENKINS] Archiving <https://builds.apache.org/job/DeltaSpike_AS7/ws/deltaspike/test-utils/target/test-utils-0.4-incubating-SNAPSHOT-sources.jar>
to /home/hudson/hudson/jobs/DeltaSpike_AS7/modules/org.apache.deltaspike.test$test-utils/builds/2013-05-18_02-54-35/archive/org.apache.deltaspike.test/test-utils/0.4-incubating-SNAPSHOT/test-utils-0.4-incubating-SNAPSHOT-sources.jar
[JENKINS] Archiving <https://builds.apache.org/job/DeltaSpike_AS7/ws/deltaspike/core/impl/pom.xml>
to /home/hudson/hudson/jobs/DeltaSpike_AS7/modules/org.apache.deltaspike.core$deltaspike-core-impl/builds/2013-05-18_02-54-35/archive/org.apache.deltaspike.core/deltaspike-core-impl/0.4-incubating-SNAPSHOT/deltaspike-core-impl-0.4-incubating-SNAPSHOT.pom
[JENKINS] Archiving <https://builds.apache.org/job/DeltaSpike_AS7/ws/deltaspike/core/impl/target/deltaspike-core-impl-0.4-incubating-SNAPSHOT.jar>
to /home/hudson/hudson/jobs/DeltaSpike_AS7/modules/org.apache.deltaspike.core$deltaspike-core-impl/builds/2013-05-18_02-54-35/archive/org.apache.deltaspike.core/deltaspike-core-impl/0.4-incubating-SNAPSHOT/deltaspike-core-impl-0.4-incubating-SNAPSHOT.jar
[JENKINS] Archiving <https://builds.apache.org/job/DeltaSpike_AS7/ws/deltaspike/core/impl/target/deltaspike-core-impl-0.4-incubating-SNAPSHOT-tests.jar>
to /home/hudson/hudson/jobs/DeltaSpike_AS7/modules/org.apache.deltaspike.core$deltaspike-core-impl/builds/2013-05-18_02-54-35/archive/org.apache.deltaspike.core/deltaspike-core-impl/0.4-incubating-SNAPSHOT/deltaspike-core-impl-0.4-incubating-SNAPSHOT-tests.jar
[JENKINS] Archiving <https://builds.apache.org/job/DeltaSpike_AS7/ws/deltaspike/core/impl/target/deltaspike-core-impl-0.4-incubating-SNAPSHOT-sources.jar>
to /home/hudson/hudson/jobs/DeltaSpike_AS7/modules/org.apache.deltaspike.core$deltaspike-core-impl/builds/2013-05-18_02-54-35/archive/org.apache.deltaspike.core/deltaspike-core-impl/0.4-incubating-SNAPSHOT/deltaspike-core-impl-0.4-incubating-SNAPSHOT-sources.jar
[JENKINS] Archiving <https://builds.apache.org/job/DeltaSpike_AS7/ws/deltaspike/modules/jsf/impl/pom.xml>
to /home/hudson/hudson/jobs/DeltaSpike_AS7/modules/org.apache.deltaspike.modules$deltaspike-jsf-module-impl/builds/2013-05-18_02-54-35/archive/org.apache.deltaspike.modules/deltaspike-jsf-module-impl/0.4-incubating-SNAPSHOT/deltaspike-jsf-module-impl-0.4-incubating-SNAPSHOT.pom
[JENKINS] Archiving <https://builds.apache.org/job/DeltaSpike_AS7/ws/deltaspike/modules/partial-bean/pom.xml>
to /home/hudson/hudson/jobs/DeltaSpike_AS7/modules/org.apache.deltaspike.modules$partial-bean-module-project/builds/2013-05-18_02-54-35/archive/org.apache.deltaspike.modules/partial-bean-module-project/0.4-incubating-SNAPSHOT/partial-bean-module-project-0.4-incubating-SNAPSHOT.pom
[JENKINS] Archiving <https://builds.apache.org/job/DeltaSpike_AS7/ws/deltaspike/cdictrl/tck/pom.xml>
to /home/hudson/hudson/jobs/DeltaSpike_AS7/modules/org.apache.deltaspike.test$deltaspike-cdictrl-tck/builds/2013-05-18_02-54-35/archive/org.apache.deltaspike.test/deltaspike-cdictrl-tck/0.4-incubating-SNAPSHOT/deltaspike-cdictrl-tck-0.4-incubating-SNAPSHOT.pom
[JENKINS] Archiving <https://builds.apache.org/job/DeltaSpike_AS7/ws/deltaspike/cdictrl/tck/target/deltaspike-cdictrl-tck-0.4-incubating-SNAPSHOT.jar>
to /home/hudson/hudson/jobs/DeltaSpike_AS7/modules/org.apache.deltaspike.test$deltaspike-cdictrl-tck/builds/2013-05-18_02-54-35/archive/org.apache.deltaspike.test/deltaspike-cdictrl-tck/0.4-incubating-SNAPSHOT/deltaspike-cdictrl-tck-0.4-incubating-SNAPSHOT.jar
[JENKINS] Archiving <https://builds.apache.org/job/DeltaSpike_AS7/ws/deltaspike/cdictrl/tck/target/deltaspike-cdictrl-tck-0.4-incubating-SNAPSHOT-sources.jar>
to /home/hudson/hudson/jobs/DeltaSpike_AS7/modules/org.apache.deltaspike.test$deltaspike-cdictrl-tck/builds/2013-05-18_02-54-35/archive/org.apache.deltaspike.test/deltaspike-cdictrl-tck/0.4-incubating-SNAPSHOT/deltaspike-cdictrl-tck-0.4-incubating-SNAPSHOT-sources.jar
[JENKINS] Archiving <https://builds.apache.org/job/DeltaSpike_AS7/ws/deltaspike/core/pom.xml>
to /home/hudson/hudson/jobs/DeltaSpike_AS7/modules/org.apache.deltaspike.core$core-project/builds/2013-05-18_02-54-35/archive/org.apache.deltaspike.core/core-project/0.4-incubating-SNAPSHOT/core-project-0.4-incubating-SNAPSHOT.pom
[JENKINS] Archiving <https://builds.apache.org/job/DeltaSpike_AS7/ws/deltaspike/core/target/core-project-0.4-incubating-SNAPSHOT-tests.jar>
to /home/hudson/hudson/jobs/DeltaSpike_AS7/modules/org.apache.deltaspike.core$core-project/builds/2013-05-18_02-54-35/archive/org.apache.deltaspike.core/core-project/0.4-incubating-SNAPSHOT/core-project-0.4-incubating-SNAPSHOT-tests.jar
[JENKINS] Archiving <https://builds.apache.org/job/DeltaSpike_AS7/ws/deltaspike/checkstyle-rules/pom.xml>
to /home/hudson/hudson/jobs/DeltaSpike_AS7/modules/org.apache.deltaspike$checkstyle-rules/builds/2013-05-18_02-54-35/archive/org.apache.deltaspike/checkstyle-rules/0.4-incubating-SNAPSHOT/checkstyle-rules-0.4-incubating-SNAPSHOT.pom
[JENKINS] Archiving <https://builds.apache.org/job/DeltaSpike_AS7/ws/deltaspike/checkstyle-rules/target/checkstyle-rules-0.4-incubating-SNAPSHOT.jar>
to /home/hudson/hudson/jobs/DeltaSpike_AS7/modules/org.apache.deltaspike$checkstyle-rules/builds/2013-05-18_02-54-35/archive/org.apache.deltaspike/checkstyle-rules/0.4-incubating-SNAPSHOT/checkstyle-rules-0.4-incubating-SNAPSHOT.jar
[JENKINS] Archiving <https://builds.apache.org/job/DeltaSpike_AS7/ws/deltaspike/examples/jsf-examples/pom.xml>
to /home/hudson/hudson/jobs/DeltaSpike_AS7/modules/org.apache.deltaspike.examples$deltaspike-jsf-example/builds/2013-05-18_02-54-35/archive/org.apache.deltaspike.examples/deltaspike-jsf-example/0.4-incubating-SNAPSHOT/deltaspike-jsf-example-0.4-incubating-SNAPSHOT.pom
[JENKINS] Archiving <https://builds.apache.org/job/DeltaSpike_AS7/ws/deltaspike/modules/security/api/pom.xml>
to /home/hudson/hudson/jobs/DeltaSpike_AS7/modules/org.apache.deltaspike.modules$deltaspike-security-module-api/builds/2013-05-18_02-54-35/archive/org.apache.deltaspike.modules/deltaspike-security-module-api/0.4-incubating-SNAPSHOT/deltaspike-security-module-api-0.4-incubating-SNAPSHOT.pom
[JENKINS] Archiving <https://builds.apache.org/job/DeltaSpike_AS7/ws/deltaspike/modules/security/api/target/deltaspike-security-module-api-0.4-incubating-SNAPSHOT.jar>
to /home/hudson/hudson/jobs/DeltaSpike_AS7/modules/org.apache.deltaspike.modules$deltaspike-security-module-api/builds/2013-05-18_02-54-35/archive/org.apache.deltaspike.modules/deltaspike-security-module-api/0.4-incubating-SNAPSHOT/deltaspike-security-module-api-0.4-incubating-SNAPSHOT.jar
[JENKINS] Archiving <https://builds.apache.org/job/DeltaSpike_AS7/ws/deltaspike/modules/security/api/target/deltaspike-security-module-api-0.4-incubating-SNAPSHOT-tests.jar>
to /home/hudson/hudson/jobs/DeltaSpike_AS7/modules/org.apache.deltaspike.modules$deltaspike-security-module-api/builds/2013-05-18_02-54-35/archive/org.apache.deltaspike.modules/deltaspike-security-module-api/0.4-incubating-SNAPSHOT/deltaspike-security-module-api-0.4-incubating-SNAPSHOT-tests.jar
[JENKINS] Archiving <https://builds.apache.org/job/DeltaSpike_AS7/ws/deltaspike/modules/security/api/target/deltaspike-security-module-api-0.4-incubating-SNAPSHOT-sources.jar>
to /home/hudson/hudson/jobs/DeltaSpike_AS7/modules/org.apache.deltaspike.modules$deltaspike-security-module-api/builds/2013-05-18_02-54-35/archive/org.apache.deltaspike.modules/deltaspike-security-module-api/0.4-incubating-SNAPSHOT/deltaspike-security-module-api-0.4-incubating-SNAPSHOT-sources.jar
[JENKINS] Archiving <https://builds.apache.org/job/DeltaSpike_AS7/ws/deltaspike/modules/jpa/pom.xml>
to /home/hudson/hudson/jobs/DeltaSpike_AS7/modules/org.apache.deltaspike.modules$jpa-module-project/builds/2013-05-18_02-54-35/archive/org.apache.deltaspike.modules/jpa-module-project/0.4-incubating-SNAPSHOT/jpa-module-project-0.4-incubating-SNAPSHOT.pom
[JENKINS] Archiving <https://builds.apache.org/job/DeltaSpike_AS7/ws/deltaspike/modules/jpa/target/jpa-module-project-0.4-incubating-SNAPSHOT-tests.jar>
to /home/hudson/hudson/jobs/DeltaSpike_AS7/modules/org.apache.deltaspike.modules$jpa-module-project/builds/2013-05-18_02-54-35/archive/org.apache.deltaspike.modules/jpa-module-project/0.4-incubating-SNAPSHOT/jpa-module-project-0.4-incubating-SNAPSHOT-tests.jar
[JENKINS] Archiving <https://builds.apache.org/job/DeltaSpike_AS7/ws/deltaspike/parent/pom.xml>
to /home/hudson/hudson/jobs/DeltaSpike_AS7/modules/org.apache.deltaspike$parent/builds/2013-05-18_02-54-35/archive/org.apache.deltaspike/parent/0.4-incubating-SNAPSHOT/parent-0.4-incubating-SNAPSHOT.pom
[JENKINS] Archiving <https://builds.apache.org/job/DeltaSpike_AS7/ws/deltaspike/cdictrl/impl-weld/pom.xml>
to /home/hudson/hudson/jobs/DeltaSpike_AS7/modules/org.apache.deltaspike.cdictrl$deltaspike-cdictrl-weld/builds/2013-05-18_02-54-35/archive/org.apache.deltaspike.cdictrl/deltaspike-cdictrl-weld/0.4-incubating-SNAPSHOT/deltaspike-cdictrl-weld-0.4-incubating-SNAPSHOT.pom
[JENKINS] Archiving <https://builds.apache.org/job/DeltaSpike_AS7/ws/deltaspike/cdictrl/impl-weld/target/deltaspike-cdictrl-weld-0.4-incubating-SNAPSHOT.jar>
to /home/hudson/hudson/jobs/DeltaSpike_AS7/modules/org.apache.deltaspike.cdictrl$deltaspike-cdictrl-weld/builds/2013-05-18_02-54-35/archive/org.apache.deltaspike.cdictrl/deltaspike-cdictrl-weld/0.4-incubating-SNAPSHOT/deltaspike-cdictrl-weld-0.4-incubating-SNAPSHOT.jar
[JENKINS] Archiving <https://builds.apache.org/job/DeltaSpike_AS7/ws/deltaspike/cdictrl/impl-weld/target/deltaspike-cdictrl-weld-0.4-incubating-SNAPSHOT-sources.jar>
to /home/hudson/hudson/jobs/DeltaSpike_AS7/modules/org.apache.deltaspike.cdictrl$deltaspike-cdictrl-weld/builds/2013-05-18_02-54-35/archive/org.apache.deltaspike.cdictrl/deltaspike-cdictrl-weld/0.4-incubating-SNAPSHOT/deltaspike-cdictrl-weld-0.4-incubating-SNAPSHOT-sources.jar
[JENKINS] Archiving <https://builds.apache.org/job/DeltaSpike_AS7/ws/deltaspike/examples/jse-examples/pom.xml>
to /home/hudson/hudson/jobs/DeltaSpike_AS7/modules/org.apache.deltaspike.examples$deltaspike-jse-example/builds/2013-05-18_02-54-35/archive/org.apache.deltaspike.examples/deltaspike-jse-example/0.4-incubating-SNAPSHOT/deltaspike-jse-example-0.4-incubating-SNAPSHOT.pom
[JENKINS] Archiving <https://builds.apache.org/job/DeltaSpike_AS7/ws/deltaspike/modules/partial-bean/api/pom.xml>
to /home/hudson/hudson/jobs/DeltaSpike_AS7/modules/org.apache.deltaspike.modules$deltaspike-partial-bean-module-api/builds/2013-05-18_02-54-35/archive/org.apache.deltaspike.modules/deltaspike-partial-bean-module-api/0.4-incubating-SNAPSHOT/deltaspike-partial-bean-module-api-0.4-incubating-SNAPSHOT.pom
[JENKINS] Archiving <https://builds.apache.org/job/DeltaSpike_AS7/ws/deltaspike/modules/security/pom.xml>
to /home/hudson/hudson/jobs/DeltaSpike_AS7/modules/org.apache.deltaspike.modules$security-module-project/builds/2013-05-18_02-54-35/archive/org.apache.deltaspike.modules/security-module-project/0.4-incubating-SNAPSHOT/security-module-project-0.4-incubating-SNAPSHOT.pom
[JENKINS] Archiving <https://builds.apache.org/job/DeltaSpike_AS7/ws/deltaspike/modules/security/target/security-module-project-0.4-incubating-SNAPSHOT-tests.jar>
to /home/hudson/hudson/jobs/DeltaSpike_AS7/modules/org.apache.deltaspike.modules$security-module-project/builds/2013-05-18_02-54-35/archive/org.apache.deltaspike.modules/security-module-project/0.4-incubating-SNAPSHOT/security-module-project-0.4-incubating-SNAPSHOT-tests.jar
[JENKINS] Archiving <https://builds.apache.org/job/DeltaSpike_AS7/ws/deltaspike/cdictrl/impl-owb/pom.xml>
to /home/hudson/hudson/jobs/DeltaSpike_AS7/modules/org.apache.deltaspike.cdictrl$deltaspike-cdictrl-owb/builds/2013-05-18_02-54-35/archive/org.apache.deltaspike.cdictrl/deltaspike-cdictrl-owb/0.4-incubating-SNAPSHOT/deltaspike-cdictrl-owb-0.4-incubating-SNAPSHOT.pom
[JENKINS] Archiving <https://builds.apache.org/job/DeltaSpike_AS7/ws/deltaspike/cdictrl/impl-owb/target/deltaspike-cdictrl-owb-0.4-incubating-SNAPSHOT.jar>
to /home/hudson/hudson/jobs/DeltaSpike_AS7/modules/org.apache.deltaspike.cdictrl$deltaspike-cdictrl-owb/builds/2013-05-18_02-54-35/archive/org.apache.deltaspike.cdictrl/deltaspike-cdictrl-owb/0.4-incubating-SNAPSHOT/deltaspike-cdictrl-owb-0.4-incubating-SNAPSHOT.jar
[JENKINS] Archiving <https://builds.apache.org/job/DeltaSpike_AS7/ws/deltaspike/cdictrl/impl-owb/target/deltaspike-cdictrl-owb-0.4-incubating-SNAPSHOT-sources.jar>
to /home/hudson/hudson/jobs/DeltaSpike_AS7/modules/org.apache.deltaspike.cdictrl$deltaspike-cdictrl-owb/builds/2013-05-18_02-54-35/archive/org.apache.deltaspike.cdictrl/deltaspike-cdictrl-owb/0.4-incubating-SNAPSHOT/deltaspike-cdictrl-owb-0.4-incubating-SNAPSHOT-sources.jar
[JENKINS] Archiving <https://builds.apache.org/job/DeltaSpike_AS7/ws/deltaspike/modules/jsf/pom.xml>
to /home/hudson/hudson/jobs/DeltaSpike_AS7/modules/org.apache.deltaspike.modules$jsf-module-project/builds/2013-05-18_02-54-35/archive/org.apache.deltaspike.modules/jsf-module-project/0.4-incubating-SNAPSHOT/jsf-module-project-0.4-incubating-SNAPSHOT.pom
[JENKINS] Archiving <https://builds.apache.org/job/DeltaSpike_AS7/ws/deltaspike/modules/jsf/target/jsf-module-project-0.4-incubating-SNAPSHOT-tests.jar>
to /home/hudson/hudson/jobs/DeltaSpike_AS7/modules/org.apache.deltaspike.modules$jsf-module-project/builds/2013-05-18_02-54-35/archive/org.apache.deltaspike.modules/jsf-module-project/0.4-incubating-SNAPSHOT/jsf-module-project-0.4-incubating-SNAPSHOT-tests.jar
[JENKINS] Archiving <https://builds.apache.org/job/DeltaSpike_AS7/ws/deltaspike/core/api/pom.xml>
to /home/hudson/hudson/jobs/DeltaSpike_AS7/modules/org.apache.deltaspike.core$deltaspike-core-api/builds/2013-05-18_02-54-35/archive/org.apache.deltaspike.core/deltaspike-core-api/0.4-incubating-SNAPSHOT/deltaspike-core-api-0.4-incubating-SNAPSHOT.pom
[JENKINS] Archiving <https://builds.apache.org/job/DeltaSpike_AS7/ws/deltaspike/core/api/target/deltaspike-core-api-0.4-incubating-SNAPSHOT.jar>
to /home/hudson/hudson/jobs/DeltaSpike_AS7/modules/org.apache.deltaspike.core$deltaspike-core-api/builds/2013-05-18_02-54-35/archive/org.apache.deltaspike.core/deltaspike-core-api/0.4-incubating-SNAPSHOT/deltaspike-core-api-0.4-incubating-SNAPSHOT.jar
[JENKINS] Archiving <https://builds.apache.org/job/DeltaSpike_AS7/ws/deltaspike/core/api/target/deltaspike-core-api-0.4-incubating-SNAPSHOT-tests.jar>
to /home/hudson/hudson/jobs/DeltaSpike_AS7/modules/org.apache.deltaspike.core$deltaspike-core-api/builds/2013-05-18_02-54-35/archive/org.apache.deltaspike.core/deltaspike-core-api/0.4-incubating-SNAPSHOT/deltaspike-core-api-0.4-incubating-SNAPSHOT-tests.jar
[JENKINS] Archiving <https://builds.apache.org/job/DeltaSpike_AS7/ws/deltaspike/core/api/target/deltaspike-core-api-0.4-incubating-SNAPSHOT-sources.jar>
to /home/hudson/hudson/jobs/DeltaSpike_AS7/modules/org.apache.deltaspike.core$deltaspike-core-api/builds/2013-05-18_02-54-35/archive/org.apache.deltaspike.core/deltaspike-core-api/0.4-incubating-SNAPSHOT/deltaspike-core-api-0.4-incubating-SNAPSHOT-sources.jar
[JENKINS] Archiving <https://builds.apache.org/job/DeltaSpike_AS7/ws/deltaspike/parent/code/pom.xml>
to /home/hudson/hudson/jobs/DeltaSpike_AS7/modules/org.apache.deltaspike$parent-code/builds/2013-05-18_02-54-35/archive/org.apache.deltaspike/parent-code/0.4-incubating-SNAPSHOT/parent-code-0.4-incubating-SNAPSHOT.pom
[JENKINS] Archiving <https://builds.apache.org/job/DeltaSpike_AS7/ws/deltaspike/parent/code/target/parent-code-0.4-incubating-SNAPSHOT-tests.jar>
to /home/hudson/hudson/jobs/DeltaSpike_AS7/modules/org.apache.deltaspike$parent-code/builds/2013-05-18_02-54-35/archive/org.apache.deltaspike/parent-code/0.4-incubating-SNAPSHOT/parent-code-0.4-incubating-SNAPSHOT-tests.jar
[JENKINS] Archiving <https://builds.apache.org/job/DeltaSpike_AS7/ws/deltaspike/modules/pom.xml>
to /home/hudson/hudson/jobs/DeltaSpike_AS7/modules/org.apache.deltaspike.modules$modules-project/builds/2013-05-18_02-54-35/archive/org.apache.deltaspike.modules/modules-project/0.4-incubating-SNAPSHOT/modules-project-0.4-incubating-SNAPSHOT.pom
[JENKINS] Archiving <https://builds.apache.org/job/DeltaSpike_AS7/ws/deltaspike/modules/target/modules-project-0.4-incubating-SNAPSHOT-tests.jar>
to /home/hudson/hudson/jobs/DeltaSpike_AS7/modules/org.apache.deltaspike.modules$modules-project/builds/2013-05-18_02-54-35/archive/org.apache.deltaspike.modules/modules-project/0.4-incubating-SNAPSHOT/modules-project-0.4-incubating-SNAPSHOT-tests.jar
[JENKINS] Archiving <https://builds.apache.org/job/DeltaSpike_AS7/ws/deltaspike/modules/jpa/impl/pom.xml>
to /home/hudson/hudson/jobs/DeltaSpike_AS7/modules/org.apache.deltaspike.modules$deltaspike-jpa-module-impl/builds/2013-05-18_02-54-35/archive/org.apache.deltaspike.modules/deltaspike-jpa-module-impl/0.4-incubating-SNAPSHOT/deltaspike-jpa-module-impl-0.4-incubating-SNAPSHOT.pom
[JENKINS] Archiving <https://builds.apache.org/job/DeltaSpike_AS7/ws/deltaspike/modules/jpa/impl/target/deltaspike-jpa-module-impl-0.4-incubating-SNAPSHOT.jar>
to /home/hudson/hudson/jobs/DeltaSpike_AS7/modules/org.apache.deltaspike.modules$deltaspike-jpa-module-impl/builds/2013-05-18_02-54-35/archive/org.apache.deltaspike.modules/deltaspike-jpa-module-impl/0.4-incubating-SNAPSHOT/deltaspike-jpa-module-impl-0.4-incubating-SNAPSHOT.jar
[JENKINS] Archiving <https://builds.apache.org/job/DeltaSpike_AS7/ws/deltaspike/modules/jpa/impl/target/deltaspike-jpa-module-impl-0.4-incubating-SNAPSHOT-tests.jar>
to /home/hudson/hudson/jobs/DeltaSpike_AS7/modules/org.apache.deltaspike.modules$deltaspike-jpa-module-impl/builds/2013-05-18_02-54-35/archive/org.apache.deltaspike.modules/deltaspike-jpa-module-impl/0.4-incubating-SNAPSHOT/deltaspike-jpa-module-impl-0.4-incubating-SNAPSHOT-tests.jar
[JENKINS] Archiving <https://builds.apache.org/job/DeltaSpike_AS7/ws/deltaspike/modules/jpa/impl/target/deltaspike-jpa-module-impl-0.4-incubating-SNAPSHOT-sources.jar>
to /home/hudson/hudson/jobs/DeltaSpike_AS7/modules/org.apache.deltaspike.modules$deltaspike-jpa-module-impl/builds/2013-05-18_02-54-35/archive/org.apache.deltaspike.modules/deltaspike-jpa-module-impl/0.4-incubating-SNAPSHOT/deltaspike-jpa-module-impl-0.4-incubating-SNAPSHOT-sources.jar
[JENKINS] Archiving <https://builds.apache.org/job/DeltaSpike_AS7/ws/deltaspike/modules/security/impl/pom.xml>
to /home/hudson/hudson/jobs/DeltaSpike_AS7/modules/org.apache.deltaspike.modules$deltaspike-security-module-impl/builds/2013-05-18_02-54-35/archive/org.apache.deltaspike.modules/deltaspike-security-module-impl/0.4-incubating-SNAPSHOT/deltaspike-security-module-impl-0.4-incubating-SNAPSHOT.pom
[JENKINS] Archiving <https://builds.apache.org/job/DeltaSpike_AS7/ws/deltaspike/modules/security/impl/target/deltaspike-security-module-impl-0.4-incubating-SNAPSHOT.jar>
to /home/hudson/hudson/jobs/DeltaSpike_AS7/modules/org.apache.deltaspike.modules$deltaspike-security-module-impl/builds/2013-05-18_02-54-35/archive/org.apache.deltaspike.modules/deltaspike-security-module-impl/0.4-incubating-SNAPSHOT/deltaspike-security-module-impl-0.4-incubating-SNAPSHOT.jar
[JENKINS] Archiving <https://builds.apache.org/job/DeltaSpike_AS7/ws/deltaspike/modules/security/impl/target/deltaspike-security-module-impl-0.4-incubating-SNAPSHOT-tests.jar>
to /home/hudson/hudson/jobs/DeltaSpike_AS7/modules/org.apache.deltaspike.modules$deltaspike-security-module-impl/builds/2013-05-18_02-54-35/archive/org.apache.deltaspike.modules/deltaspike-security-module-impl/0.4-incubating-SNAPSHOT/deltaspike-security-module-impl-0.4-incubating-SNAPSHOT-tests.jar
[JENKINS] Archiving <https://builds.apache.org/job/DeltaSpike_AS7/ws/deltaspike/modules/security/impl/target/deltaspike-security-module-impl-0.4-incubating-SNAPSHOT-sources.jar>
to /home/hudson/hudson/jobs/DeltaSpike_AS7/modules/org.apache.deltaspike.modules$deltaspike-security-module-impl/builds/2013-05-18_02-54-35/archive/org.apache.deltaspike.modules/deltaspike-security-module-impl/0.4-incubating-SNAPSHOT/deltaspike-security-module-impl-0.4-incubating-SNAPSHOT-sources.jar
[JENKINS] Archiving <https://builds.apache.org/job/DeltaSpike_AS7/ws/deltaspike/modules/jpa/api/pom.xml>
to /home/hudson/hudson/jobs/DeltaSpike_AS7/modules/org.apache.deltaspike.modules$deltaspike-jpa-module-api/builds/2013-05-18_02-54-35/archive/org.apache.deltaspike.modules/deltaspike-jpa-module-api/0.4-incubating-SNAPSHOT/deltaspike-jpa-module-api-0.4-incubating-SNAPSHOT.pom
[JENKINS] Archiving <https://builds.apache.org/job/DeltaSpike_AS7/ws/deltaspike/modules/jpa/api/target/deltaspike-jpa-module-api-0.4-incubating-SNAPSHOT.jar>
to /home/hudson/hudson/jobs/DeltaSpike_AS7/modules/org.apache.deltaspike.modules$deltaspike-jpa-module-api/builds/2013-05-18_02-54-35/archive/org.apache.deltaspike.modules/deltaspike-jpa-module-api/0.4-incubating-SNAPSHOT/deltaspike-jpa-module-api-0.4-incubating-SNAPSHOT.jar
[JENKINS] Archiving <https://builds.apache.org/job/DeltaSpike_AS7/ws/deltaspike/modules/jpa/api/target/deltaspike-jpa-module-api-0.4-incubating-SNAPSHOT-tests.jar>
to /home/hudson/hudson/jobs/DeltaSpike_AS7/modules/org.apache.deltaspike.modules$deltaspike-jpa-module-api/builds/2013-05-18_02-54-35/archive/org.apache.deltaspike.modules/deltaspike-jpa-module-api/0.4-incubating-SNAPSHOT/deltaspike-jpa-module-api-0.4-incubating-SNAPSHOT-tests.jar
[JENKINS] Archiving <https://builds.apache.org/job/DeltaSpike_AS7/ws/deltaspike/modules/jpa/api/target/deltaspike-jpa-module-api-0.4-incubating-SNAPSHOT-sources.jar>
to /home/hudson/hudson/jobs/DeltaSpike_AS7/modules/org.apache.deltaspike.modules$deltaspike-jpa-module-api/builds/2013-05-18_02-54-35/archive/org.apache.deltaspike.modules/deltaspike-jpa-module-api/0.4-incubating-SNAPSHOT/deltaspike-jpa-module-api-0.4-incubating-SNAPSHOT-sources.jar
[JENKINS] Archiving <https://builds.apache.org/job/DeltaSpike_AS7/ws/deltaspike/modules/jsf/api/pom.xml>
to /home/hudson/hudson/jobs/DeltaSpike_AS7/modules/org.apache.deltaspike.modules$deltaspike-jsf-module-api/builds/2013-05-18_02-54-35/archive/org.apache.deltaspike.modules/deltaspike-jsf-module-api/0.4-incubating-SNAPSHOT/deltaspike-jsf-module-api-0.4-incubating-SNAPSHOT.pom
[JENKINS] Archiving <https://builds.apache.org/job/DeltaSpike_AS7/ws/deltaspike/modules/jsf/api/target/deltaspike-jsf-module-api-0.4-incubating-SNAPSHOT.jar>
to /home/hudson/hudson/jobs/DeltaSpike_AS7/modules/org.apache.deltaspike.modules$deltaspike-jsf-module-api/builds/2013-05-18_02-54-35/archive/org.apache.deltaspike.modules/deltaspike-jsf-module-api/0.4-incubating-SNAPSHOT/deltaspike-jsf-module-api-0.4-incubating-SNAPSHOT.jar
[JENKINS] Archiving <https://builds.apache.org/job/DeltaSpike_AS7/ws/deltaspike/modules/jsf/api/target/deltaspike-jsf-module-api-0.4-incubating-SNAPSHOT-tests.jar>
to /home/hudson/hudson/jobs/DeltaSpike_AS7/modules/org.apache.deltaspike.modules$deltaspike-jsf-module-api/builds/2013-05-18_02-54-35/archive/org.apache.deltaspike.modules/deltaspike-jsf-module-api/0.4-incubating-SNAPSHOT/deltaspike-jsf-module-api-0.4-incubating-SNAPSHOT-tests.jar
[JENKINS] Archiving <https://builds.apache.org/job/DeltaSpike_AS7/ws/deltaspike/modules/jsf/api/target/deltaspike-jsf-module-api-0.4-incubating-SNAPSHOT-sources.jar>
to /home/hudson/hudson/jobs/DeltaSpike_AS7/modules/org.apache.deltaspike.modules$deltaspike-jsf-module-api/builds/2013-05-18_02-54-35/archive/org.apache.deltaspike.modules/deltaspike-jsf-module-api/0.4-incubating-SNAPSHOT/deltaspike-jsf-module-api-0.4-incubating-SNAPSHOT-sources.jar
[JENKINS] Archiving <https://builds.apache.org/job/DeltaSpike_AS7/ws/deltaspike/examples/pom.xml>
to /home/hudson/hudson/jobs/DeltaSpike_AS7/modules/org.apache.deltaspike.examples$examples-project/builds/2013-05-18_02-54-35/archive/org.apache.deltaspike.examples/examples-project/0.4-incubating-SNAPSHOT/examples-project-0.4-incubating-SNAPSHOT.pom
[JENKINS] Archiving <https://builds.apache.org/job/DeltaSpike_AS7/ws/deltaspike/cdictrl/pom.xml>
to /home/hudson/hudson/jobs/DeltaSpike_AS7/modules/org.apache.deltaspike.cdictrl$cdictrl-project/builds/2013-05-18_02-54-35/archive/org.apache.deltaspike.cdictrl/cdictrl-project/0.4-incubating-SNAPSHOT/cdictrl-project-0.4-incubating-SNAPSHOT.pom
Waiting for Jenkins to finish collecting data
mavenExecutionResult exceptions not empty
message : Internal error: java.lang.reflect.UndeclaredThrowableException
cause : null
Stack trace : 
org.apache.maven.InternalErrorException: Internal error: java.lang.reflect.UndeclaredThrowableException
	at org.apache.maven.lifecycle.internal.BuilderCommon.handleBuildError(BuilderCommon.java:128)
	at org.apache.maven.lifecycle.internal.LifecycleModuleBuilder.buildProject(LifecycleModuleBuilder.java:95)
	at org.apache.maven.lifecycle.internal.LifecycleModuleBuilder.buildProject(LifecycleModuleBuilder.java:59)
	at org.apache.maven.lifecycle.internal.LifecycleStarter.singleThreadedBuild(LifecycleStarter.java:183)
	at org.apache.maven.lifecycle.internal.LifecycleStarter.execute(LifecycleStarter.java:161)
	at org.apache.maven.DefaultMaven.doExecute(DefaultMaven.java:320)
	at org.apache.maven.DefaultMaven.execute(DefaultMaven.java:156)
	at org.jvnet.hudson.maven3.launcher.Maven3Launcher.main(Maven3Launcher.java:79)
	at sun.reflect.NativeMethodAccessorImpl.invoke0(Native Method)
	at sun.reflect.NativeMethodAccessorImpl.invoke(NativeMethodAccessorImpl.java:39)
	at sun.reflect.DelegatingMethodAccessorImpl.invoke(DelegatingMethodAccessorImpl.java:25)
	at java.lang.reflect.Method.invoke(Method.java:597)
	at org.codehaus.plexus.classworlds.launcher.Launcher.launchStandard(Launcher.java:329)
	at org.codehaus.plexus.classworlds.launcher.Launcher.launch(Launcher.java:239)
	at org.jvnet.hudson.maven3.agent.Maven3Main.launch(Maven3Main.java:158)
	at hudson.maven.Maven3Builder.call(Maven3Builder.java:100)
	at hudson.maven.Maven3Builder.call(Maven3Builder.java:66)
	at hudson.remoting.UserRequest.perform(UserRequest.java:118)
	at hudson.remoting.UserRequest.perform(UserRequest.java:48)
	at hudson.remoting.Request$2.run(Request.java:326)
	at hudson.remoting.InterceptingExecutorService$1.call(InterceptingExecutorService.java:72)
	at java.util.concurrent.FutureTask$Sync.innerRun(FutureTask.java:303)
	at java.util.concurrent.FutureTask.run(FutureTask.java:138)
	at java.util.concurrent.ThreadPoolExecutor$Worker.runTask(ThreadPoolExecutor.java:895)
	at java.util.concurrent.ThreadPoolExecutor$Worker.run(ThreadPoolExecutor.java:918)
	at java.lang.Thread.run(Thread.java:662)
Caused by: java.lang.reflect.UndeclaredThrowableException
	at com.sun.proxy.$Proxy2.setExecutedMojos(Unknown Source)
	at hudson.maven.MavenBuildProxy$Filter.setExecutedMojos(MavenBuildProxy.java:243)
	at hudson.maven.Maven3Builder$MavenExecutionListener.recordMojoEnded(Maven3Builder.java:439)
	at hudson.maven.Maven3Builder$MavenExecutionListener.mojoSucceeded(Maven3Builder.java:425)
	at org.apache.maven.lifecycle.internal.DefaultExecutionEventCatapult.fire(DefaultExecutionEventCatapult.java:87)
	at org.apache.maven.lifecycle.internal.DefaultExecutionEventCatapult.fire(DefaultExecutionEventCatapult.java:42)
	at org.apache.maven.lifecycle.internal.MojoExecutor.execute(MojoExecutor.java:228)
	at org.apache.maven.lifecycle.internal.MojoExecutor.execute(MojoExecutor.java:153)
	at org.apache.maven.lifecycle.internal.MojoExecutor.execute(MojoExecutor.java:145)
	at org.apache.maven.lifecycle.internal.LifecycleModuleBuilder.buildProject(LifecycleModuleBuilder.java:84)
	... 24 more
Caused by: java.io.UTFDataFormatException
	at java.io.ObjectInputStream$BlockDataInputStream.readUTFSpan(ObjectInputStream.java:3105)
	at java.io.ObjectInputStream$BlockDataInputStream.readUTFBody(ObjectInputStream.java:3030)
	at java.io.ObjectInputStream$BlockDataInputStream.readUTF(ObjectInputStream.java:2843)
	at java.io.ObjectInputStream.readString(ObjectInputStream.java:1617)
	at java.io.ObjectInputStream.readObject0(ObjectInputStream.java:1338)
	at java.io.ObjectInputStream.defaultReadFields(ObjectInputStream.java:1970)
	at java.io.ObjectInputStream.readSerialData(ObjectInputStream.java:1894)
	at java.io.ObjectInputStream.readOrdinaryObject(ObjectInputStream.java:1777)
	at java.io.ObjectInputStream.readObject0(ObjectInputStream.java:1347)
	at java.io.ObjectInputStream.readArray(ObjectInputStream.java:1685)
	at java.io.ObjectInputStream.readObject0(ObjectInputStream.java:1341)
	at java.io.ObjectInputStream.defaultReadFields(ObjectInputStream.java:1970)
	at java.io.ObjectInputStream.defaultReadObject(ObjectInputStream.java:498)
	at java.lang.Throwable.readObject(Throwable.java:913)
	at sun.reflect.GeneratedMethodAccessor121.invoke(Unknown Source)
	at sun.reflect.DelegatingMethodAccessorImpl.invoke(DelegatingMethodAccessorImpl.java:43)
	at java.lang.reflect.Method.invoke(Method.java:601)
	at java.io.ObjectStreamClass.invokeReadObject(ObjectStreamClass.java:1004)
	at java.io.ObjectInputStream.readSerialData(ObjectInputStream.java:1872)
	at java.io.ObjectInputStream.readOrdinaryObject(ObjectInputStream.java:1777)
	at java.io.ObjectInputStream.readObject0(ObjectInputStream.java:1347)
	at java.io.ObjectInputStream.defaultReadFields(ObjectInputStream.java:1970)
	at java.io.ObjectInputStream.readSerialData(ObjectInputStream.java:1894)
	at java.io.ObjectInputStream.readOrdinaryObject(ObjectInputStream.java:1777)
	at java.io.ObjectInputStream.readObject0(ObjectInputStream.java:1347)
	at java.io.ObjectInputStream.readObject(ObjectInputStream.java:369)
	at hudson.remoting.UserRequest.deserialize(UserRequest.java:182)
	at hudson.remoting.UserRequest.perform(UserRequest.java:98)
	at hudson.remoting.UserRequest.perform(UserRequest.java:48)
	at hudson.remoting.Request$2.run(Request.java:326)
	at hudson.remoting.InterceptingExecutorService$1.call(InterceptingExecutorService.java:72)
	at java.util.concurrent.FutureTask$Sync.innerRun(FutureTask.java:334)
	at java.util.concurrent.FutureTask.run(FutureTask.java:166)
	at java.util.concurrent.ThreadPoolExecutor.runWorker(ThreadPoolExecutor.java:1145)
	at java.util.concurrent.ThreadPoolExecutor$Worker.run(ThreadPoolExecutor.java:615)
	at java.lang.Thread.run(Thread.java:722)
Sending e-mails to: deltaspike-commits@incubator.apache.org
channel stopped

Mime
View raw message