db-torque-user mailing list archives

Site index · List index
Message view « Date » · « Thread »
Top « Date » · « Thread »
From Jürgen Hoffmann ...@byteaction.de>
Subject Maven turbine-fulcrum
Date Mon, 15 Sep 2003 10:26:28 GMT
Hi all,

Tried it with maven -X torque:om-generate but i get the following

I am using the tagged maven rc1 version. 

M:\eclipse\workspace\jakarta-turbine-fulcrum>maven -X torque:om-generate
 __  __
|  \/  |__ _Apache__ ___
| |\/| / _` \ V / -_) ' \  ~ intelligent projects ~
|_|  |_\__,_|\_/\___|_||_|  v. 1.0-rc1-SNAPSHOT

[DEBUG] Adding reference: maven.dependency.classpath -> D:\Dokumente und
Einstellungen\buddy.BUDDYXP\.maven\repository\avalon-framework\jars\avalon-fram
ework-4.1.4.jar;D:\Dokumente und Einstellungen\
uddy.BUDDYXP\.maven\repository\commons-lang\jars\commons-lang-20030203.000129.j
ar;D:\Dokumente und
Einstellungen\buddy.BUDDYXP\.maven\repository\commons-io\jars\commons-io-200302
03.000550.jar;D:\Doku
ente und
Einstellungen\buddy.BUDDYXP\.maven\repository\log4j\jars\log4j-1.2.8.jar;D:\Dok
umente und
Einstellungen\buddy.BUDDYXP\.maven\repository\commons-collections\jars\commons-
collections-2.1.jar;D
\Dokumente und
Einstellungen\buddy.BUDDYXP\.maven\repository\commons-configuration\jars\common
s-configuration-20030706.202021.jar;D:\Dokumente und
Einstellungen\buddy.BUDDYXP\.maven\repository\excali
ur-component\jars\excalibur-component-1.1.jar;D:\Dokumente und
Einstellungen\buddy.BUDDYXP\.maven\repository\excalibur-instrument\jars\excalib
ur-instrument-1.0.jar;D:\Dokumente und Einstellungen\budd
.BUDDYXP\.maven\repository\excalibur-logger\jars\excalibur-logger-1.0.1.jar;D:\
Dokumente und
Einstellungen\buddy.BUDDYXP\.maven\repository\excalibur-pool\jars\excalibur-poo
l-1.2.jar;D:\Dokumente und
instellungen\buddy.BUDDYXP\.maven\repository\logkit\jars\logkit-1.0.1.jar;D:\Do
kumente und
Einstellungen\buddy.BUDDYXP\.maven\repository\velocity\jars\velocity-1.4-dev.ja
r;D:\Dokumente und Einstellun
en\buddy.BUDDYXP\.maven\repository\commons-jelly\jars\commons-jelly-tags-veloci
ty-20030211.144921.jar;D:\Dokumente und
Einstellungen\buddy.BUDDYXP\.maven\repository\torque\jars\torque-gen-3.1.jar;D:
\
okumente und
Einstellungen\buddy.BUDDYXP\.maven\repository\torque-gen\jars\torque-gen-3.1.ja
r
    [available] [VERBOSE] Found: src\java
    [available] [VERBOSE] Found: src\test
[DEBUG] Adding reference: maven-classpath ->
[DEBUG] Adding reference: maven.compile.src.set ->
[DEBUG] Adding reference: maven.test.compile.src.set ->
[DEBUG] Adding reference: maven.dependency.classpath ->
[DEBUG] Adding reference: maven-classpath ->
[DEBUG] Adding reference: maven.compile.src.set ->
[DEBUG] Adding reference: maven.test.compile.src.set ->
[DEBUG] Adding reference: maven.dependency.classpath -> D:\Dokumente und
Einstellungen\buddy.BUDDYXP\.maven\repository\commons-collections\jars\commons-
collections-2.1.jar;D:\Dokumente und Einstellun
en\buddy.BUDDYXP\.maven\repository\commons-configuration\jars\commons-configura
tion-20030311.152757.jar;D:\Dokumente und
Einstellungen\buddy.BUDDYXP\.maven\repository\commons-dbcp\jars\commons-dbcp-1
1-dev.20021231.055112.jar;D:\Dokumente und
Einstellungen\buddy.BUDDYXP\.maven\repository\commons-lang\jars\commons-lang-1.
0.1.jar;D:\Dokumente und Einstellungen\buddy.BUDDYXP\.maven\repository\common
-logging\jars\commons-logging-1.0.3.jar;D:\Dokumente und
Einstellungen\buddy.BUDDYXP\.maven\repository\log4j\jars\log4j-1.2.8.jar;D:\Dok
umente und Einstellungen\buddy.BUDDYXP\.maven\repository\stratu
\jars\stratum-1.0-b3.jar;D:\Dokumente und
Einstellungen\buddy.BUDDYXP\.maven\repository\torque\jars\torque-gen-3.1-alpha2
.jar;D:\Dokumente und Einstellungen\buddy.BUDDYXP\.maven\repository\velocity\j
rs\velocity-1.4-dev.jar;D:\Dokumente und
Einstellungen\buddy.BUDDYXP\.maven\repository\village\jars\village-2.0-dev-2002
1111.jar;D:\Dokumente und Einstellungen\buddy.BUDDYXP\.maven\repository\xerces\
ars\xerces-2.4.0.jar;D:\Dokumente und
Einstellungen\buddy.BUDDYXP\.maven\repository\xml-apis\jars\xml-apis-1.0.b2.jar
[DEBUG] Adding reference: maven-classpath ->
[DEBUG] Adding reference: maven.compile.src.set ->
[DEBUG] Adding reference: maven.test.compile.src.set ->
torque:init:
[DEBUG] Adding reference: torque-classpath ->
    [property] [VERBOSE] Loading
M:\maven\plugins\maven-torque-plugin-3.1\plugin.properties
    [property] [VERBOSE] Property ${databaseUrl} has not been set
    [property] [VERBOSE] Property ${databaseDriver} has not been set
    [property] [VERBOSE] Property ${buildDatabaseUrl} has not been set
    [property] [VERBOSE] Property ${databasePassword} has not been set
    [property] [VERBOSE] Property ${databaseHost} has not been set
    [property] [VERBOSE] Property ${database} has not been set
    [property] [VERBOSE] Property ${databaseSchema} has not been set
    [property] [VERBOSE] Property ${createDatabaseUrl} has not been set
    [property] [VERBOSE] Property ${databaseUser} has not been set
    [property] [VERBOSE] Property ${databaseName} has not been set
    [taskdef] [DEBUG] Class org.apache.torque.task.TorqueDataModelTask loaded
from parent loader
    [taskdef] [DEBUG]  +User task: torque-data-model
org.apache.torque.task.TorqueDataModelTask
    [taskdef] [DEBUG] Class org.apache.torque.task.TorqueDataDumpTask loaded
from parent loader
    [taskdef] [DEBUG]  +User task: torque-data-dump
org.apache.torque.task.TorqueDataDumpTask
    [taskdef] [DEBUG] Class org.apache.torque.task.TorqueDataSQLTask loaded
from parent loader
    [taskdef] [DEBUG]  +User task: torque-data-sql
org.apache.torque.task.TorqueDataSQLTask
    [taskdef] [DEBUG] Class org.apache.torque.task.TorqueDocumentationTask
loaded from parent loader
    [taskdef] [DEBUG]  +User task: torque-doc
org.apache.torque.task.TorqueDocumentationTask
    [taskdef] [DEBUG] Class org.apache.torque.task.TorqueJDBCTransformTask
loaded from parent loader
    [taskdef] [DEBUG]  +User task: torque-jdbc-transform
org.apache.torque.task.TorqueJDBCTransformTask
    [taskdef] [DEBUG] Class org.apache.torque.task.PackageAsPathTask loaded
from parent loader
    [taskdef] [DEBUG]  +User task: torque-package-to-path
org.apache.torque.task.PackageAsPathTask
    [taskdef] [DEBUG] Class org.apache.torque.task.TorqueSQLTask loaded from
parent loader
    [taskdef] [DEBUG]  +User task: torque-sql
org.apache.torque.task.TorqueSQLTask
    [taskdef] [DEBUG] Class org.apache.torque.task.TorqueSQLExec loaded from
parent loader
    [taskdef] [DEBUG]  +User task: torque-sql-exec
org.apache.torque.task.TorqueSQLExec
    [taskdef] [DEBUG] Class org.apache.torque.task.TorqueSQLTransformTask
loaded from parent loader
    [taskdef] [DEBUG]  +User task: torque-sql-transform
org.apache.torque.task.TorqueSQLTransformTask

torque:om-generate:
    [torque-data-model] Using classpath
    [torque-data-model] Generating to file
M:\eclipse\workspace\jakarta-turbine-fulcrum\src\java\report.org.apache.commons
.grant.GrantProject@24c4a3.om.generation
    [torque-data-model] [DEBUG] fileset: Setup scanner in dir
M:\eclipse\workspace\jakarta-turbine-fulcrum\src\schema with patternSet{
includes: [*-schema.xml] excludes: [id-table-schema.xml] }
log4j:WARN No appenders could be found for logger
(org.apache.torque.engine.database.transform.XmlToAppData).
log4j:WARN Please initialize the log4j system properly.

BUILD FAILED
File...... file:/D:/Dokumente und
Einstellungen/buddy.BUDDYXP/.maven/plugins/maven-torque-plugin-3.2-SNAPSHOT/
Element... torque-data-model
Line...... 228
Column.... 49
Resource not found. For more information consult the velocity log, or invoke
ant with the -debug flag.
com.werken.werkz.UnattainableGoalException: Unable to obtain goal
[torque:om-generate] -- file:/D:/Dokumente und
Einstellungen/buddy.BUDDYXP/.maven/plugins/maven-torque-plugin-3.2-SNAPSHOT/:22
8:49: <
orque-data-model> Resource not found. For more information consult the velocity
log, or invoke ant with the -debug flag.
        at com.werken.werkz.Goal.fire(Goal.java:646)
        at com.werken.werkz.Goal.attain(Goal.java:575)
        at
org.apache.maven.plugin.PluginManager.attainGoals(PluginManager.java:455)
        at org.apache.maven.MavenSession.attainGoals(MavenSession.java:348)
        at org.apache.maven.cli.App.doMain(App.java:534)
        at org.apache.maven.cli.App.main(App.java:1097)
        at sun.reflect.NativeMethodAccessorImpl.invoke0(Native Method)
        at
sun.reflect.NativeMethodAccessorImpl.invoke(NativeMethodAccessorImpl.java:39)
        at
sun.reflect.DelegatingMethodAccessorImpl.invoke(DelegatingMethodAccessorImpl.ja
va:25)
        at java.lang.reflect.Method.invoke(Method.java:324)
        at com.werken.forehead.Forehead.run(Forehead.java:543)
        at com.werken.forehead.Forehead.main(Forehead.java:573)
org.apache.commons.jelly.JellyTagException: file:/D:/Dokumente und
Einstellungen/buddy.BUDDYXP/.maven/plugins/maven-torque-plugin-3.2-SNAPSHOT/:22
8:49: <torque-data-model> Resource not found. For mor
 information consult the velocity log, or invoke ant with the -debug flag.
        at
org.apache.commons.jelly.impl.TagScript.handleException(TagScript.java:683)
        at org.apache.commons.jelly.impl.TagScript.run(TagScript.java:288)
        at org.apache.commons.jelly.impl.ScriptBlock.run(ScriptBlock.java:135)
        at org.apache.commons.jelly.TagSupport.invokeBody(TagSupport.java:233)
        at org.apache.commons.jelly.tags.core.WhenTag.doTag(WhenTag.java:92)
        at org.apache.commons.jelly.impl.TagScript.run(TagScript.java:279)
        at org.apache.commons.jelly.impl.ScriptBlock.run(ScriptBlock.java:135)
        at org.apache.commons.jelly.TagSupport.invokeBody(TagSupport.java:233)
        at
org.apache.commons.jelly.tags.core.ChooseTag.doTag(ChooseTag.java:84)
        at org.apache.commons.jelly.impl.TagScript.run(TagScript.java:279)
        at org.apache.commons.jelly.impl.ScriptBlock.run(ScriptBlock.java:135)
        at org.apache.commons.jelly.TagSupport.invokeBody(TagSupport.java:233)
        at com.werken.werkz.jelly.GoalTag$1.performAction(GoalTag.java:128)
        at com.werken.werkz.Goal.fire(Goal.java:639)
        at com.werken.werkz.Goal.attain(Goal.java:575)
        at
org.apache.maven.plugin.PluginManager.attainGoals(PluginManager.java:455)
        at org.apache.maven.MavenSession.attainGoals(MavenSession.java:348)
        at org.apache.maven.cli.App.doMain(App.java:534)
        at org.apache.maven.cli.App.main(App.java:1097)
        at sun.reflect.NativeMethodAccessorImpl.invoke0(Native Method)
        at
sun.reflect.NativeMethodAccessorImpl.invoke(NativeMethodAccessorImpl.java:39)
        at
sun.reflect.DelegatingMethodAccessorImpl.invoke(DelegatingMethodAccessorImpl.ja
va:25)
        at java.lang.reflect.Method.invoke(Method.java:324)
        at com.werken.forehead.Forehead.run(Forehead.java:543)
        at com.werken.forehead.Forehead.main(Forehead.java:573)
Caused by: Resource not found. For more information consult the velocity log,
or invoke ant with the -debug flag.
        at org.apache.velocity.texen.ant.TexenTask.execute(TexenTask.java:579)
        at org.apache.tools.ant.Task.perform(Task.java:341)
        at org.apache.commons.jelly.tags.ant.AntTag.doTag(AntTag.java:232)
        at org.apache.commons.jelly.impl.TagScript.run(TagScript.java:279)
        ... 23 more
Caused by: org.apache.velocity.exception.ResourceNotFoundException: Unable to
find resource 'om/Control.vm'
        at
org.apache.velocity.runtime.resource.ResourceManagerImpl.loadResource(ResourceM
anagerImpl.java:499)
        at
org.apache.velocity.runtime.resource.ResourceManagerImpl.getResource(ResourceMa
nagerImpl.java:382)
        at
org.apache.velocity.runtime.RuntimeInstance.getTemplate(RuntimeInstance.java:88
2)
        at
org.apache.velocity.runtime.RuntimeInstance.getTemplate(RuntimeInstance.java:86
4)
        at
org.apache.velocity.app.VelocityEngine.getTemplate(VelocityEngine.java:512)
        at org.apache.velocity.texen.Generator.getTemplate(Generator.java:335)
        at org.apache.velocity.texen.Generator.parse(Generator.java:463)
        at org.apache.velocity.texen.ant.TexenTask.execute(TexenTask.java:556)
        ... 26 more
Root cause
Resource not found. For more information consult the velocity log, or invoke
ant with the -debug flag.
        at org.apache.velocity.texen.ant.TexenTask.execute(TexenTask.java:579)
        at org.apache.tools.ant.Task.perform(Task.java:341)
        at org.apache.commons.jelly.tags.ant.AntTag.doTag(AntTag.java:232)
        at org.apache.commons.jelly.impl.TagScript.run(TagScript.java:279)
        at org.apache.commons.jelly.impl.ScriptBlock.run(ScriptBlock.java:135)
        at org.apache.commons.jelly.TagSupport.invokeBody(TagSupport.java:233)
        at org.apache.commons.jelly.tags.core.WhenTag.doTag(WhenTag.java:92)
        at org.apache.commons.jelly.impl.TagScript.run(TagScript.java:279)
        at org.apache.commons.jelly.impl.ScriptBlock.run(ScriptBlock.java:135)
        at org.apache.commons.jelly.TagSupport.invokeBody(TagSupport.java:233)
        at
org.apache.commons.jelly.tags.core.ChooseTag.doTag(ChooseTag.java:84)
        at org.apache.commons.jelly.impl.TagScript.run(TagScript.java:279)
        at org.apache.commons.jelly.impl.ScriptBlock.run(ScriptBlock.java:135)
        at org.apache.commons.jelly.TagSupport.invokeBody(TagSupport.java:233)
        at com.werken.werkz.jelly.GoalTag$1.performAction(GoalTag.java:128)
        at com.werken.werkz.Goal.fire(Goal.java:639)
        at com.werken.werkz.Goal.attain(Goal.java:575)
        at
org.apache.maven.plugin.PluginManager.attainGoals(PluginManager.java:455)
        at org.apache.maven.MavenSession.attainGoals(MavenSession.java:348)
        at org.apache.maven.cli.App.doMain(App.java:534)
        at org.apache.maven.cli.App.main(App.java:1097)
        at sun.reflect.NativeMethodAccessorImpl.invoke0(Native Method)
        at
sun.reflect.NativeMethodAccessorImpl.invoke(NativeMethodAccessorImpl.java:39)
        at
sun.reflect.DelegatingMethodAccessorImpl.invoke(DelegatingMethodAccessorImpl.ja
va:25)
        at java.lang.reflect.Method.invoke(Method.java:324)
        at com.werken.forehead.Forehead.run(Forehead.java:543)
        at com.werken.forehead.Forehead.main(Forehead.java:573)
Caused by: org.apache.velocity.exception.ResourceNotFoundException: Unable to
find resource 'om/Control.vm'
        at
org.apache.velocity.runtime.resource.ResourceManagerImpl.loadResource(ResourceM
anagerImpl.java:499)
        at
org.apache.velocity.runtime.resource.ResourceManagerImpl.getResource(ResourceMa
nagerImpl.java:382)
        at
org.apache.velocity.runtime.RuntimeInstance.getTemplate(RuntimeInstance.java:88
2)
        at
org.apache.velocity.runtime.RuntimeInstance.getTemplate(RuntimeInstance.java:86
4)
        at
org.apache.velocity.app.VelocityEngine.getTemplate(VelocityEngine.java:512)
        at org.apache.velocity.texen.Generator.getTemplate(Generator.java:335)
        at org.apache.velocity.texen.Generator.parse(Generator.java:463)
        at org.apache.velocity.texen.ant.TexenTask.execute(TexenTask.java:556)
        ... 26 more
--- Nested Exception ---
org.apache.velocity.exception.ResourceNotFoundException: Unable to find
resource 'om/Control.vm'
        at
org.apache.velocity.runtime.resource.ResourceManagerImpl.loadResource(ResourceM
anagerImpl.java:499)
        at
org.apache.velocity.runtime.resource.ResourceManagerImpl.getResource(ResourceMa
nagerImpl.java:382)
        at
org.apache.velocity.runtime.RuntimeInstance.getTemplate(RuntimeInstance.java:88
2)
        at
org.apache.velocity.runtime.RuntimeInstance.getTemplate(RuntimeInstance.java:86
4)
        at
org.apache.velocity.app.VelocityEngine.getTemplate(VelocityEngine.java:512)
        at org.apache.velocity.texen.Generator.getTemplate(Generator.java:335)
        at org.apache.velocity.texen.Generator.parse(Generator.java:463)
        at org.apache.velocity.texen.ant.TexenTask.execute(TexenTask.java:556)
        at org.apache.tools.ant.Task.perform(Task.java:341)
        at org.apache.commons.jelly.tags.ant.AntTag.doTag(AntTag.java:232)
        at org.apache.commons.jelly.impl.TagScript.run(TagScript.java:279)
        at org.apache.commons.jelly.impl.ScriptBlock.run(ScriptBlock.java:135)
        at org.apache.commons.jelly.TagSupport.invokeBody(TagSupport.java:233)
        at org.apache.commons.jelly.tags.core.WhenTag.doTag(WhenTag.java:92)
        at org.apache.commons.jelly.impl.TagScript.run(TagScript.java:279)
        at org.apache.commons.jelly.impl.ScriptBlock.run(ScriptBlock.java:135)
        at org.apache.commons.jelly.TagSupport.invokeBody(TagSupport.java:233)
        at
org.apache.commons.jelly.tags.core.ChooseTag.doTag(ChooseTag.java:84)
        at org.apache.commons.jelly.impl.TagScript.run(TagScript.java:279)
        at org.apache.commons.jelly.impl.ScriptBlock.run(ScriptBlock.java:135)
        at org.apache.commons.jelly.TagSupport.invokeBody(TagSupport.java:233)
        at com.werken.werkz.jelly.GoalTag$1.performAction(GoalTag.java:128)
        at com.werken.werkz.Goal.fire(Goal.java:639)
        at com.werken.werkz.Goal.attain(Goal.java:575)
        at
org.apache.maven.plugin.PluginManager.attainGoals(PluginManager.java:455)
        at org.apache.maven.MavenSession.attainGoals(MavenSession.java:348)
        at org.apache.maven.cli.App.doMain(App.java:534)
        at org.apache.maven.cli.App.main(App.java:1097)
        at sun.reflect.NativeMethodAccessorImpl.invoke0(Native Method)
        at
sun.reflect.NativeMethodAccessorImpl.invoke(NativeMethodAccessorImpl.java:39)
        at
sun.reflect.DelegatingMethodAccessorImpl.invoke(DelegatingMethodAccessorImpl.ja
va:25)
        at java.lang.reflect.Method.invoke(Method.java:324)
        at com.werken.forehead.Forehead.run(Forehead.java:543)
        at com.werken.forehead.Forehead.main(Forehead.java:573)
Root cause
Resource not found. For more information consult the velocity log, or invoke
ant with the -debug flag.
        at org.apache.velocity.texen.ant.TexenTask.execute(TexenTask.java:579)
        at org.apache.tools.ant.Task.perform(Task.java:341)
        at org.apache.commons.jelly.tags.ant.AntTag.doTag(AntTag.java:232)
        at org.apache.commons.jelly.impl.TagScript.run(TagScript.java:279)
        at org.apache.commons.jelly.impl.ScriptBlock.run(ScriptBlock.java:135)
        at org.apache.commons.jelly.TagSupport.invokeBody(TagSupport.java:233)
        at org.apache.commons.jelly.tags.core.WhenTag.doTag(WhenTag.java:92)
        at org.apache.commons.jelly.impl.TagScript.run(TagScript.java:279)
        at org.apache.commons.jelly.impl.ScriptBlock.run(ScriptBlock.java:135)
        at org.apache.commons.jelly.TagSupport.invokeBody(TagSupport.java:233)
        at
org.apache.commons.jelly.tags.core.ChooseTag.doTag(ChooseTag.java:84)
        at org.apache.commons.jelly.impl.TagScript.run(TagScript.java:279)
        at org.apache.commons.jelly.impl.ScriptBlock.run(ScriptBlock.java:135)
        at org.apache.commons.jelly.TagSupport.invokeBody(TagSupport.java:233)
        at com.werken.werkz.jelly.GoalTag$1.performAction(GoalTag.java:128)
        at com.werken.werkz.Goal.fire(Goal.java:639)
        at com.werken.werkz.Goal.attain(Goal.java:575)
        at
org.apache.maven.plugin.PluginManager.attainGoals(PluginManager.java:455)
        at org.apache.maven.MavenSession.attainGoals(MavenSession.java:348)
        at org.apache.maven.cli.App.doMain(App.java:534)
        at org.apache.maven.cli.App.main(App.java:1097)
        at sun.reflect.NativeMethodAccessorImpl.invoke0(Native Method)
        at
sun.reflect.NativeMethodAccessorImpl.invoke(NativeMethodAccessorImpl.java:39)
        at
sun.reflect.DelegatingMethodAccessorImpl.invoke(DelegatingMethodAccessorImpl.ja
va:25)
        at java.lang.reflect.Method.invoke(Method.java:324)
        at com.werken.forehead.Forehead.run(Forehead.java:543)
        at com.werken.forehead.Forehead.main(Forehead.java:573)
Caused by: org.apache.velocity.exception.ResourceNotFoundException: Unable to
find resource 'om/Control.vm'
        at
org.apache.velocity.runtime.resource.ResourceManagerImpl.loadResource(ResourceM
anagerImpl.java:499)
        at
org.apache.velocity.runtime.resource.ResourceManagerImpl.getResource(ResourceMa
nagerImpl.java:382)
        at
org.apache.velocity.runtime.RuntimeInstance.getTemplate(RuntimeInstance.java:88
2)
        at
org.apache.velocity.runtime.RuntimeInstance.getTemplate(RuntimeInstance.java:86
4)
        at
org.apache.velocity.app.VelocityEngine.getTemplate(VelocityEngine.java:512)
        at org.apache.velocity.texen.Generator.getTemplate(Generator.java:335)
        at org.apache.velocity.texen.Generator.parse(Generator.java:463)
        at org.apache.velocity.texen.ant.TexenTask.execute(TexenTask.java:556)
        ... 26 more
--- Nested Exception ---
org.apache.velocity.exception.ResourceNotFoundException: Unable to find
resource 'om/Control.vm'
        at
org.apache.velocity.runtime.resource.ResourceManagerImpl.loadResource(ResourceM
anagerImpl.java:499)
        at
org.apache.velocity.runtime.resource.ResourceManagerImpl.getResource(ResourceMa
nagerImpl.java:382)
        at
org.apache.velocity.runtime.RuntimeInstance.getTemplate(RuntimeInstance.java:88
2)
        at
org.apache.velocity.runtime.RuntimeInstance.getTemplate(RuntimeInstance.java:86
4)
        at
org.apache.velocity.app.VelocityEngine.getTemplate(VelocityEngine.java:512)
        at org.apache.velocity.texen.Generator.getTemplate(Generator.java:335)
        at org.apache.velocity.texen.Generator.parse(Generator.java:463)
        at org.apache.velocity.texen.ant.TexenTask.execute(TexenTask.java:556)
        at org.apache.tools.ant.Task.perform(Task.java:341)
        at org.apache.commons.jelly.tags.ant.AntTag.doTag(AntTag.java:232)
        at org.apache.commons.jelly.impl.TagScript.run(TagScript.java:279)
        at org.apache.commons.jelly.impl.ScriptBlock.run(ScriptBlock.java:135)
        at org.apache.commons.jelly.TagSupport.invokeBody(TagSupport.java:233)
        at org.apache.commons.jelly.tags.core.WhenTag.doTag(WhenTag.java:92)
        at org.apache.commons.jelly.impl.TagScript.run(TagScript.java:279)
        at org.apache.commons.jelly.impl.ScriptBlock.run(ScriptBlock.java:135)
        at org.apache.commons.jelly.TagSupport.invokeBody(TagSupport.java:233)
        at
org.apache.commons.jelly.tags.core.ChooseTag.doTag(ChooseTag.java:84)
        at org.apache.commons.jelly.impl.TagScript.run(TagScript.java:279)
        at org.apache.commons.jelly.impl.ScriptBlock.run(ScriptBlock.java:135)
        at org.apache.commons.jelly.TagSupport.invokeBody(TagSupport.java:233)
        at com.werken.werkz.jelly.GoalTag$1.performAction(GoalTag.java:128)
        at com.werken.werkz.Goal.fire(Goal.java:639)
        at com.werken.werkz.Goal.attain(Goal.java:575)
        at
org.apache.maven.plugin.PluginManager.attainGoals(PluginManager.java:455)
        at org.apache.maven.MavenSession.attainGoals(MavenSession.java:348)
        at org.apache.maven.cli.App.doMain(App.java:534)
        at org.apache.maven.cli.App.main(App.java:1097)
        at sun.reflect.NativeMethodAccessorImpl.invoke0(Native Method)
        at
sun.reflect.NativeMethodAccessorImpl.invoke(NativeMethodAccessorImpl.java:39)
        at
sun.reflect.DelegatingMethodAccessorImpl.invoke(DelegatingMethodAccessorImpl.ja
va:25)
        at java.lang.reflect.Method.invoke(Method.java:324)
        at com.werken.forehead.Forehead.run(Forehead.java:543)
        at com.werken.forehead.Forehead.main(Forehead.java:573)
Total time:  7 seconds
Finished at: Mon Sep 15 11:54:58 CEST 2003

M:\eclipse\workspace\jakarta-turbine-fulcrum>


Kind regards
 
Jürgen Hoffmann


Mime
View raw message