db-torque-dev mailing list archives

Site index · List index
Message view « Date » · « Thread »
Top « Date » · « Thread »
From Apache Jenkins Server <jenk...@builds.apache.org>
Subject Build failed in Jenkins: torque4-test-project-hsqldb #374
Date Tue, 26 Nov 2019 14:58:52 GMT
See <https://builds.apache.org/job/torque4-test-project-hsqldb/374/display/redirect?page=changes>

Changes:

[gk] - - add missing license header

[gk] - add more missing templates for mysql: *globalSettings*.groovy + vm

[gk] - add templates for mysql: globalSettings.groovy + vm

[gk] - cleanup generated file content and add license header

[gk] Showcase Java Testcontainer
- in profile mysql/docker-resources
- used for mysql adapter + just one test class: DataContainerTest.java (from DataTest.java)
- no need for a running mysql database installed locally
- still support pre-installed database and docker containerized test (cft. pom.xml)

pom.xml:
- generation: need to use docker-maven-plugin to init a temporary database image to generate
sql (in maven torque-maven-plugin), stopping it after this is done
- separate id-table generation and pass on insert into dockerfile (may use some shell script
indirection later)

- remove not used log4j.properties

- TODO use torque.wrapper.configuration.file instead of hard-coded configuration file path,
add tests, add adapters

[gk] - tab fix in dbObjectFieldGetter.vm
- remove alter table drop foreign key and use new globalSettings outlet for mysql to SET FOREIGN_KEY_CHECKS
= 0;
- correct logging target folder

[gk] - correct logging behaviour
- remove log4j configuration (src/test/resources/log4j-test.xml still there)


------------------------------------------
[...truncated 474.97 KB...]
[ERROR] <https://builds.apache.org/job/torque4-test-project-hsqldb/ws/torque-test/target/generated-sources/org/apache/torque/test/bean/BaseNonPkOIntegerFkBean.java>:[151,41]
cannot find symbol
[ERROR] symbol:   variable Objects
[ERROR] location: class org.apache.torque.test.bean.BaseNonPkOIntegerFkBean
[ERROR] <https://builds.apache.org/job/torque4-test-project-hsqldb/ws/torque-test/target/generated-sources/org/apache/torque/test/bean/BaseNonPkOIntegerFkBean.java>:[177,14]
cannot find symbol
[ERROR] symbol:   variable Objects
[ERROR] location: class org.apache.torque.test.bean.BaseNonPkOIntegerFkBean
[ERROR] <https://builds.apache.org/job/torque4-test-project-hsqldb/ws/torque-test/target/generated-sources/org/apache/torque/test/bean/BasePIntegerFkToOPkBean.java>:[151,41]
cannot find symbol
[ERROR] symbol:   variable Objects
[ERROR] location: class org.apache.torque.test.bean.BasePIntegerFkToOPkBean
[ERROR] <https://builds.apache.org/job/torque4-test-project-hsqldb/ws/torque-test/target/generated-sources/org/apache/torque/test/bean/BasePIntegerFkToOPkBean.java>:[177,14]
cannot find symbol
[ERROR] symbol:   variable Objects
[ERROR] location: class org.apache.torque.test.bean.BasePIntegerFkToOPkBean
[ERROR] <https://builds.apache.org/job/torque4-test-project-hsqldb/ws/torque-test/target/generated-sources/org/apache/torque/test/bean/BaseMultiRefBean.java>:[157,14]
cannot find symbol
[ERROR] symbol:   variable Objects
[ERROR] location: class org.apache.torque.test.bean.BaseMultiRefBean
[ERROR] <https://builds.apache.org/job/torque4-test-project-hsqldb/ws/torque-test/target/generated-sources/org/apache/torque/test/bean/BaseMultiRefBean.java>:[163,41]
cannot find symbol
[ERROR] symbol:   variable Objects
[ERROR] location: class org.apache.torque.test.bean.BaseMultiRefBean
[ERROR] <https://builds.apache.org/job/torque4-test-project-hsqldb/ws/torque-test/target/generated-sources/org/apache/torque/test/bean/BaseMultiRefBean.java>:[189,14]
cannot find symbol
[ERROR] symbol:   variable Objects
[ERROR] location: class org.apache.torque.test.bean.BaseMultiRefBean
[ERROR] <https://builds.apache.org/job/torque4-test-project-hsqldb/ws/torque-test/target/generated-sources/org/apache/torque/test/bean/BaseMultiRefBean.java>:[221,14]
cannot find symbol
[ERROR] symbol:   variable Objects
[ERROR] location: class org.apache.torque.test.bean.BaseMultiRefBean
[ERROR] <https://builds.apache.org/job/torque4-test-project-hsqldb/ws/torque-test/target/generated-sources/org/apache/torque/test/bean/BaseMultiRefBean.java>:[227,49]
cannot find symbol
[ERROR] symbol:   variable Objects
[ERROR] location: class org.apache.torque.test.bean.BaseMultiRefBean
[ERROR] <https://builds.apache.org/job/torque4-test-project-hsqldb/ws/torque-test/target/generated-sources/org/apache/torque/test/bean/BaseMultiRefBean.java>:[253,14]
cannot find symbol
[ERROR] symbol:   variable Objects
[ERROR] location: class org.apache.torque.test.bean.BaseMultiRefBean
[ERROR] <https://builds.apache.org/job/torque4-test-project-hsqldb/ws/torque-test/target/generated-sources/org/apache/torque/test/bean/BaseCompPkOtherFkBean.java>:[120,14]
cannot find symbol
[ERROR] symbol:   variable Objects
[ERROR] location: class org.apache.torque.test.bean.BaseCompPkOtherFkBean
[ERROR] <https://builds.apache.org/job/torque4-test-project-hsqldb/ws/torque-test/target/generated-sources/org/apache/torque/test/bean/BaseCompPkOtherFkBean.java>:[148,14]
cannot find symbol
[ERROR] symbol:   variable Objects
[ERROR] location: class org.apache.torque.test.bean.BaseCompPkOtherFkBean
[ERROR] <https://builds.apache.org/job/torque4-test-project-hsqldb/ws/torque-test/target/generated-sources/org/apache/torque/test/bean/BaseCompPkOtherFkBean.java>:[176,14]
cannot find symbol
[ERROR] symbol:   variable Objects
[ERROR] location: class org.apache.torque.test.bean.BaseCompPkOtherFkBean
[ERROR] <https://builds.apache.org/job/torque4-test-project-hsqldb/ws/torque-test/target/generated-sources/org/apache/torque/test/bean/BaseCompPkOtherFkBean.java>:[182,41]
cannot find symbol
[ERROR] symbol:   variable Objects
[ERROR] location: class org.apache.torque.test.bean.BaseCompPkOtherFkBean
[ERROR] <https://builds.apache.org/job/torque4-test-project-hsqldb/ws/torque-test/target/generated-sources/org/apache/torque/test/bean/BaseCompPkOtherFkBean.java>:[208,14]
cannot find symbol
[ERROR] symbol:   variable Objects
[ERROR] location: class org.apache.torque.test.bean.BaseCompPkOtherFkBean
[ERROR] <https://builds.apache.org/job/torque4-test-project-hsqldb/ws/torque-test/target/generated-sources/org/apache/torque/test/bean/BaseCompPkContainsFkBean.java>:[117,14]
cannot find symbol
[ERROR] symbol:   variable Objects
[ERROR] location: class org.apache.torque.test.bean.BaseCompPkContainsFkBean
[ERROR] <https://builds.apache.org/job/torque4-test-project-hsqldb/ws/torque-test/target/generated-sources/org/apache/torque/test/bean/BaseCompPkContainsFkBean.java>:[123,41]
cannot find symbol
[ERROR] symbol:   variable Objects
[ERROR] location: class org.apache.torque.test.bean.BaseCompPkContainsFkBean
[ERROR] <https://builds.apache.org/job/torque4-test-project-hsqldb/ws/torque-test/target/generated-sources/org/apache/torque/test/bean/BaseCompPkContainsFkBean.java>:[149,14]
cannot find symbol
[ERROR] symbol:   variable Objects
[ERROR] location: class org.apache.torque.test.bean.BaseCompPkContainsFkBean
[ERROR] <https://builds.apache.org/job/torque4-test-project-hsqldb/ws/torque-test/target/generated-sources/org/apache/torque/test/bean/BaseCompPkContainsFkBean.java>:[177,14]
cannot find symbol
[ERROR] symbol:   variable Objects
[ERROR] location: class org.apache.torque.test.bean.BaseCompPkContainsFkBean
[ERROR] <https://builds.apache.org/job/torque4-test-project-hsqldb/ws/torque-test/target/generated-sources/org/apache/torque/test/bean/BasePIntegerPkBean.java>:[238,14]
cannot find symbol
[ERROR] symbol:   variable Objects
[ERROR] location: class org.apache.torque.test.bean.BasePIntegerPkBean
[ERROR] <https://builds.apache.org/job/torque4-test-project-hsqldb/ws/torque-test/target/generated-sources/org/apache/torque/test/bean/BaseNullablePIntegerFkBean.java>:[177,14]
cannot find symbol
[ERROR] symbol:   variable Objects
[ERROR] location: class org.apache.torque.test.bean.BaseNullablePIntegerFkBean
[ERROR] <https://builds.apache.org/job/torque4-test-project-hsqldb/ws/torque-test/target/generated-sources/org/apache/torque/test/bean/BaseRequiredPIntegerFkBean.java>:[177,14]
cannot find symbol
[ERROR] symbol:   variable Objects
[ERROR] location: class org.apache.torque.test.bean.BaseRequiredPIntegerFkBean
[ERROR] <https://builds.apache.org/job/torque4-test-project-hsqldb/ws/torque-test/target/generated-sources/org/apache/torque/test/bean/BasePIntegerFkWithDefaultBean.java>:[177,14]
cannot find symbol
[ERROR] symbol:   variable Objects
[ERROR] location: class org.apache.torque.test.bean.BasePIntegerFkWithDefaultBean
[ERROR] <https://builds.apache.org/job/torque4-test-project-hsqldb/ws/torque-test/target/generated-sources/org/apache/torque/test/bean/BaseNonPkPIntegerFkBean.java>:[177,14]
cannot find symbol
[ERROR] symbol:   variable Objects
[ERROR] location: class org.apache.torque.test.bean.BaseNonPkPIntegerFkBean
[ERROR] <https://builds.apache.org/job/torque4-test-project-hsqldb/ws/torque-test/target/generated-sources/org/apache/torque/test/bean/BaseOIntegerFkToPPkBean.java>:[117,14]
cannot find symbol
[ERROR] symbol:   variable Objects
[ERROR] location: class org.apache.torque.test.bean.BaseOIntegerFkToPPkBean
[ERROR] <https://builds.apache.org/job/torque4-test-project-hsqldb/ws/torque-test/target/generated-sources/org/apache/torque/test/bean/BaseOIntegerFkToPPkBean.java>:[145,14]
cannot find symbol
[ERROR] symbol:   variable Objects
[ERROR] location: class org.apache.torque.test.bean.BaseOIntegerFkToPPkBean
[ERROR] <https://builds.apache.org/job/torque4-test-project-hsqldb/ws/torque-test/target/generated-sources/org/apache/torque/test/bean/BaseOIntegerFkToPPkBean.java>:[177,14]
cannot find symbol
[ERROR] symbol:   variable Objects
[ERROR] location: class org.apache.torque.test.bean.BaseOIntegerFkToPPkBean
[ERROR] <https://builds.apache.org/job/torque4-test-project-hsqldb/ws/torque-test/target/generated-sources/org/apache/torque/test/bean/BaseBinaryTypeBean.java>:[142,14]
cannot find symbol
[ERROR] symbol:   variable Objects
[ERROR] location: class org.apache.torque.test.bean.BaseBinaryTypeBean
[ERROR] <https://builds.apache.org/job/torque4-test-project-hsqldb/ws/torque-test/target/generated-sources/org/apache/torque/test/bean/BaseBinaryTypeBean.java>:[170,14]
cannot find symbol
[ERROR] symbol:   variable Objects
[ERROR] location: class org.apache.torque.test.bean.BaseBinaryTypeBean
[ERROR] <https://builds.apache.org/job/torque4-test-project-hsqldb/ws/torque-test/target/generated-sources/org/apache/torque/test/bean/BaseEnumTableBean.java>:[152,14]
cannot find symbol
[ERROR] symbol:   variable Objects
[ERROR] location: class org.apache.torque.test.bean.BaseEnumTableBean
[ERROR] <https://builds.apache.org/job/torque4-test-project-hsqldb/ws/torque-test/target/generated-sources/org/apache/torque/test/bean/BaseEnumTableBean.java>:[180,14]
cannot find symbol
[ERROR] symbol:   variable Objects
[ERROR] location: class org.apache.torque.test.bean.BaseEnumTableBean
[ERROR] <https://builds.apache.org/job/torque4-test-project-hsqldb/ws/torque-test/target/generated-sources/org/apache/torque/test/bean/BaseEnumTableBean.java>:[208,14]
cannot find symbol
[ERROR] symbol:   variable Objects
[ERROR] location: class org.apache.torque.test.bean.BaseEnumTableBean
[ERROR] <https://builds.apache.org/job/torque4-test-project-hsqldb/ws/torque-test/target/generated-sources/org/apache/torque/test/bean/BaseInheritanceClassnameTestBean.java>:[142,14]
cannot find symbol
[ERROR] symbol:   variable Objects
[ERROR] location: class org.apache.torque.test.bean.BaseInheritanceClassnameTestBean
[ERROR] <https://builds.apache.org/job/torque4-test-project-hsqldb/ws/torque-test/target/generated-sources/org/apache/torque/test/bean/BaseInheritanceClassnameTestBean.java>:[170,14]
cannot find symbol
[ERROR] symbol:   variable Objects
[ERROR] location: class org.apache.torque.test.bean.BaseInheritanceClassnameTestBean
[ERROR] <https://builds.apache.org/job/torque4-test-project-hsqldb/ws/torque-test/target/generated-sources/org/apache/torque/test/bean/BaseLocalIfcTableBean.java>:[139,14]
cannot find symbol
[ERROR] symbol:   variable Objects
[ERROR] location: class org.apache.torque.test.bean.BaseLocalIfcTableBean
[ERROR] <https://builds.apache.org/job/torque4-test-project-hsqldb/ws/torque-test/target/generated-sources/org/apache/torque/test/bean/BaseBaseTableBean.java>:[110,14]
cannot find symbol
[ERROR] symbol:   variable Objects
[ERROR] location: class org.apache.torque.test.bean.BaseBaseTableBean
[ERROR] <https://builds.apache.org/job/torque4-test-project-hsqldb/ws/torque-test/target/generated-sources/org/apache/torque/test/bean/BaseBaseTableBean.java>:[138,14]
cannot find symbol
[ERROR] symbol:   variable Objects
[ERROR] location: class org.apache.torque.test.bean.BaseBaseTableBean
[ERROR] <https://builds.apache.org/job/torque4-test-project-hsqldb/ws/torque-test/target/generated-sources/org/apache/torque/test/bean/BaseCurrentTimeTableBean.java>:[180,14]
cannot find symbol
[ERROR] symbol:   variable Objects
[ERROR] location: class org.apache.torque.test.bean.BaseCurrentTimeTableBean
[ERROR] <https://builds.apache.org/job/torque4-test-project-hsqldb/ws/torque-test/target/generated-sources/org/apache/torque/test/bean/BaseAutoincrementNativeBean.java>:[137,14]
cannot find symbol
[ERROR] symbol:   variable Objects
[ERROR] location: class org.apache.torque.test.bean.BaseAutoincrementNativeBean
[ERROR] <https://builds.apache.org/job/torque4-test-project-hsqldb/ws/torque-test/target/generated-sources/org/apache/torque/test/bean/BaseDatePkBean.java>:[110,14]
cannot find symbol
[ERROR] symbol:   variable Objects
[ERROR] location: class org.apache.torque.test.bean.BaseDatePkBean
[ERROR] <https://builds.apache.org/job/torque4-test-project-hsqldb/ws/torque-test/target/generated-sources/org/apache/torque/test/bean/BaseDatePkBean.java>:[138,14]
cannot find symbol
[ERROR] symbol:   variable Objects
[ERROR] location: class org.apache.torque.test.bean.BaseDatePkBean
[ERROR] <https://builds.apache.org/job/torque4-test-project-hsqldb/ws/torque-test/target/generated-sources/org/apache/torque/test/bean/BaseDatabaseDefaultValuesBean.java>:[232,14]
cannot find symbol
[ERROR] symbol:   variable Objects
[ERROR] location: class org.apache.torque.test.bean.BaseDatabaseDefaultValuesBean
[ERROR] <https://builds.apache.org/job/torque4-test-project-hsqldb/ws/torque-test/target/generated-sources/org/apache/torque/test/bean/BaseDatabaseDefaultValuesBean.java>:[288,14]
cannot find symbol
[ERROR] symbol:   variable Objects
[ERROR] location: class org.apache.torque.test.bean.BaseDatabaseDefaultValuesBean
[ERROR] <https://builds.apache.org/job/torque4-test-project-hsqldb/ws/torque-test/target/generated-sources/org/apache/torque/test/bean/BaseDatabaseDefaultValuesBean.java>:[316,14]
cannot find symbol
[ERROR] symbol:   variable Objects
[ERROR] location: class org.apache.torque.test.bean.BaseDatabaseDefaultValuesBean
[ERROR] <https://builds.apache.org/job/torque4-test-project-hsqldb/ws/torque-test/target/generated-sources/org/apache/torque/test/bean/BaseDatabaseDefaultValuesBean.java>:[344,14]
cannot find symbol
[ERROR] symbol:   variable Objects
[ERROR] location: class org.apache.torque.test.bean.BaseDatabaseDefaultValuesBean
[ERROR] <https://builds.apache.org/job/torque4-test-project-hsqldb/ws/torque-test/target/generated-sources/org/apache/torque/test/bean/BaseDatabaseDefaultValuesBean.java>:[372,14]
cannot find symbol
[ERROR] symbol:   variable Objects
[ERROR] location: class org.apache.torque.test.bean.BaseDatabaseDefaultValuesBean
[ERROR] <https://builds.apache.org/job/torque4-test-project-hsqldb/ws/torque-test/target/generated-sources/org/apache/torque/test/bean/BaseTypesObjectBean.java>:[179,14]
cannot find symbol
[ERROR] symbol:   variable Objects
[ERROR] location: class org.apache.torque.test.bean.BaseTypesObjectBean
[ERROR] <https://builds.apache.org/job/torque4-test-project-hsqldb/ws/torque-test/target/generated-sources/org/apache/torque/test/bean/BaseTypesObjectBean.java>:[207,14]
cannot find symbol
[ERROR] symbol:   variable Objects
[ERROR] location: class org.apache.torque.test.bean.BaseTypesObjectBean
[ERROR] <https://builds.apache.org/job/torque4-test-project-hsqldb/ws/torque-test/target/generated-sources/org/apache/torque/test/bean/BaseTypesObjectBean.java>:[235,14]
cannot find symbol
[ERROR] symbol:   variable Objects
[ERROR] location: class org.apache.torque.test.bean.BaseTypesObjectBean
[ERROR] <https://builds.apache.org/job/torque4-test-project-hsqldb/ws/torque-test/target/generated-sources/org/apache/torque/test/bean/BaseTypesObjectBean.java>:[263,14]
cannot find symbol
[ERROR] symbol:   variable Objects
[ERROR] location: class org.apache.torque.test.bean.BaseTypesObjectBean
[ERROR] <https://builds.apache.org/job/torque4-test-project-hsqldb/ws/torque-test/target/generated-sources/org/apache/torque/test/bean/BaseTypesObjectBean.java>:[291,14]
cannot find symbol
[ERROR] symbol:   variable Objects
[ERROR] location: class org.apache.torque.test.bean.BaseTypesObjectBean
[ERROR] <https://builds.apache.org/job/torque4-test-project-hsqldb/ws/torque-test/target/generated-sources/org/apache/torque/test/bean/BaseTypesObjectBean.java>:[319,14]
cannot find symbol
[ERROR] symbol:   variable Objects
[ERROR] location: class org.apache.torque.test.bean.BaseTypesObjectBean
[ERROR] <https://builds.apache.org/job/torque4-test-project-hsqldb/ws/torque-test/target/generated-sources/org/apache/torque/test/bean/BaseTypesObjectBean.java>:[347,14]
cannot find symbol
[ERROR] symbol:   variable Objects
[ERROR] location: class org.apache.torque.test.bean.BaseTypesObjectBean
[ERROR] <https://builds.apache.org/job/torque4-test-project-hsqldb/ws/torque-test/target/generated-sources/org/apache/torque/test/bean/BaseTypesObjectBean.java>:[375,14]
cannot find symbol
[ERROR] symbol:   variable Objects
[ERROR] location: class org.apache.torque.test.bean.BaseTypesObjectBean
[ERROR] <https://builds.apache.org/job/torque4-test-project-hsqldb/ws/torque-test/target/generated-sources/org/apache/torque/test/bean/BaseTypesObjectBean.java>:[403,14]
cannot find symbol
[ERROR] symbol:   variable Objects
[ERROR] location: class org.apache.torque.test.bean.BaseTypesObjectBean
[ERROR] <https://builds.apache.org/job/torque4-test-project-hsqldb/ws/torque-test/target/generated-sources/org/apache/torque/test/bean/BaseTypesObjectBean.java>:[431,14]
cannot find symbol
[ERROR] symbol:   variable Objects
[ERROR] location: class org.apache.torque.test.bean.BaseTypesObjectBean
[ERROR] <https://builds.apache.org/job/torque4-test-project-hsqldb/ws/torque-test/target/generated-sources/org/apache/torque/test/bean/BaseTypesObjectBean.java>:[459,14]
cannot find symbol
[ERROR] symbol:   variable Objects
[ERROR] location: class org.apache.torque.test.bean.BaseTypesObjectBean
[ERROR] <https://builds.apache.org/job/torque4-test-project-hsqldb/ws/torque-test/target/generated-sources/org/apache/torque/test/bean/BaseTypesObjectBean.java>:[487,14]
cannot find symbol
[ERROR] symbol:   variable Objects
[ERROR] location: class org.apache.torque.test.bean.BaseTypesObjectBean
[ERROR] <https://builds.apache.org/job/torque4-test-project-hsqldb/ws/torque-test/target/generated-sources/org/apache/torque/test/bean/BaseTypesObjectBean.java>:[515,14]
cannot find symbol
[ERROR] symbol:   variable Objects
[ERROR] location: class org.apache.torque.test.bean.BaseTypesObjectBean
[ERROR] <https://builds.apache.org/job/torque4-test-project-hsqldb/ws/torque-test/target/generated-sources/org/apache/torque/test/bean/BaseTypesObjectBean.java>:[543,14]
cannot find symbol
[ERROR] symbol:   variable Objects
[ERROR] location: class org.apache.torque.test.bean.BaseTypesObjectBean
[ERROR] <https://builds.apache.org/job/torque4-test-project-hsqldb/ws/torque-test/target/generated-sources/org/apache/torque/test/bean/BaseTypesObjectBean.java>:[571,14]
cannot find symbol
[ERROR] symbol:   variable Objects
[ERROR] location: class org.apache.torque.test.bean.BaseTypesObjectBean
[ERROR] <https://builds.apache.org/job/torque4-test-project-hsqldb/ws/torque-test/target/generated-sources/org/apache/torque/test/bean/BaseTypesObjectBean.java>:[599,14]
cannot find symbol
[ERROR] symbol:   variable Objects
[ERROR] location: class org.apache.torque.test.bean.BaseTypesObjectBean
[ERROR] <https://builds.apache.org/job/torque4-test-project-hsqldb/ws/torque-test/target/generated-sources/org/apache/torque/test/bean/BaseTypesObjectBean.java>:[627,14]
cannot find symbol
[ERROR] symbol:   variable Objects
[ERROR] location: class org.apache.torque.test.bean.BaseTypesObjectBean
[ERROR] <https://builds.apache.org/job/torque4-test-project-hsqldb/ws/torque-test/target/generated-sources/org/apache/torque/test/bean/BaseTypesObjectBean.java>:[655,14]
cannot find symbol
[ERROR] symbol:   variable Objects
[ERROR] location: class org.apache.torque.test.bean.BaseTypesObjectBean
[ERROR] <https://builds.apache.org/job/torque4-test-project-hsqldb/ws/torque-test/target/generated-sources/org/apache/torque/test/bean/BaseTypesObjectBean.java>:[683,14]
cannot find symbol
[ERROR] symbol:   variable Objects
[ERROR] location: class org.apache.torque.test.bean.BaseTypesObjectBean
[ERROR] <https://builds.apache.org/job/torque4-test-project-hsqldb/ws/torque-test/target/generated-sources/org/apache/torque/test/bean/BaseTypesObjectBean.java>:[711,14]
cannot find symbol
[ERROR] symbol:   variable Objects
[ERROR] location: class org.apache.torque.test.bean.BaseTypesObjectBean
[ERROR] <https://builds.apache.org/job/torque4-test-project-hsqldb/ws/torque-test/target/generated-sources/org/apache/torque/test/bean/BaseTypesObjectBean.java>:[739,14]
cannot find symbol
[ERROR] symbol:   variable Objects
[ERROR] location: class org.apache.torque.test.bean.BaseTypesObjectBean
[ERROR] <https://builds.apache.org/job/torque4-test-project-hsqldb/ws/torque-test/target/generated-sources/org/apache/torque/test/bean/BaseTypesObjectBean.java>:[767,14]
cannot find symbol
[ERROR] symbol:   variable Objects
[ERROR] location: class org.apache.torque.test.bean.BaseTypesObjectBean
[ERROR] <https://builds.apache.org/job/torque4-test-project-hsqldb/ws/torque-test/target/generated-sources/org/apache/torque/test/bean/BaseTypesObjectBean.java>:[795,14]
cannot find symbol
[ERROR] symbol:   variable Objects
[ERROR] location: class org.apache.torque.test.bean.BaseTypesObjectBean
[ERROR] <https://builds.apache.org/job/torque4-test-project-hsqldb/ws/torque-test/target/generated-sources/org/apache/torque/test/bean/BaseTypesObjectBean.java>:[823,14]
cannot find symbol
[ERROR] symbol:   variable Objects
[ERROR] location: class org.apache.torque.test.bean.BaseTypesObjectBean
[ERROR] <https://builds.apache.org/job/torque4-test-project-hsqldb/ws/torque-test/target/generated-sources/org/apache/torque/test/bean/BaseCompIntegerVarcharPkBean.java>:[128,14]
cannot find symbol
[ERROR] symbol:   variable Objects
[ERROR] location: class org.apache.torque.test.bean.BaseCompIntegerVarcharPkBean
[ERROR] <https://builds.apache.org/job/torque4-test-project-hsqldb/ws/torque-test/target/generated-sources/org/apache/torque/test/bean/BaseCompIntegerVarcharPkBean.java>:[164,14]
cannot find symbol
[ERROR] symbol:   variable Objects
[ERROR] location: class org.apache.torque.test.bean.BaseCompIntegerVarcharPkBean
[ERROR] -> [Help 1]
[ERROR] 
[ERROR] To see the full stack trace of the errors, re-run Maven with the -e switch.
[ERROR] Re-run Maven using the -X switch to enable full debug logging.
[ERROR] 
[ERROR] For more information about the errors and possible solutions, please read the following
articles:
[ERROR] [Help 1] http://cwiki.apache.org/confluence/display/MAVEN/MojoFailureException
[ERROR] 
[ERROR] After correcting the problems, you can resume the build with the command
[ERROR]   mvn <goals> -rf :torque-test
[JENKINS] Archiving <https://builds.apache.org/job/torque4-test-project-hsqldb/ws/torque-maven-plugin/pom.xml>
to org.apache.torque/torque-maven-plugin/4.1-SNAPSHOT/torque-maven-plugin-4.1-SNAPSHOT.pom
[JENKINS] Archiving <https://builds.apache.org/job/torque4-test-project-hsqldb/ws/torque-maven-plugin/target/torque-maven-plugin-4.1-SNAPSHOT.jar>
to org.apache.torque/torque-maven-plugin/4.1-SNAPSHOT/torque-maven-plugin-4.1-SNAPSHOT.jar
[JENKINS] Archiving <https://builds.apache.org/job/torque4-test-project-hsqldb/ws/pom.xml>
to org.apache.torque/torque/4.1-SNAPSHOT/torque-4.1-SNAPSHOT.pom
[JENKINS] Archiving <https://builds.apache.org/job/torque4-test-project-hsqldb/ws/torque-site/pom.xml>
to org.apache.torque/torque-site/4.1-SNAPSHOT/torque-site-4.1-SNAPSHOT.pom
[JENKINS] Archiving <https://builds.apache.org/job/torque4-test-project-hsqldb/ws/torque-site/target/torque-site-4.1-SNAPSHOT-site.xml>
to org.apache.torque/torque-site/4.1-SNAPSHOT/torque-site-4.1-SNAPSHOT-site.xml
[JENKINS] Archiving <https://builds.apache.org/job/torque4-test-project-hsqldb/ws/torque-generator/pom.xml>
to org.apache.torque/torque-generator/4.1-SNAPSHOT/torque-generator-4.1-SNAPSHOT.pom
[JENKINS] Archiving <https://builds.apache.org/job/torque4-test-project-hsqldb/ws/torque-generator/target/torque-generator-4.1-SNAPSHOT.jar>
to org.apache.torque/torque-generator/4.1-SNAPSHOT/torque-generator-4.1-SNAPSHOT.jar
[JENKINS] Archiving <https://builds.apache.org/job/torque4-test-project-hsqldb/ws/torque-templates/pom.xml>
to org.apache.torque/torque-templates/4.1-SNAPSHOT/torque-templates-4.1-SNAPSHOT.pom
[JENKINS] Archiving <https://builds.apache.org/job/torque4-test-project-hsqldb/ws/torque-templates/target/torque-templates-4.1-SNAPSHOT.jar>
to org.apache.torque/torque-templates/4.1-SNAPSHOT/torque-templates-4.1-SNAPSHOT.jar
[JENKINS] Archiving <https://builds.apache.org/job/torque4-test-project-hsqldb/ws/torque-test/pom.xml>
to org.apache.torque/torque-test/4.1-SNAPSHOT/torque-test-4.1-SNAPSHOT.pom
[JENKINS] Archiving <https://builds.apache.org/job/torque4-test-project-hsqldb/ws/torque-runtime/pom.xml>
to org.apache.torque/torque-runtime/4.1-SNAPSHOT/torque-runtime-4.1-SNAPSHOT.pom
[JENKINS] Archiving <https://builds.apache.org/job/torque4-test-project-hsqldb/ws/torque-runtime/target/torque-runtime-4.1-SNAPSHOT.jar>
to org.apache.torque/torque-runtime/4.1-SNAPSHOT/torque-runtime-4.1-SNAPSHOT.jar
[JENKINS] Archiving <https://builds.apache.org/job/torque4-test-project-hsqldb/ws/torque-ant-tasks/pom.xml>
to org.apache.torque/torque-ant-tasks/4.1-SNAPSHOT/torque-ant-tasks-4.1-SNAPSHOT.pom
[JENKINS] Archiving <https://builds.apache.org/job/torque4-test-project-hsqldb/ws/torque-ant-tasks/target/torque-ant-tasks-4.1-SNAPSHOT.jar>
to org.apache.torque/torque-ant-tasks/4.1-SNAPSHOT/torque-ant-tasks-4.1-SNAPSHOT.jar
No mail will be sent out, as 'torque4-test-project-hsqldb » Torque Generator Maven 2 Plugin
#374' does not have a result yet. Please make sure you set a proper result in case of pipeline/build
scripts.
No mail will be sent out, as 'torque4-test-project-hsqldb » Torque Maven Parent #374' does
not have a result yet. Please make sure you set a proper result in case of pipeline/build
scripts.
No mail will be sent out, as 'torque4-test-project-hsqldb » Torque Site #374' does not
have a result yet. Please make sure you set a proper result in case of pipeline/build scripts.
No mail will be sent out, as 'torque4-test-project-hsqldb » Torque Generator #374' does
not have a result yet. Please make sure you set a proper result in case of pipeline/build
scripts.
No mail will be sent out, as 'torque4-test-project-hsqldb » Torque Templates #374' does
not have a result yet. Please make sure you set a proper result in case of pipeline/build
scripts.
Sending e-mails to: torque-dev@db.apache.org
No mail will be sent out, as 'torque4-test-project-hsqldb » Torque Runtime #374' does not
have a result yet. Please make sure you set a proper result in case of pipeline/build scripts.
No mail will be sent out, as 'torque4-test-project-hsqldb » Torque Generator Ant tasks
#374' does not have a result yet. Please make sure you set a proper result in case of pipeline/build
scripts.
channel stopped

---------------------------------------------------------------------
To unsubscribe, e-mail: torque-dev-unsubscribe@db.apache.org
For additional commands, e-mail: torque-dev-help@db.apache.org


Mime
View raw message