db-torque-dev mailing list archives

Site index · List index
Message view « Date » · « Thread »
Top « Date » · « Thread »
From Apache Jenkins Server <jenk...@builds.apache.org>
Subject Build failed in Jenkins: Torque4-trunk #569
Date Wed, 21 Sep 2016 00:38:32 GMT
See <https://builds.apache.org/job/Torque4-trunk/569/>

------------------------------------------
[...truncated 4172 lines...]
[DEBUG] Located the service 'org.apache.torque.avalon.Torque' in the local container
[DEBUG] Disposing of container...
[DEBUG] Disposing all services
[DEBUG] Decommision the service TorqueComponent
[DEBUG] Decommisioning the service TorqueComponent
[DEBUG] Disposable.dispose() for TorqueComponent
[DEBUG] dispose()
[DEBUG] Disposing the service TorqueComponent
[DEBUG] All services are disposed
[INFO] YaffiContainer has been disposed.
Tests run: 2, Failures: 0, Errors: 0, Skipped: 0, Time elapsed: 0.333 sec - in org.apache.torque.avalon.AvalonTest
Running org.apache.torque.TorqueRuntimeExceptionTest
Tests run: 1, Failures: 0, Errors: 0, Skipped: 0, Time elapsed: 0.161 sec - in org.apache.torque.TorqueRuntimeExceptionTest
Running org.apache.torque.ColumnImplTest
Tests run: 41, Failures: 0, Errors: 0, Skipped: 0, Time elapsed: 0.257 sec - in org.apache.torque.ColumnImplTest
Running org.apache.torque.util.UniqueListTest
Tests run: 2, Failures: 0, Errors: 0, Skipped: 0, Time elapsed: 0.018 sec - in org.apache.torque.util.UniqueListTest
Running org.apache.torque.util.SummaryHelperTest
Tests run: 1, Failures: 0, Errors: 0, Skipped: 0, Time elapsed: 0.529 sec - in org.apache.torque.util.SummaryHelperTest
Running org.apache.torque.util.functions.MaxTest
Tests run: 4, Failures: 0, Errors: 0, Skipped: 0, Time elapsed: 0.028 sec - in org.apache.torque.util.functions.MaxTest
Running org.apache.torque.util.functions.CountTest
Tests run: 4, Failures: 0, Errors: 0, Skipped: 0, Time elapsed: 0.027 sec - in org.apache.torque.util.functions.CountTest
Running org.apache.torque.util.functions.AbstractFunctionTest
Tests run: 11, Failures: 0, Errors: 0, Skipped: 0, Time elapsed: 0.034 sec - in org.apache.torque.util.functions.AbstractFunctionTest
Running org.apache.torque.util.functions.SumTest
Tests run: 4, Failures: 0, Errors: 0, Skipped: 0, Time elapsed: 0.029 sec - in org.apache.torque.util.functions.SumTest
Running org.apache.torque.util.functions.AvgTest
Tests run: 4, Failures: 0, Errors: 0, Skipped: 0, Time elapsed: 0.027 sec - in org.apache.torque.util.functions.AvgTest
Running org.apache.torque.util.functions.MinTest
Tests run: 4, Failures: 0, Errors: 0, Skipped: 0, Time elapsed: 0.028 sec - in org.apache.torque.util.functions.MinTest
Running org.apache.torque.util.functions.AggregateFunctionTest
Tests run: 12, Failures: 0, Errors: 0, Skipped: 0, Time elapsed: 0.03 sec - in org.apache.torque.util.functions.AggregateFunctionTest
Running org.apache.torque.util.BasePeerImplTest
Tests run: 16, Failures: 0, Errors: 0, Skipped: 0, Time elapsed: 0.578 sec - in org.apache.torque.util.BasePeerImplTest
Running org.apache.torque.sql.QueryTest
Tests run: 2, Failures: 0, Errors: 0, Skipped: 0, Time elapsed: 0.163 sec - in org.apache.torque.sql.QueryTest
Running org.apache.torque.sql.SqlBuilderTest
Tests run: 130, Failures: 0, Errors: 0, Skipped: 0, Time elapsed: 0.431 sec - in org.apache.torque.sql.SqlBuilderTest

Results :

Tests run: 365, Failures: 0, Errors: 0, Skipped: 0

[JENKINS] Recording test results
[INFO] 
[INFO] --- maven-jar-plugin:3.0.0:jar (default-jar) @ torque-runtime ---
[INFO] Downloading: https://repo.maven.apache.org/maven2/org/apache/maven/maven-archiver/3.0.2/maven-archiver-3.0.2.pom
[INFO] Downloaded: https://repo.maven.apache.org/maven2/org/apache/maven/maven-archiver/3.0.2/maven-archiver-3.0.2.pom
(5 KB at 505.7 KB/sec)
[INFO] Downloading: https://repo.maven.apache.org/maven2/org/apache/maven/shared/maven-shared-components/22/maven-shared-components-22.pom
[INFO] Downloaded: https://repo.maven.apache.org/maven2/org/apache/maven/shared/maven-shared-components/22/maven-shared-components-22.pom
(5 KB at 713.4 KB/sec)
[INFO] Downloading: https://repo.maven.apache.org/maven2/org/codehaus/plexus/plexus-archiver/3.1.1/plexus-archiver-3.1.1.pom
[INFO] Downloaded: https://repo.maven.apache.org/maven2/org/codehaus/plexus/plexus-archiver/3.1.1/plexus-archiver-3.1.1.pom
(5 KB at 694.6 KB/sec)
[INFO] Downloading: https://repo.maven.apache.org/maven2/org/codehaus/plexus/plexus-io/2.7.1/plexus-io-2.7.1.pom
[INFO] Downloaded: https://repo.maven.apache.org/maven2/org/codehaus/plexus/plexus-io/2.7.1/plexus-io-2.7.1.pom
(5 KB at 800.5 KB/sec)
[INFO] Downloading: https://repo.maven.apache.org/maven2/org/apache/maven/maven-archiver/3.0.2/maven-archiver-3.0.2.jar
[INFO] Downloading: https://repo.maven.apache.org/maven2/org/codehaus/plexus/plexus-archiver/3.1.1/plexus-archiver-3.1.1.jar
[INFO] Downloading: https://repo.maven.apache.org/maven2/org/codehaus/plexus/plexus-io/2.7.1/plexus-io-2.7.1.jar
[INFO] Downloaded: https://repo.maven.apache.org/maven2/org/codehaus/plexus/plexus-io/2.7.1/plexus-io-2.7.1.jar
(84 KB at 5587.3 KB/sec)
[INFO] Downloaded: https://repo.maven.apache.org/maven2/org/apache/maven/maven-archiver/3.0.2/maven-archiver-3.0.2.jar
(23 KB at 1339.0 KB/sec)
[INFO] Downloaded: https://repo.maven.apache.org/maven2/org/codehaus/plexus/plexus-archiver/3.1.1/plexus-archiver-3.1.1.jar
(175 KB at 8290.0 KB/sec)
[INFO] Building jar: <https://builds.apache.org/job/Torque4-trunk/ws/torque4-trunk/torque-runtime/target/torque-runtime-4.1-SNAPSHOT.jar>
[INFO] 
[INFO] --- maven-site-plugin:3.5.1:attach-descriptor (attach-descriptor) @ torque-runtime
---
[INFO] 
[INFO] --- maven-source-plugin:3.0.0:jar-no-fork (attach-sources) @ torque-runtime ---
[INFO] Building jar: <https://builds.apache.org/job/Torque4-trunk/ws/torque4-trunk/torque-runtime/target/torque-runtime-4.1-SNAPSHOT-sources.jar>
[INFO] 
[INFO] --- apache-rat-plugin:0.11:check (default) @ torque-runtime ---
[INFO] 51 implicit excludes (use -debug for more details).
[INFO] Exclude: velocity.log
[INFO] Exclude: .checkstyle
[INFO] Exclude: checkstyle-cache.ccf
[INFO] Exclude: derby.log
[INFO] Exclude: LICENSE-EDL.txt
[INFO] Exclude: DEPENDENCIES
[INFO] Exclude: torque-test/target/**/*
[INFO] Exclude: torque-test/.classpath
[INFO] Exclude: torque-test/.project
[INFO] Exclude: torque-test/.settings/**
[INFO] Exclude: torque-test/src/main/generated-java/**/*
[INFO] Exclude: torque-test/derby.log
[INFO] 182 resources included (use -debug for more details)
[INFO] Rat check: Summary of files. Unapproved: 0 unknown: 0 generated: 0 approved: 180 licence.
[CHECKSTYLE] No report found for mojo check
[PMD] No report found for mojo check
[INFO] 
[INFO] --- maven-install-plugin:2.5.2:install (default-install) @ torque-runtime ---
[INFO] Installing <https://builds.apache.org/job/Torque4-trunk/ws/torque4-trunk/torque-runtime/target/torque-runtime-4.1-SNAPSHOT.jar>
to /home/jenkins/jenkins-slave/maven-repositories/0/org/apache/torque/torque-runtime/4.1-SNAPSHOT/torque-runtime-4.1-SNAPSHOT.jar
[INFO] Installing <https://builds.apache.org/job/Torque4-trunk/ws/torque4-trunk/torque-runtime/pom.xml>
to /home/jenkins/jenkins-slave/maven-repositories/0/org/apache/torque/torque-runtime/4.1-SNAPSHOT/torque-runtime-4.1-SNAPSHOT.pom
[INFO] Installing <https://builds.apache.org/job/Torque4-trunk/ws/torque4-trunk/torque-runtime/target/torque-runtime-4.1-SNAPSHOT-sources.jar>
to /home/jenkins/jenkins-slave/maven-repositories/0/org/apache/torque/torque-runtime/4.1-SNAPSHOT/torque-runtime-4.1-SNAPSHOT-sources.jar
[INFO] 
[INFO] >>> cobertura-maven-plugin:2.3:cobertura (default-cli) > [cobertura]test
@ torque-runtime >>>
[INFO] 
[INFO] --- maven-remote-resources-plugin:1.5:process (process-resource-bundles) @ torque-runtime
---
[INFO] 
[INFO] --- maven-resources-plugin:2.7:resources (default-resources) @ torque-runtime ---
[INFO] Using 'ISO-8859-1' encoding to copy filtered resources.
[INFO] skip non existing resourceDirectory <https://builds.apache.org/job/Torque4-trunk/ws/torque4-trunk/torque-runtime/src/main/resources>
[INFO] Copying 3 resources
[INFO] Copying 3 resources
[INFO] 
[INFO] --- maven-compiler-plugin:3.5.1:compile (default-compile) @ torque-runtime ---
[INFO] Nothing to compile - all classes are up to date
[INFO] 
[INFO] --- cobertura-maven-plugin:2.3:instrument (default-cli) @ torque-runtime ---
[INFO] Cobertura 1.9.2 - GNU GPL License (NO WARRANTY) - See COPYRIGHT file
Instrumenting 122 files to <https://builds.apache.org/job/Torque4-trunk/ws/torque4-trunk/torque-runtime/target/generated-classes/cobertura>
Cobertura: Saved information on 122 classes.
Instrument time: 722ms

[INFO] Instrumentation was successful.
[INFO] 
[INFO] --- maven-resources-plugin:2.7:testResources (default-testResources) @ torque-runtime
---
[INFO] Using 'ISO-8859-1' encoding to copy filtered resources.
[INFO] Copying 5 resources
[INFO] Copying 3 resources
[INFO] Copying 3 resources
[INFO] 
[INFO] --- maven-compiler-plugin:3.5.1:testCompile (default-testCompile) @ torque-runtime
---
[INFO] Nothing to compile - all classes are up to date
[INFO] 
[INFO] --- maven-surefire-plugin:2.19.1:test (default-test) @ torque-runtime ---

-------------------------------------------------------
 T E S T S
-------------------------------------------------------

Results :

Tests run: 0, Failures: 0, Errors: 0, Skipped: 0

[JENKINS] Recording test results
[INFO] ------------------------------------------------------------------------
[INFO] Reactor Summary:
[INFO] 
[INFO] Torque Maven Parent ................................ SUCCESS [ 49.351 s]
[INFO] Torque Runtime ..................................... FAILURE [ 46.816 s]
[INFO] Torque Generator ................................... SKIPPED
[INFO] Torque Templates ................................... SKIPPED
[INFO] Torque Generator Maven 2 Plugin .................... SKIPPED
[INFO] Torque Generator Ant tasks ......................... SKIPPED
[INFO] Torque Site ........................................ SKIPPED
[INFO] ------------------------------------------------------------------------
[INFO] BUILD FAILURE
[INFO] ------------------------------------------------------------------------
[INFO] Total time: 01:44 min
[INFO] Finished at: 2016-09-21T00:38:27+00:00
[INFO] Final Memory: 67M/810M
[INFO] ------------------------------------------------------------------------
[ERROR] Failed to execute goal org.apache.maven.plugins:maven-surefire-plugin:2.19.1:test
(default-test) on project torque-runtime: Execution default-test of goal org.apache.maven.plugins:maven-surefire-plugin:2.19.1:test
failed: There was an error in the forked process
[ERROR] java.lang.VerifyError:
[ERROR] Expecting a stackmap frame at branch target 449
[ERROR] Exception Details:
[ERROR] Location:
[ERROR] org/apache/torque/manager/AbstractBaseManager.setRegion(Ljava/lang/String;)V @25:
invokestatic
[ERROR] Reason:
[ERROR] Expected stackmap frame at this location.
[ERROR] Bytecode:
[ERROR] 0x0000000: 033d 11ff ff3e b800 2e12 30b6 0034 1101
[ERROR] 0x0000010: eab6 003a 2a2b b501 44b8 002e 1230 b600
[ERROR] 0x0000020: 3411 01ed b600 3ab8 014b 1301 4d03 b901
[ERROR] 0x0000030: 5303 0011 01ed 3d11 0000 3e99 0145 1c11
[ERROR] 0x0000040: 01ed a000 1c1d 1100 00a0 0015 b800 2e12
[ERROR] 0x0000050: 30b6 0034 1c1d 04b6 009c 11ff ff3e b800
[ERROR] 0x0000060: 2e12 30b6 0034 1101 efb6 003a 2ab4 00c0
[ERROR] 0x0000070: 1101 ef3d 1100 003e c600 381c 1101 efa0
[ERROR] 0x0000080: 001c 1d11 0000 a000 15b8 002e 1230 b600
[ERROR] 0x0000090: 341c 1d04 b600 9c11 ffff 3eb8 002e 1230
[ERROR] 0x00000a0: b600 3411 01f1 b600 3a2a b400 c0b6 00d3
[ERROR] 0x00000b0: 1d9b 0015 b800 2e12 30b6 0034 1c1d 03b6
[ERROR] 0x00000c0: 009c 11ff ff3e b800 2e12 30b6 0034 1101
[ERROR] 0x00000d0: f3b6 003a 2ab4 00d5 1101 f33d 1100 003e
[ERROR] 0x00000e0: c600 381c 1101 f3a0 001c 1d11 0000 a000
[ERROR] 0x00000f0: 15b8 002e 1230 b600 341c 1d04 b600 9c11
[ERROR] 0x0000100: ffff 3eb8 002e 1230 b600 3411 01f5 b600
[ERROR] 0x0000110: 3a2a b400 d5b6 00d8 1d9b 0015 b800 2e12
[ERROR] 0x0000120: 30b6 0034 1c1d 03b6 009c 11ff ff3e b800
[ERROR] 0x0000130: 2e12 30b6 0034 1101 f7b6 003a 2a2a b601
[ERROR] 0x0000140: 55b8 015b b500 c0b8 002e 1230 b600 3411
[ERROR] 0x0000150: 01f9 b600 3a2a 2ab6 0155 b801 5fb5 00d5
[ERROR] 0x0000160: b800 2e12 30b6 0034 1101 fab6 003a 2abb
[ERROR] 0x0000170: 0161 592a b400 d5b7 0164 b501 66a7 0033
[ERROR] 0x0000180: 1d9b 0015 b800 2e12 30b6 0034 1c1d 03b6
[ERROR] 0x0000190: 009c 11ff ff3e b800 2e12 30b6 0034 1101
[ERROR] 0x00001a0: feb6 003a 2abb 0168 5901 b701 69b5 0166
[ERROR] 0x00001b0: b800 2e12 30b6 0034 1102 04b6 003a a700
[ERROR] 0x00001c0: 2eb8 002e 1230 b600 3411 0201 b600 3a3a
[ERROR] 0x00001d0: 04b8 002e 1230 b600 3411 0203 b600 3abb
[ERROR] 0x00001e0: 0066 5913 016b 1904 b700 85bf b800 2e12
[ERROR] 0x00001f0: 30b6 0034 1102 06b6 003a 2ab4 00c0 1102
[ERROR] 0x0000200: 063d 1100 003e c700 4d1c 1102 06a0 001c
[ERROR] 0x0000210: 1d11 0000 a000 15b8 002e 1230 b600 341c
[ERROR] 0x0000220: 1d04 b600 9c11 ffff 3eb8 002e 1230 b600
[ERROR] 0x0000230: 3411 0208 b600 3ab2 016d bb00 7459 b700
[ERROR] 0x0000240: 7513 016f b600 7b2b b600 7bb6 0082 b901
[ERROR] 0x0000250: 7402 001d 9b00 15b8 002e 1230 b600 341c
[ERROR] 0x0000260: 1d03 b600 9c11 ffff 3eb8 002e 1230 b600
[ERROR] 0x0000270: 3411 020a b600 3ab1
[ERROR] Exception Handler Table:
[ERROR] bci [25, 432] => handler: 449
[ERROR] Stackmap Table:
[ERROR] same_frame_extended(@212)
[ERROR] same_frame_extended(@316)
[ERROR] same_frame_extended(@420)
[ERROR] same_frame(@446)
[ERROR] same_locals_1_stack_item_frame(@463,Object[#201])
[ERROR] same_frame(@506)
[ERROR] same_frame_extended(@631)
[ERROR] 
[ERROR] at java.lang.Class.getDeclaredMethods0(Native Method)
[ERROR] at java.lang.Class.privateGetDeclaredMethods(Class.java:2701)
[ERROR] at java.lang.Class.privateGetMethodRecursive(Class.java:3048)
[ERROR] at java.lang.Class.getMethod0(Class.java:3018)
[ERROR] at java.lang.Class.getMethod(Class.java:1784)
[ERROR] at org.apache.maven.surefire.util.ReflectionUtils.tryGetMethod(ReflectionUtils.java:61)
[ERROR] at org.apache.maven.surefire.common.junit3.JUnit3TestChecker.isSuiteOnly(JUnit3TestChecker.java:64)
[ERROR] at org.apache.maven.surefire.common.junit3.JUnit3TestChecker.isValidJUnit3Test(JUnit3TestChecker.java:59)
[ERROR] at org.apache.maven.surefire.common.junit3.JUnit3TestChecker.accept(JUnit3TestChecker.java:54)
[ERROR] at org.apache.maven.surefire.junit.PojoAndJUnit3Checker.accept(PojoAndJUnit3Checker.java:43)
[ERROR] at org.apache.maven.surefire.util.DefaultScanResult.applyFilter(DefaultScanResult.java:98)
[ERROR] at org.apache.maven.surefire.junit.JUnit3Provider.scanClassPath(JUnit3Provider.java:143)
[ERROR] at org.apache.maven.surefire.junit.JUnit3Provider.invoke(JUnit3Provider.java:87)
[ERROR] at org.apache.maven.surefire.booter.ForkedBooter.invokeProviderInSameClassLoader(ForkedBooter.java:290)
[ERROR] at org.apache.maven.surefire.booter.ForkedBooter.runSuitesInProcess(ForkedBooter.java:242)
[ERROR] at org.apache.maven.surefire.booter.ForkedBooter.main(ForkedBooter.java:121)
[ERROR] -> [Help 1]
[ERROR] 
[ERROR] To see the full stack trace of the errors, re-run Maven with the -e switch.
[ERROR] Re-run Maven using the -X switch to enable full debug logging.
[ERROR] 
[ERROR] For more information about the errors and possible solutions, please read the following
articles:
[ERROR] [Help 1] http://cwiki.apache.org/confluence/display/MAVEN/PluginExecutionException
[ERROR] 
[ERROR] After correcting the problems, you can resume the build with the command
[ERROR]   mvn <goals> -rf :torque-runtime
[JENKINS] Archiving <https://builds.apache.org/job/Torque4-trunk/ws/torque4-trunk/torque-maven-plugin/pom.xml>
to org.apache.torque/torque-maven-plugin/4.1-SNAPSHOT/torque-maven-plugin-4.1-SNAPSHOT.pom
[JENKINS] Archiving <https://builds.apache.org/job/Torque4-trunk/ws/torque4-trunk/pom.xml>
to org.apache.torque/torque/4.1-SNAPSHOT/torque-4.1-SNAPSHOT.pom
<https://builds.apache.org/job/Torque4-trunk/ws/torque4-trunk/pom.xml> is not inside
<https://builds.apache.org/job/Torque4-trunk/ws/torque4-trunk/torque4-trunk/;> will
archive in a separate pass
[JENKINS] Archiving <https://builds.apache.org/job/Torque4-trunk/ws/torque4-trunk/torque-site/pom.xml>
to org.apache.torque/torque-site/4.1-SNAPSHOT/torque-site-4.1-SNAPSHOT.pom
[JENKINS] Archiving <https://builds.apache.org/job/Torque4-trunk/ws/torque4-trunk/torque-generator/pom.xml>
to org.apache.torque/torque-generator/4.1-SNAPSHOT/torque-generator-4.1-SNAPSHOT.pom
[JENKINS] Archiving <https://builds.apache.org/job/Torque4-trunk/ws/torque4-trunk/torque-templates/pom.xml>
to org.apache.torque/torque-templates/4.1-SNAPSHOT/torque-templates-4.1-SNAPSHOT.pom
[JENKINS] Archiving <https://builds.apache.org/job/Torque4-trunk/ws/torque4-trunk/torque-runtime/pom.xml>
to org.apache.torque/torque-runtime/4.1-SNAPSHOT/torque-runtime-4.1-SNAPSHOT.pom
[JENKINS] Archiving <https://builds.apache.org/job/Torque4-trunk/ws/torque4-trunk/torque-runtime/target/torque-runtime-4.1-SNAPSHOT.jar>
to org.apache.torque/torque-runtime/4.1-SNAPSHOT/torque-runtime-4.1-SNAPSHOT.jar
[JENKINS] Archiving <https://builds.apache.org/job/Torque4-trunk/ws/torque4-trunk/torque-runtime/target/torque-runtime-4.1-SNAPSHOT-sources.jar>
to org.apache.torque/torque-runtime/4.1-SNAPSHOT/torque-runtime-4.1-SNAPSHOT-sources.jar
[JENKINS] Archiving <https://builds.apache.org/job/Torque4-trunk/ws/torque4-trunk/torque-ant-tasks/pom.xml>
to org.apache.torque/torque-ant-tasks/4.1-SNAPSHOT/torque-ant-tasks-4.1-SNAPSHOT.pom
Sending e-mails to: torque-dev@db.apache.org
channel stopped
Skipping Cobertura coverage report as build was not UNSTABLE or better ...

---------------------------------------------------------------------
To unsubscribe, e-mail: torque-dev-unsubscribe@db.apache.org
For additional commands, e-mail: torque-dev-help@db.apache.org


Mime
View raw message