db-torque-dev mailing list archives

Site index · List index
Message view « Date » · « Thread »
Top « Date » · « Thread »
From Apache Jenkins Server <jenk...@builds.apache.org>
Subject Build failed in Jenkins: torque4-test-project-hsqldb #303
Date Wed, 22 Oct 2014 08:18:46 GMT
See <https://builds.apache.org/job/torque4-test-project-hsqldb/303/changes>

Changes:

[tfischer] add license header

[tfischer] fix TODO

[tfischer] TORQUE-331 - generate check constraint for enums

[tfischer] TORQUE-331 - test that it is not possible to insert illegal value (except for MySQL
where evrything is possible:-) )

[tfischer] TORQUE-331 - adjust test of enum handling for mssql

[tfischer] extract fillTables() test setup in setUp() method

[tfischer] TORQUE-331 - test enum handling

[tfischer] TORQUE-331 - implement enum handling in Criteria

[tfischer] use final where possible

------------------------------------------
[...truncated 11834 lines...]
INFO  org.apache.torque.generator.control.Controller - Processing source <https://builds.apache.org/job/torque4-test-project-hsqldb/ws/torque-test/target/torque/test/schema/./included-schema.xml>
INFO  org.apache.torque.generator.control.Controller - Start generation of File <https://builds.apache.org/job/torque4-test-project-hsqldb/ws/torque-test/target/generated-sql/included-schema-idtable-init.sql>
INFO  org.apache.torque.generator.control.Controller - Processing source <https://builds.apache.org/job/torque4-test-project-hsqldb/ws/torque-test/target/torque/test/schema/./pk-schema.xml>
INFO  org.apache.torque.generator.control.Controller - Start generation of File <https://builds.apache.org/job/torque4-test-project-hsqldb/ws/torque-test/target/generated-sql/pk-schema-idtable-init.sql>
INFO  org.apache.torque.generator.control.Controller - Processing source <https://builds.apache.org/job/torque4-test-project-hsqldb/ws/torque-test/target/torque/test/schema/./qualified-table-name-schema.xml>
INFO  org.apache.torque.generator.control.Controller - Start generation of File <https://builds.apache.org/job/torque4-test-project-hsqldb/ws/torque-test/target/generated-sql/qualified-table-name-schema-idtable-init.sql>
INFO  org.apache.torque.generator.control.Controller - Processing source <https://builds.apache.org/job/torque4-test-project-hsqldb/ws/torque-test/target/torque/test/schema/./save-method-in-peer-schema.xml>
INFO  org.apache.torque.generator.control.Controller - Start generation of File <https://builds.apache.org/job/torque4-test-project-hsqldb/ws/torque-test/target/generated-sql/save-method-in-peer-schema-idtable-init.sql>
INFO  org.apache.torque.generator.control.Controller - Processing source <https://builds.apache.org/job/torque4-test-project-hsqldb/ws/torque-test/target/torque/test/schema/./test-schema.xml>
INFO  org.apache.torque.generator.control.Controller - Start generation of File <https://builds.apache.org/job/torque4-test-project-hsqldb/ws/torque-test/target/generated-sql/test-schema-idtable-init.sql>
INFO  org.apache.torque.generator.control.Controller - Processing source <https://builds.apache.org/job/torque4-test-project-hsqldb/ws/torque-test/target/torque/test/schema/./types-schema.xml>
INFO  org.apache.torque.generator.control.Controller - Start generation of File <https://builds.apache.org/job/torque4-test-project-hsqldb/ws/torque-test/target/generated-sql/types-schema-idtable-init.sql>
[INFO] Generation successful
[INFO] [torque:generate {execution: generate-html-doc}]
INFO  org.apache.torque.generator.control.Controller - readConfiguration() : Starting to read
configuration files
INFO  org.apache.torque.generator.control.Controller - readConfiguration() : Configuration
read.
INFO  org.apache.torque.generator.control.Controller - Processing output css
INFO  org.apache.torque.generator.control.Controller - Processing source <https://builds.apache.org/job/torque4-test-project-hsqldb/ws/torque-test/target/torque/test/schema/bookstore-schema.xml>
INFO  org.apache.torque.generator.control.Controller - Start generation of File <https://builds.apache.org/job/torque4-test-project-hsqldb/ws/torque-test/target/generated-docs/datamodel.css>
INFO  org.apache.torque.generator.control.Controller - Processing source <https://builds.apache.org/job/torque4-test-project-hsqldb/ws/torque-test/target/torque/test/schema/databaseMapInit-schema.xml>
INFO  org.apache.torque.generator.control.Controller - Start generation of File <https://builds.apache.org/job/torque4-test-project-hsqldb/ws/torque-test/target/generated-docs/datamodel.css>
INFO  org.apache.torque.generator.control.Controller - Processing source <https://builds.apache.org/job/torque4-test-project-hsqldb/ws/torque-test/target/torque/test/schema/default-value-schema.xml>
INFO  org.apache.torque.generator.control.Controller - Start generation of File <https://builds.apache.org/job/torque4-test-project-hsqldb/ws/torque-test/target/generated-docs/datamodel.css>
INFO  org.apache.torque.generator.control.Controller - Processing source <https://builds.apache.org/job/torque4-test-project-hsqldb/ws/torque-test/target/torque/test/schema/foreign-key-schema.xml>
INFO  org.apache.torque.generator.control.Controller - Start generation of File <https://builds.apache.org/job/torque4-test-project-hsqldb/ws/torque-test/target/generated-docs/datamodel.css>
INFO  org.apache.torque.generator.control.Controller - Processing source <https://builds.apache.org/job/torque4-test-project-hsqldb/ws/torque-test/target/torque/test/schema/index.xml>
INFO  org.apache.torque.generator.control.Controller - Start generation of File <https://builds.apache.org/job/torque4-test-project-hsqldb/ws/torque-test/target/generated-docs/datamodel.css>
INFO  org.apache.torque.generator.control.Controller - Processing source <https://builds.apache.org/job/torque4-test-project-hsqldb/ws/torque-test/target/torque/test/schema/pk-schema.xml>
INFO  org.apache.torque.generator.control.Controller - Start generation of File <https://builds.apache.org/job/torque4-test-project-hsqldb/ws/torque-test/target/generated-docs/datamodel.css>
INFO  org.apache.torque.generator.control.Controller - Processing source <https://builds.apache.org/job/torque4-test-project-hsqldb/ws/torque-test/target/torque/test/schema/qualified-table-name-schema.xml>
INFO  org.apache.torque.generator.control.Controller - Start generation of File <https://builds.apache.org/job/torque4-test-project-hsqldb/ws/torque-test/target/generated-docs/datamodel.css>
INFO  org.apache.torque.generator.control.Controller - Processing source <https://builds.apache.org/job/torque4-test-project-hsqldb/ws/torque-test/target/torque/test/schema/save-method-in-peer-schema.xml>
INFO  org.apache.torque.generator.control.Controller - Start generation of File <https://builds.apache.org/job/torque4-test-project-hsqldb/ws/torque-test/target/generated-docs/datamodel.css>
INFO  org.apache.torque.generator.control.Controller - Processing source <https://builds.apache.org/job/torque4-test-project-hsqldb/ws/torque-test/target/torque/test/schema/test-schema.xml>
INFO  org.apache.torque.generator.control.Controller - Start generation of File <https://builds.apache.org/job/torque4-test-project-hsqldb/ws/torque-test/target/generated-docs/datamodel.css>
INFO  org.apache.torque.generator.control.Controller - Processing source <https://builds.apache.org/job/torque4-test-project-hsqldb/ws/torque-test/target/torque/test/schema/types-schema.xml>
INFO  org.apache.torque.generator.control.Controller - Start generation of File <https://builds.apache.org/job/torque4-test-project-hsqldb/ws/torque-test/target/generated-docs/datamodel.css>
INFO  org.apache.torque.generator.control.Controller - Processing output html-datamodel
INFO  org.apache.torque.generator.control.Controller - Processing source <https://builds.apache.org/job/torque4-test-project-hsqldb/ws/torque-test/target/torque/test/schema/bookstore-schema.xml>
INFO  org.apache.torque.generator.control.Controller - Start generation of File <https://builds.apache.org/job/torque4-test-project-hsqldb/ws/torque-test/target/generated-docs/bookstore-schema.html>
INFO  org.apache.torque.generator.control.Controller - Processing source <https://builds.apache.org/job/torque4-test-project-hsqldb/ws/torque-test/target/torque/test/schema/databaseMapInit-schema.xml>
INFO  org.apache.torque.generator.control.Controller - Start generation of File <https://builds.apache.org/job/torque4-test-project-hsqldb/ws/torque-test/target/generated-docs/databaseMapInit-schema.html>
INFO  org.apache.torque.generator.control.Controller - Processing source <https://builds.apache.org/job/torque4-test-project-hsqldb/ws/torque-test/target/torque/test/schema/default-value-schema.xml>
INFO  org.apache.torque.generator.control.Controller - Start generation of File <https://builds.apache.org/job/torque4-test-project-hsqldb/ws/torque-test/target/generated-docs/default-value-schema.html>
INFO  org.apache.torque.generator.control.Controller - Processing source <https://builds.apache.org/job/torque4-test-project-hsqldb/ws/torque-test/target/torque/test/schema/foreign-key-schema.xml>
INFO  org.apache.torque.generator.control.Controller - Start generation of File <https://builds.apache.org/job/torque4-test-project-hsqldb/ws/torque-test/target/generated-docs/foreign-key-schema.html>
INFO  org.apache.torque.generator.control.Controller - Processing source <https://builds.apache.org/job/torque4-test-project-hsqldb/ws/torque-test/target/torque/test/schema/index.xml>
INFO  org.apache.torque.generator.control.Controller - Start generation of File <https://builds.apache.org/job/torque4-test-project-hsqldb/ws/torque-test/target/generated-docs/index.html>
INFO  org.apache.torque.generator.control.Controller - Processing source <https://builds.apache.org/job/torque4-test-project-hsqldb/ws/torque-test/target/torque/test/schema/pk-schema.xml>
INFO  org.apache.torque.generator.control.Controller - Start generation of File <https://builds.apache.org/job/torque4-test-project-hsqldb/ws/torque-test/target/generated-docs/pk-schema.html>
INFO  org.apache.torque.generator.control.Controller - Processing source <https://builds.apache.org/job/torque4-test-project-hsqldb/ws/torque-test/target/torque/test/schema/qualified-table-name-schema.xml>
INFO  org.apache.torque.generator.control.Controller - Start generation of File <https://builds.apache.org/job/torque4-test-project-hsqldb/ws/torque-test/target/generated-docs/qualified-table-name-schema.html>
INFO  org.apache.torque.generator.control.Controller - Processing source <https://builds.apache.org/job/torque4-test-project-hsqldb/ws/torque-test/target/torque/test/schema/save-method-in-peer-schema.xml>
INFO  org.apache.torque.generator.control.Controller - Start generation of File <https://builds.apache.org/job/torque4-test-project-hsqldb/ws/torque-test/target/generated-docs/save-method-in-peer-schema.html>
INFO  org.apache.torque.generator.control.Controller - Processing source <https://builds.apache.org/job/torque4-test-project-hsqldb/ws/torque-test/target/torque/test/schema/test-schema.xml>
INFO  org.apache.torque.generator.control.Controller - Start generation of File <https://builds.apache.org/job/torque4-test-project-hsqldb/ws/torque-test/target/generated-docs/test-schema.html>
INFO  org.apache.torque.generator.control.Controller - Processing source <https://builds.apache.org/job/torque4-test-project-hsqldb/ws/torque-test/target/torque/test/schema/types-schema.xml>
INFO  org.apache.torque.generator.control.Controller - Start generation of File <https://builds.apache.org/job/torque4-test-project-hsqldb/ws/torque-test/target/generated-docs/types-schema.html>
[INFO] Generation successful
[WARNING] The parameter expression: 'project.build.resources' used in mojo: 'process' has
been deprecated. Use 'project.resources' instead.
[INFO] [remote-resources:process {execution: default}]
[debug] execute contextualize
[INFO] [resources:resources {execution: default-resources}]
[INFO] Using 'ISO-8859-1' encoding to copy filtered resources.
[INFO] skip non existing resourceDirectory <https://builds.apache.org/job/torque4-test-project-hsqldb/ws/torque-test/src/main/resources>
[INFO] Copying 3 resources
[INFO] [compiler:compile {execution: default-compile}]
[INFO] Changes detected - recompiling the module!
[INFO] Compiling 1012 source files to <https://builds.apache.org/job/torque4-test-project-hsqldb/ws/torque-test/target/classes>
[INFO] -------------------------------------------------------------
[WARNING] COMPILATION WARNING : 
[INFO] -------------------------------------------------------------
[WARNING] Note: Some input files use or override a deprecated API.
[WARNING] Note: Recompile with -Xlint:deprecation for details.
[WARNING] Note: Some input files use unchecked or unsafe operations.
[WARNING] Note: Recompile with -Xlint:unchecked for details.
[INFO] 4 warnings 
[INFO] -------------------------------------------------------------
[INFO] -------------------------------------------------------------
[ERROR] COMPILATION ERROR : 
[INFO] -------------------------------------------------------------
[ERROR] <https://builds.apache.org/job/torque4-test-project-hsqldb/ws/torque-test/target/generated-sources/org/apache/torque/test/bean/BaseEnumTableBean.java>:[40,13]
cannot find symbol
symbol  : class VarcharColumnEnum
location: class org.apache.torque.test.bean.BaseEnumTableBean
[ERROR] <https://builds.apache.org/job/torque4-test-project-hsqldb/ws/torque-test/target/generated-sources/org/apache/torque/test/bean/BaseEnumTableBean.java>:[43,13]
cannot find symbol
symbol  : class MyIntColumnEnum
location: class org.apache.torque.test.bean.BaseEnumTableBean
[ERROR] <https://builds.apache.org/job/torque4-test-project-hsqldb/ws/torque-test/target/generated-sources/org/apache/torque/test/bean/BaseEnumTableBean.java>:[46,13]
cannot find symbol
symbol  : class TestEnum
location: class org.apache.torque.test.bean.BaseEnumTableBean
[ERROR] <https://builds.apache.org/job/torque4-test-project-hsqldb/ws/torque-test/target/generated-sources/org/apache/torque/test/bean/BaseEnumTableBean.java>:[49,13]
cannot find symbol
symbol  : class IntPrimitiveColumnEnum
location: class org.apache.torque.test.bean.BaseEnumTableBean
[ERROR] <https://builds.apache.org/job/torque4-test-project-hsqldb/ws/torque-test/target/generated-sources/org/apache/torque/test/bean/BaseEnumTableBean.java>:[123,12]
cannot find symbol
symbol  : class VarcharColumnEnum
location: class org.apache.torque.test.bean.BaseEnumTableBean
[ERROR] <https://builds.apache.org/job/torque4-test-project-hsqldb/ws/torque-test/target/generated-sources/org/apache/torque/test/bean/BaseEnumTableBean.java>:[134,34]
cannot find symbol
symbol  : class VarcharColumnEnum
location: class org.apache.torque.test.bean.BaseEnumTableBean
[ERROR] <https://builds.apache.org/job/torque4-test-project-hsqldb/ws/torque-test/target/generated-sources/org/apache/torque/test/bean/BaseEnumTableBean.java>:[151,12]
cannot find symbol
symbol  : class MyIntColumnEnum
location: class org.apache.torque.test.bean.BaseEnumTableBean
[ERROR] <https://builds.apache.org/job/torque4-test-project-hsqldb/ws/torque-test/target/generated-sources/org/apache/torque/test/bean/BaseEnumTableBean.java>:[162,30]
cannot find symbol
symbol  : class MyIntColumnEnum
location: class org.apache.torque.test.bean.BaseEnumTableBean
[ERROR] <https://builds.apache.org/job/torque4-test-project-hsqldb/ws/torque-test/target/generated-sources/org/apache/torque/test/bean/BaseEnumTableBean.java>:[179,12]
cannot find symbol
symbol  : class TestEnum
location: class org.apache.torque.test.bean.BaseEnumTableBean
[ERROR] <https://builds.apache.org/job/torque4-test-project-hsqldb/ws/torque-test/target/generated-sources/org/apache/torque/test/bean/BaseEnumTableBean.java>:[190,41]
cannot find symbol
symbol  : class TestEnum
location: class org.apache.torque.test.bean.BaseEnumTableBean
[ERROR] <https://builds.apache.org/job/torque4-test-project-hsqldb/ws/torque-test/target/generated-sources/org/apache/torque/test/bean/BaseEnumTableBean.java>:[207,12]
cannot find symbol
symbol  : class IntPrimitiveColumnEnum
location: class org.apache.torque.test.bean.BaseEnumTableBean
[ERROR] <https://builds.apache.org/job/torque4-test-project-hsqldb/ws/torque-test/target/generated-sources/org/apache/torque/test/bean/BaseEnumTableBean.java>:[218,39]
cannot find symbol
symbol  : class IntPrimitiveColumnEnum
location: class org.apache.torque.test.bean.BaseEnumTableBean
[ERROR] <https://builds.apache.org/job/torque4-test-project-hsqldb/ws/torque-test/target/generated-sources/org/apache/torque/test/bean/BaseEnumTableBean.java>:[43,41]
cannot find symbol
symbol  : variable MyIntColumnEnum
location: class org.apache.torque.test.bean.BaseEnumTableBean
[ERROR] <https://builds.apache.org/job/torque4-test-project-hsqldb/ws/torque-test/target/generated-sources/org/apache/torque/test/bean/BaseEnumTableBean.java>:[49,57]
cannot find symbol
symbol  : variable IntPrimitiveColumnEnum
location: class org.apache.torque.test.bean.BaseEnumTableBean
[INFO] 14 errors 
[INFO] -------------------------------------------------------------
[INFO] ------------------------------------------------------------------------
[ERROR] BUILD FAILURE
[INFO] ------------------------------------------------------------------------
[INFO] Compilation failure

<https://builds.apache.org/job/torque4-test-project-hsqldb/ws/torque-test/target/generated-sources/org/apache/torque/test/bean/BaseEnumTableBean.java>:[40,13]
cannot find symbol
symbol  : class VarcharColumnEnum
location: class org.apache.torque.test.bean.BaseEnumTableBean
<https://builds.apache.org/job/torque4-test-project-hsqldb/ws/torque-test/target/generated-sources/org/apache/torque/test/bean/BaseEnumTableBean.java>:[43,13]
cannot find symbol
symbol  : class MyIntColumnEnum
location: class org.apache.torque.test.bean.BaseEnumTableBean
<https://builds.apache.org/job/torque4-test-project-hsqldb/ws/torque-test/target/generated-sources/org/apache/torque/test/bean/BaseEnumTableBean.java>:[46,13]
cannot find symbol
symbol  : class TestEnum
location: class org.apache.torque.test.bean.BaseEnumTableBean
<https://builds.apache.org/job/torque4-test-project-hsqldb/ws/torque-test/target/generated-sources/org/apache/torque/test/bean/BaseEnumTableBean.java>:[49,13]
cannot find symbol
symbol  : class IntPrimitiveColumnEnum
location: class org.apache.torque.test.bean.BaseEnumTableBean
<https://builds.apache.org/job/torque4-test-project-hsqldb/ws/torque-test/target/generated-sources/org/apache/torque/test/bean/BaseEnumTableBean.java>:[123,12]
cannot find symbol
symbol  : class VarcharColumnEnum
location: class org.apache.torque.test.bean.BaseEnumTableBean
<https://builds.apache.org/job/torque4-test-project-hsqldb/ws/torque-test/target/generated-sources/org/apache/torque/test/bean/BaseEnumTableBean.java>:[134,34]
cannot find symbol
symbol  : class VarcharColumnEnum
location: class org.apache.torque.test.bean.BaseEnumTableBean
<https://builds.apache.org/job/torque4-test-project-hsqldb/ws/torque-test/target/generated-sources/org/apache/torque/test/bean/BaseEnumTableBean.java>:[151,12]
cannot find symbol
symbol  : class MyIntColumnEnum
location: class org.apache.torque.test.bean.BaseEnumTableBean
<https://builds.apache.org/job/torque4-test-project-hsqldb/ws/torque-test/target/generated-sources/org/apache/torque/test/bean/BaseEnumTableBean.java>:[162,30]
cannot find symbol
symbol  : class MyIntColumnEnum
location: class org.apache.torque.test.bean.BaseEnumTableBean
<https://builds.apache.org/job/torque4-test-project-hsqldb/ws/torque-test/target/generated-sources/org/apache/torque/test/bean/BaseEnumTableBean.java>:[179,12]
cannot find symbol
symbol  : class TestEnum
location: class org.apache.torque.test.bean.BaseEnumTableBean
<https://builds.apache.org/job/torque4-test-project-hsqldb/ws/torque-test/target/generated-sources/org/apache/torque/test/bean/BaseEnumTableBean.java>:[190,41]
cannot find symbol
symbol  : class TestEnum
location: class org.apache.torque.test.bean.BaseEnumTableBean
<https://builds.apache.org/job/torque4-test-project-hsqldb/ws/torque-test/target/generated-sources/org/apache/torque/test/bean/BaseEnumTableBean.java>:[207,12]
cannot find symbol
symbol  : class IntPrimitiveColumnEnum
location: class org.apache.torque.test.bean.BaseEnumTableBean
<https://builds.apache.org/job/torque4-test-project-hsqldb/ws/torque-test/target/generated-sources/org/apache/torque/test/bean/BaseEnumTableBean.java>:[218,39]
cannot find symbol
symbol  : class IntPrimitiveColumnEnum
location: class org.apache.torque.test.bean.BaseEnumTableBean
<https://builds.apache.org/job/torque4-test-project-hsqldb/ws/torque-test/target/generated-sources/org/apache/torque/test/bean/BaseEnumTableBean.java>:[43,41]
cannot find symbol
symbol  : variable MyIntColumnEnum
location: class org.apache.torque.test.bean.BaseEnumTableBean
<https://builds.apache.org/job/torque4-test-project-hsqldb/ws/torque-test/target/generated-sources/org/apache/torque/test/bean/BaseEnumTableBean.java>:[49,57]
cannot find symbol
symbol  : variable IntPrimitiveColumnEnum
location: class org.apache.torque.test.bean.BaseEnumTableBean

[INFO] ------------------------------------------------------------------------
[INFO] For more information, run Maven with the -e switch
[INFO] ------------------------------------------------------------------------
[INFO] Total time: 2 minutes 32 seconds
[INFO] Finished at: Wed Oct 22 08:18:28 UTC 2014
[INFO] Final Memory: 107M/510M
[INFO] ------------------------------------------------------------------------
[JENKINS] Archiving <https://builds.apache.org/job/torque4-test-project-hsqldb/ws/torque-ant-tasks/pom.xml>
to org.apache.torque/torque-ant-tasks/4.1-SNAPSHOT/torque-ant-tasks-4.1-SNAPSHOT.pom
[JENKINS] Archiving <https://builds.apache.org/job/torque4-test-project-hsqldb/ws/torque-ant-tasks/target/torque-ant-tasks-4.1-SNAPSHOT.jar>
to org.apache.torque/torque-ant-tasks/4.1-SNAPSHOT/torque-ant-tasks-4.1-SNAPSHOT.jar
[JENKINS] Archiving <https://builds.apache.org/job/torque4-test-project-hsqldb/ws/torque-ant-tasks/target/torque-ant-tasks-4.1-SNAPSHOT-sources.jar>
to org.apache.torque/torque-ant-tasks/4.1-SNAPSHOT/torque-ant-tasks-4.1-SNAPSHOT-sources.jar
Sending artifact delta relative to torque4-test-project-hsqldb » Torque Generator Ant tasks
#302
Archived 3 artifacts
Archive block size is 32768
Received 0 blocks and 29159 bytes
Compression is 0.0%
Took 0.14 sec
[JENKINS] Archiving <https://builds.apache.org/job/torque4-test-project-hsqldb/ws/torque-test/pom.xml>
to org.apache.torque/torque-test/4.1-SNAPSHOT/torque-test-4.1-SNAPSHOT.pom
Sending artifact delta relative to torque4-test-project-hsqldb » Torque Test Project #302
Archived 1 artifacts
Archive block size is 32768
Received 1 blocks and 19009 bytes
Compression is 63.3%
Took 2.5 sec
[JENKINS] Archiving <https://builds.apache.org/job/torque4-test-project-hsqldb/ws/pom.xml>
to org.apache.torque/torque/4.1-SNAPSHOT/torque-4.1-SNAPSHOT.pom
Sending artifact delta relative to torque4-test-project-hsqldb » Torque Maven Parent #302
Archived 1 artifacts
Archive block size is 32768
Received 0 blocks and 16730 bytes
Compression is 0.0%
Took 0.16 sec
[JENKINS] Archiving <https://builds.apache.org/job/torque4-test-project-hsqldb/ws/torque-runtime/pom.xml>
to org.apache.torque/torque-runtime/4.1-SNAPSHOT/torque-runtime-4.1-SNAPSHOT.pom
[JENKINS] Archiving <https://builds.apache.org/job/torque4-test-project-hsqldb/ws/torque-runtime/target/torque-runtime-4.1-SNAPSHOT.jar>
to org.apache.torque/torque-runtime/4.1-SNAPSHOT/torque-runtime-4.1-SNAPSHOT.jar
[JENKINS] Archiving <https://builds.apache.org/job/torque4-test-project-hsqldb/ws/torque-runtime/target/torque-runtime-4.1-SNAPSHOT-sources.jar>
to org.apache.torque/torque-runtime/4.1-SNAPSHOT/torque-runtime-4.1-SNAPSHOT-sources.jar
Sending artifact delta relative to torque4-test-project-hsqldb » Torque Runtime #302
Archived 3 artifacts
Archive block size is 32768
Received 5 blocks and 312525 bytes
Compression is 34.4%
Took 0.24 sec
[JENKINS] Archiving <https://builds.apache.org/job/torque4-test-project-hsqldb/ws/torque-generator/pom.xml>
to org.apache.torque/torque-generator/4.1-SNAPSHOT/torque-generator-4.1-SNAPSHOT.pom
[JENKINS] Archiving <https://builds.apache.org/job/torque4-test-project-hsqldb/ws/torque-generator/target/torque-generator-4.1-SNAPSHOT.jar>
to org.apache.torque/torque-generator/4.1-SNAPSHOT/torque-generator-4.1-SNAPSHOT.jar
[JENKINS] Archiving <https://builds.apache.org/job/torque4-test-project-hsqldb/ws/torque-generator/target/torque-generator-4.1-SNAPSHOT-sources.jar>
to org.apache.torque/torque-generator/4.1-SNAPSHOT/torque-generator-4.1-SNAPSHOT-sources.jar
Sending artifact delta relative to torque4-test-project-hsqldb » Torque Generator #302
Archived 3 artifacts
Archive block size is 32768
Received 10 blocks and 467467 bytes
Compression is 41.2%
Took 2.4 sec
[JENKINS] Archiving <https://builds.apache.org/job/torque4-test-project-hsqldb/ws/torque-templates/pom.xml>
to org.apache.torque/torque-templates/4.1-SNAPSHOT/torque-templates-4.1-SNAPSHOT.pom
[JENKINS] Archiving <https://builds.apache.org/job/torque4-test-project-hsqldb/ws/torque-templates/target/torque-templates-4.1-SNAPSHOT.jar>
to org.apache.torque/torque-templates/4.1-SNAPSHOT/torque-templates-4.1-SNAPSHOT.jar
[JENKINS] Archiving <https://builds.apache.org/job/torque4-test-project-hsqldb/ws/torque-templates/target/torque-templates-4.1-SNAPSHOT-sources.jar>
to org.apache.torque/torque-templates/4.1-SNAPSHOT/torque-templates-4.1-SNAPSHOT-sources.jar
Sending artifact delta relative to torque4-test-project-hsqldb » Torque Templates #302
Archived 3 artifacts
Archive block size is 32768
Received 6 blocks and 915927 bytes
Compression is 17.7%
Took 0.39 sec
[JENKINS] Archiving <https://builds.apache.org/job/torque4-test-project-hsqldb/ws/torque-site/pom.xml>
to org.apache.torque/torque-site/4.1-SNAPSHOT/torque-site-4.1-SNAPSHOT.pom
[JENKINS] Archiving <https://builds.apache.org/job/torque4-test-project-hsqldb/ws/torque-site/target/torque-site-4.1-SNAPSHOT-site.xml>
to org.apache.torque/torque-site/4.1-SNAPSHOT/torque-site-4.1-SNAPSHOT-site.xml
Sending artifact delta relative to torque4-test-project-hsqldb » Torque Site #302
Archived 2 artifacts
Archive block size is 32768
Received 0 blocks and 24135 bytes
Compression is 0.0%
Took 0.16 sec
[JENKINS] Archiving <https://builds.apache.org/job/torque4-test-project-hsqldb/ws/torque-maven-plugin/pom.xml>
to org.apache.torque/torque-maven-plugin/4.1-SNAPSHOT/torque-maven-plugin-4.1-SNAPSHOT.pom
[JENKINS] Archiving <https://builds.apache.org/job/torque4-test-project-hsqldb/ws/torque-maven-plugin/target/torque-maven-plugin-4.1-SNAPSHOT.jar>
to org.apache.torque/torque-maven-plugin/4.1-SNAPSHOT/torque-maven-plugin-4.1-SNAPSHOT.jar
[JENKINS] Archiving <https://builds.apache.org/job/torque4-test-project-hsqldb/ws/torque-maven-plugin/target/torque-maven-plugin-4.1-SNAPSHOT-sources.jar>
to org.apache.torque/torque-maven-plugin/4.1-SNAPSHOT/torque-maven-plugin-4.1-SNAPSHOT-sources.jar
Sending artifact delta relative to torque4-test-project-hsqldb » Torque Generator Maven 2
Plugin #302
Archived 3 artifacts
Archive block size is 32768
Received 0 blocks and 42690 bytes
Compression is 0.0%
Took 0.17 sec
Sending e-mails to: torque-dev@db.apache.org
channel stopped

---------------------------------------------------------------------
To unsubscribe, e-mail: torque-dev-unsubscribe@db.apache.org
For additional commands, e-mail: torque-dev-help@db.apache.org


Mime
View raw message