db-torque-dev mailing list archives

Site index · List index
Message view « Date » · « Thread »
Top « Date » · « Thread »
From Apache Jenkins Server <jenk...@builds.apache.org>
Subject Build failed in Jenkins: Torque4-trunk #514
Date Wed, 22 Oct 2014 00:24:22 GMT
See <https://builds.apache.org/job/Torque4-trunk/514/changes>

Changes:

[tfischer] TORQUE-331 - generate check constraint for enums

[tfischer] TORQUE-331 - test that it is not possible to insert illegal value (except for MySQL
where evrything is possible:-) )

[tfischer] TORQUE-331 - adjust test of enum handling for mssql

------------------------------------------
Started by an SCM change
Building remotely on ubuntu-1 (docker Ubuntu ubuntu) in workspace <https://builds.apache.org/job/Torque4-trunk/ws/>
Cleaning up <https://builds.apache.org/job/Torque4-trunk/ws/torque4-trunk>
Deleting <https://builds.apache.org/job/Torque4-trunk/ws/torque4-trunk/target>
Deleting <https://builds.apache.org/job/Torque4-trunk/ws/torque4-trunk/torque-generator/target>
Deleting <https://builds.apache.org/job/Torque4-trunk/ws/torque4-trunk/torque-ant-tasks/target>
Deleting <https://builds.apache.org/job/Torque4-trunk/ws/torque4-trunk/torque-runtime/target>
Deleting <https://builds.apache.org/job/Torque4-trunk/ws/torque4-trunk/torque-templates/target>
Deleting <https://builds.apache.org/job/Torque4-trunk/ws/torque4-trunk/torque-maven-plugin/target>
Deleting <https://builds.apache.org/job/Torque4-trunk/ws/torque4-trunk/torque-site/target>
Updating http://svn.apache.org/repos/asf/db/torque/torque4/trunk at revision '2014-10-22T00:22:49.772
+0000'
U         torque-test/pom.xml
A         torque-test/src/test/java/org/apache/torque/generated/peer/GroupByTest.java
A         torque-test/src/test/java/org/apache/torque/datatypes/EnumTest.java
U         torque-test/src/test/java/org/apache/torque/datatypes/BooleanIntCharTest.java
U         torque-test/src/main/schema/test-schema.xml
A         torque-test/src/main/java/org/apache/torque/TestEnum.java
U         torque-maven-plugin/pom.xml
U         torque-maven-plugin/src/main/java/org/apache/torque/generator/maven/TorqueGeneratorMojo.java
U         torque-runtime/src/test/java/org/apache/torque/sql/SqlBuilderTest.java
A         torque-runtime/src/main/java/org/apache/torque/sql/whereclausebuilder/EnumValueBuilder.java
U         torque-runtime/src/main/java/org/apache/torque/sql/SqlBuilder.java
U         torque-runtime/src/main/java/org/apache/torque/sql/WhereClauseExpression.java
U         torque-runtime/src/main/java/org/apache/torque/criteria/Criteria.java
U         torque-runtime/src/main/java/org/apache/torque/util/BasePeerImpl.java
U         torque-runtime/pom.xml
AU        torque-site/src/site/resources/images/schema-table.png
AU        torque-site/src/site/resources/images/schema-view.png
AU        torque-site/src/site/resources/images/schema-database.png
U         torque-site/src/site/xdoc/documentation/orm-reference/defining-the-schema.xml
U         torque-site/src/site/xdoc/developer-info/developer-guide.xml
U         torque-ant-tasks/pom.xml
U         torque-generator/src/test/java/org/apache/torque/generator/file/FileTestUtils.java
U         torque-generator/src/test/java/org/apache/torque/generator/processor/string/ConstantNameCreatorTest.java
U         torque-generator/src/main/java/org/apache/torque/generator/processor/string/ConstantNameCreator.java
U         torque-generator/src/main/java/org/apache/torque/generator/control/action/SourceElementAttributeAction.java
U         torque-generator/src/main/java/org/apache/torque/generator/configuration/controller/ControlConfigurationXmlParser.java
U         torque-generator/pom.xml
U         src/main/checkstyle/checkstyle.xml
U         pom.xml
U         torque-templates/src/test/schema/schema.xml
U         torque-templates/src/test/resources/org/apache/torque/templates/expected-schema.html
U         torque-templates/src/test/resources/org/apache/torque/templates/expected-datamodel.xml
U         torque-templates/src/test/resources/org/apache/torque/templates/expected-schema.sql
U         torque-templates/src/main/java/org/apache/torque/templates/typemapping/SizedForBitDataSqlType.java
U         torque-templates/src/main/java/org/apache/torque/templates/model/Column.java
A         torque-templates/src/main/java/org/apache/torque/templates/model/EnumValue.java
U         torque-templates/src/main/java/org/apache/torque/templates/model/Inheritance.java
U         torque-templates/src/main/java/org/apache/torque/templates/transformer/sql/SqlAttributeName.java
U         torque-templates/src/main/java/org/apache/torque/templates/transformer/sql/SQLModelTransformer.java
U         torque-templates/src/main/java/org/apache/torque/templates/transformer/om/OMColumnTransformer.java
U         torque-templates/src/main/java/org/apache/torque/templates/transformer/om/ColumnAttributeName.java
A         torque-templates/src/main/java/org/apache/torque/templates/transformer/om/EnumValueAttributeName.java
U         torque-templates/src/main/java/org/apache/torque/templates/TemplateOptionName.java
U         torque-templates/src/main/java/org/apache/torque/templates/TorqueSchemaAttributeName.java
A         torque-templates/src/main/java/org/apache/torque/templates/skipdecider/EnumSkipDecider.java
U         torque-templates/src/main/java/org/apache/torque/templates/TorqueSchemaElementName.java
U         torque-templates/src/main/resources/org/apache/torque/templates/idtable/conf/control.xml
U         torque-templates/src/main/resources/org/apache/torque/templates/doc/xdoc/conf/control.xml
U         torque-templates/src/main/resources/org/apache/torque/templates/doc/html/conf/control.xml
U         torque-templates/src/main/resources/org/apache/torque/templates/om/conf/options.properties
U         torque-templates/src/main/resources/org/apache/torque/templates/om/conf/control.xml
U         torque-templates/src/main/resources/org/apache/torque/templates/om/templates/recordmapper/base/dbObjectFieldGetter.vm
U         torque-templates/src/main/resources/org/apache/torque/templates/om/templates/recordmapper/base/recordMapperBase.vm
U         torque-templates/src/main/resources/org/apache/torque/templates/om/templates/peer/impl/base/buildColumnValues.vm
A         torque-templates/src/main/resources/org/apache/torque/templates/om/templates/dbObject/base/enumClassJavadoc.vm
A         torque-templates/src/main/resources/org/apache/torque/templates/om/templates/dbObject/base/enum.vm
U         torque-templates/src/main/resources/org/apache/torque/templates/om/templates/dbObject/base/imports.vm
A         torque-templates/src/main/resources/org/apache/torque/templates/om/templates/dbObject/base/enumValue.vm
U         torque-templates/src/main/resources/org/apache/torque/templates/om/outlets/dbObject.xml
U         torque-templates/src/main/resources/org/apache/torque/templates/xsd/database-4-0.xsd
A         torque-templates/src/main/resources/org/apache/torque/templates/xsd/database-4-1.xsd
A         torque-templates/src/main/resources/org/apache/torque/templates/xsd/database-4-1-strict.xsd
U         torque-templates/src/main/resources/org/apache/torque/templates/sql/templates/ddl/database.groovy
A         torque-templates/src/main/resources/org/apache/torque/templates/sql/templates/ddl/mssql/enumConstraint.groovy
A         torque-templates/src/main/resources/org/apache/torque/templates/sql/templates/ddl/postgresql/enumConstraint.groovy
A         torque-templates/src/main/resources/org/apache/torque/templates/sql/templates/ddl/oracle/enumConstraint.groovy
A         torque-templates/src/main/resources/org/apache/torque/templates/sql/templates/ddl/mysql/enumConstraint.groovy
A         torque-templates/src/main/resources/org/apache/torque/templates/sql/templates/ddl/derby/enumConstraint.groovy
A         torque-templates/src/main/resources/org/apache/torque/templates/sql/templates/ddl/hsqldb/enumConstraint.groovy
A         torque-templates/src/main/resources/org/apache/torque/templates/sql/templates/ddl/enumValue.groovy
U         torque-templates/src/main/resources/org/apache/torque/templates/sql/outlets/ddl.xml
U         torque-templates/src/main/resources/org/apache/torque/templates/sql/conf/control.xml
U         torque-templates/src/main/resources/org/apache/torque/templates/sql/conf/options.properties
U         torque-templates/src/main/resources/org/apache/torque/templates/sql/createdb/conf/control.xml
U         torque-templates/pom.xml
At revision 1633495
Parsing POMs
maven3-agent.jar already up to date
maven3-interceptor.jar already up to date
maven3-interceptor-commons.jar already up to date
[torque4-trunk] $ /home/jenkins/tools/java/latest1.6/bin/java -cp /home/jenkins/jenkins-slave/maven3-agent.jar:/home/jenkins/tools/maven/apache-maven-3.0.4/boot/plexus-classworlds-2.4.jar
org.jvnet.hudson.maven3.agent.Maven3Main /home/jenkins/tools/maven/apache-maven-3.0.4 /home/jenkins/jenkins-slave/slave.jar
/home/jenkins/jenkins-slave/maven3-interceptor.jar /home/jenkins/jenkins-slave/maven3-interceptor-commons.jar
38907
<===[JENKINS REMOTING CAPACITY]===>   channel started
log4j:WARN No appenders could be found for logger (org.apache.commons.beanutils.converters.BooleanConverter).
log4j:WARN Please initialize the log4j system properly.
Executing Maven:  -B -f <https://builds.apache.org/job/Torque4-trunk/ws/torque4-trunk/pom.xml>
-Dmaven.repo.local=/home/jenkins/jenkins-slave/maven-repositories/2 clean install cobertura:cobertura
findbugs:findbugs checkstyle:checkstyle pmd:pmd pmd:cpd
[INFO] Scanning for projects...
Downloading: http://repo.maven.apache.org/maven2/org/apache/maven/wagon/wagon-ssh-external/2.2/wagon-ssh-external-2.2.pom
Downloaded: http://repo.maven.apache.org/maven2/org/apache/maven/wagon/wagon-ssh-external/2.2/wagon-ssh-external-2.2.pom
(5 KB at 15.8 KB/sec)
Downloading: http://repo.maven.apache.org/maven2/org/apache/maven/wagon/wagon-ssh-common/2.2/wagon-ssh-common-2.2.pom
Downloaded: http://repo.maven.apache.org/maven2/org/apache/maven/wagon/wagon-ssh-common/2.2/wagon-ssh-common-2.2.pom
(2 KB at 33.2 KB/sec)
Downloading: http://repo.maven.apache.org/maven2/org/apache/maven/wagon/wagon-ssh-external/2.2/wagon-ssh-external-2.2.jar
Downloading: http://repo.maven.apache.org/maven2/org/apache/maven/wagon/wagon-ssh-common/2.2/wagon-ssh-common-2.2.jar
Downloaded: http://repo.maven.apache.org/maven2/org/apache/maven/wagon/wagon-ssh-external/2.2/wagon-ssh-external-2.2.jar
(15 KB at 183.5 KB/sec)
Downloaded: http://repo.maven.apache.org/maven2/org/apache/maven/wagon/wagon-ssh-common/2.2/wagon-ssh-common-2.2.jar
(25 KB at 223.3 KB/sec)
[WARNING] 
[WARNING] Some problems were encountered while building the effective model for org.apache.torque:torque-maven-plugin:maven-plugin:4.1-SNAPSHOT
[WARNING] 'reporting.plugins.plugin.version' for org.apache.maven.plugins:maven-plugin-plugin
is missing. @ line 109, column 15
[WARNING] 
[WARNING] It is highly recommended to fix these problems because they threaten the stability
of your build.
[WARNING] 
[WARNING] For this reason, future Maven versions might no longer support building such malformed
projects.
[WARNING] 
[INFO] ------------------------------------------------------------------------
[INFO] Reactor Build Order:
[INFO] 
[INFO] Torque Maven Parent
[INFO] Torque Runtime
[INFO] Torque Generator
[INFO] Torque Templates
[INFO] Torque Generator Maven 2 Plugin
[INFO] Torque Generator Ant tasks
[INFO] Torque Site
Downloading: http://repo.maven.apache.org/maven2/org/apache/maven/plugins/maven-pmd-plugin/2.5/maven-pmd-plugin-2.5.jar
Downloaded: http://repo.maven.apache.org/maven2/org/apache/maven/plugins/maven-pmd-plugin/2.5/maven-pmd-plugin-2.5.jar
(57 KB at 510.0 KB/sec)
Downloading: http://repo.maven.apache.org/maven2/org/codehaus/mojo/findbugs-maven-plugin/2.5.2/findbugs-maven-plugin-2.5.2.pom
Downloaded: http://repo.maven.apache.org/maven2/org/codehaus/mojo/findbugs-maven-plugin/2.5.2/findbugs-maven-plugin-2.5.2.pom
(18 KB at 264.1 KB/sec)
Downloading: http://repo.maven.apache.org/maven2/org/codehaus/mojo/findbugs-maven-plugin/2.5.2/findbugs-maven-plugin-2.5.2.jar
Downloaded: http://repo.maven.apache.org/maven2/org/codehaus/mojo/findbugs-maven-plugin/2.5.2/findbugs-maven-plugin-2.5.2.jar
(132 KB at 823.7 KB/sec)
Downloading: http://repo.maven.apache.org/maven2/org/apache/maven/plugins/maven-pmd-plugin/3.2/maven-pmd-plugin-3.2.pom
Downloaded: http://repo.maven.apache.org/maven2/org/apache/maven/plugins/maven-pmd-plugin/3.2/maven-pmd-plugin-3.2.pom
(12 KB at 146.7 KB/sec)
Downloading: http://repo.maven.apache.org/maven2/org/apache/maven/plugins/maven-pmd-plugin/3.2/maven-pmd-plugin-3.2.jar
Downloaded: http://repo.maven.apache.org/maven2/org/apache/maven/plugins/maven-pmd-plugin/3.2/maven-pmd-plugin-3.2.jar
(104 KB at 941.9 KB/sec)
Downloading: http://repo.maven.apache.org/maven2/org/apache/maven/plugins/maven-jxr-plugin/2.4/maven-jxr-plugin-2.4.jar
Downloaded: http://repo.maven.apache.org/maven2/org/apache/maven/plugins/maven-jxr-plugin/2.4/maven-jxr-plugin-2.4.jar
(33 KB at 479.5 KB/sec)
[INFO]                                                                         
[INFO] ------------------------------------------------------------------------
[INFO] Building Torque Maven Parent 4.1-SNAPSHOT
[INFO] ------------------------------------------------------------------------
[INFO] 
[INFO] --- maven-clean-plugin:2.5:clean (default-clean) @ torque ---
[INFO] 
[INFO] --- maven-remote-resources-plugin:1.3:process (default) @ torque ---
[INFO] 
[INFO] --- maven-site-plugin:3.4:attach-descriptor (attach-descriptor) @ torque ---
[INFO] 
[INFO] --- maven-source-plugin:2.1.2:jar-no-fork (attach-sources) @ torque ---
[INFO] 
[INFO] --- apache-rat-plugin:0.8:check (default) @ torque ---
[INFO] Exclude: velocity.log
[INFO] Exclude: .checkstyle
[INFO] Exclude: checkstyle-cache.ccf
[INFO] Exclude: derby.log
[INFO] Exclude: LICENSE-EDL.txt
[INFO] Exclude: DEPENDENCIES
[INFO] Exclude: torque-test/target/**/*
[INFO] Exclude: torque-test/.classpath
[INFO] Exclude: torque-test/.project
[INFO] Exclude: torque-test/.settings/**
[INFO] Exclude: torque-test/src/main/generated-java/**/*
[INFO] Exclude: torque-test/derby.log
[CHECKSTYLE] No report found for mojo check
[PMD] No report found for mojo check
[INFO] ------------------------------------------------------------------------
[INFO] Reactor Summary:
[INFO] 
[INFO] Torque Maven Parent ............................... FAILURE [38.958s]
[INFO] Torque Runtime .................................... SKIPPED
[INFO] Torque Generator .................................. SKIPPED
[INFO] Torque Templates .................................. SKIPPED
[INFO] Torque Generator Maven 2 Plugin ................... SKIPPED
[INFO] Torque Generator Ant tasks ........................ SKIPPED
[INFO] Torque Site ....................................... SKIPPED
[INFO] ------------------------------------------------------------------------
[INFO] BUILD FAILURE
[INFO] ------------------------------------------------------------------------
[INFO] Total time: 44.191s
[INFO] Finished at: Wed Oct 22 00:24:05 UTC 2014
[INFO] Final Memory: 20M/95M
[INFO] ------------------------------------------------------------------------
Waiting for Jenkins to finish collecting data[ERROR] Failed to execute goal org.apache.rat:apache-rat-plugin:0.8:check
(default) on project torque: Too many unapproved licenses: 1 -> [Help 1]
[ERROR] 
[ERROR] To see the full stack trace of the errors, re-run Maven with the -e switch.
[ERROR] Re-run Maven using the -X switch to enable full debug logging.
[ERROR] 
[ERROR] For more information about the errors and possible solutions, please read the following
articles:
[ERROR] [Help 1] http://cwiki.apache.org/confluence/display/MAVEN/MojoFailureException

[JENKINS] Archiving <https://builds.apache.org/job/Torque4-trunk/ws/torque4-trunk/torque-ant-tasks/pom.xml>
to org.apache.torque/torque-ant-tasks/4.1-SNAPSHOT/torque-ant-tasks-4.1-SNAPSHOT.pom
Sending artifact delta relative to Torque4-trunk » Torque Generator Ant tasks #512
Archived 1 artifacts
Archive block size is 32768
Received 0 blocks and 4087 bytes
Compression is 0.0%
Took 74 ms
[JENKINS] Archiving <https://builds.apache.org/job/Torque4-trunk/ws/torque4-trunk/pom.xml>
to org.apache.torque/torque/4.1-SNAPSHOT/torque-4.1-SNAPSHOT.pom
<https://builds.apache.org/job/Torque4-trunk/ws/torque4-trunk/pom.xml> is not inside
<https://builds.apache.org/job/Torque4-trunk/ws/torque4-trunk/torque4-trunk/;> will
archive in a separate pass
Sending artifact delta relative to Torque4-trunk » Torque Maven Parent #512
Archived 1 artifacts
Archive block size is 32768
Received 0 blocks and 16730 bytes
Compression is 0.0%
Took 74 ms
[JENKINS] Archiving <https://builds.apache.org/job/Torque4-trunk/ws/torque4-trunk/torque-runtime/pom.xml>
to org.apache.torque/torque-runtime/4.1-SNAPSHOT/torque-runtime-4.1-SNAPSHOT.pom
Sending artifact delta relative to Torque4-trunk » Torque Runtime #512
Archived 1 artifacts
Archive block size is 32768
Received 0 blocks and 5836 bytes
Compression is 0.0%
Took 0.13 sec
[JENKINS] Archiving <https://builds.apache.org/job/Torque4-trunk/ws/torque4-trunk/torque-generator/pom.xml>
to org.apache.torque/torque-generator/4.1-SNAPSHOT/torque-generator-4.1-SNAPSHOT.pom
Sending artifact delta relative to Torque4-trunk » Torque Generator #512
Archived 1 artifacts
Archive block size is 32768
Received 0 blocks and 7606 bytes
Compression is 0.0%
Took 0.17 sec
[JENKINS] Archiving <https://builds.apache.org/job/Torque4-trunk/ws/torque4-trunk/torque-templates/pom.xml>
to org.apache.torque/torque-templates/4.1-SNAPSHOT/torque-templates-4.1-SNAPSHOT.pom
Sending artifact delta relative to Torque4-trunk » Torque Templates #512
Archived 1 artifacts
Archive block size is 32768
Received 0 blocks and 5509 bytes
Compression is 0.0%
Took 0.19 sec
[JENKINS] Archiving <https://builds.apache.org/job/Torque4-trunk/ws/torque4-trunk/torque-site/pom.xml>
to org.apache.torque/torque-site/4.1-SNAPSHOT/torque-site-4.1-SNAPSHOT.pom
Sending artifact delta relative to Torque4-trunk » Torque Site #512
Archived 1 artifacts
Archive block size is 32768
Received 0 blocks and 11873 bytes
Compression is 0.0%
Took 0.18 sec
[JENKINS] Archiving <https://builds.apache.org/job/Torque4-trunk/ws/torque4-trunk/torque-maven-plugin/pom.xml>
to org.apache.torque/torque-maven-plugin/4.1-SNAPSHOT/torque-maven-plugin-4.1-SNAPSHOT.pom
Sending artifact delta relative to Torque4-trunk » Torque Generator Maven 2 Plugin #512
Archived 1 artifacts
Archive block size is 32768
Received 0 blocks and 4194 bytes
Compression is 0.0%
Took 92 ms
Sending e-mails to: torque-dev@db.apache.org
channel stopped
Skipping Cobertura coverage report as build was not UNSTABLE or better ...

---------------------------------------------------------------------
To unsubscribe, e-mail: torque-dev-unsubscribe@db.apache.org
For additional commands, e-mail: torque-dev-help@db.apache.org


Mime
View raw message