db-torque-dev mailing list archives

Site index · List index
Message view « Date » · « Thread »
Top « Date » · « Thread »
From Apache Jenkins Server <jenk...@builds.apache.org>
Subject Build failed in Jenkins: Torque4-trunk #508
Date Sun, 05 Oct 2014 02:18:32 GMT
See <https://builds.apache.org/job/Torque4-trunk/508/changes>

Changes:

[tfischer] Try fix problem with jenkins build

[tfischer] Fix documentation

------------------------------------------
[...truncated 372 lines...]
Running org.apache.torque.om.mapper.BigDecimalMapperTest
Tests run: 3, Failures: 0, Errors: 0, Skipped: 0, Time elapsed: 0.018 sec - in org.apache.torque.om.mapper.BigDecimalMapperTest
Running org.apache.torque.om.mapper.ObjectListMapperTest
Tests run: 12, Failures: 0, Errors: 0, Skipped: 0, Time elapsed: 0.206 sec - in org.apache.torque.om.mapper.ObjectListMapperTest
Running org.apache.torque.om.mapper.IntegerMapperTest
Tests run: 3, Failures: 0, Errors: 0, Skipped: 0, Time elapsed: 0.012 sec - in org.apache.torque.om.mapper.IntegerMapperTest
Running org.apache.torque.om.mapper.CompositeMapperTest
Tests run: 2, Failures: 0, Errors: 0, Skipped: 0, Time elapsed: 0.016 sec - in org.apache.torque.om.mapper.CompositeMapperTest
Running org.apache.torque.om.mapper.DateMapperTest
Tests run: 3, Failures: 0, Errors: 0, Skipped: 0, Time elapsed: 0.011 sec - in org.apache.torque.om.mapper.DateMapperTest
Running org.apache.torque.om.NumberKeyTest
Tests run: 23, Failures: 0, Errors: 0, Skipped: 0, Time elapsed: 0.002 sec - in org.apache.torque.om.NumberKeyTest
Running org.apache.torque.adapter.DBOracleTest
Tests run: 1, Failures: 0, Errors: 0, Skipped: 0, Time elapsed: 0.003 sec - in org.apache.torque.adapter.DBOracleTest
Running org.apache.torque.criteria.CriterionTest
Tests run: 10, Failures: 0, Errors: 0, Skipped: 0, Time elapsed: 0.042 sec - in org.apache.torque.criteria.CriterionTest
Running org.apache.torque.criteria.CriteriaTest
Tests run: 33, Failures: 0, Errors: 0, Skipped: 0, Time elapsed: 0.118 sec - in org.apache.torque.criteria.CriteriaTest
Running org.apache.torque.criteria.JoinTest
Tests run: 2, Failures: 0, Errors: 0, Skipped: 0, Time elapsed: 0.001 sec - in org.apache.torque.criteria.JoinTest
Running org.apache.torque.avalon.AvalonTest
[DEBUG] Starting container...
[DEBUG] Loading the service container class org.apache.fulcrum.yaafi.framework.container.ServiceContainerImpl
[DEBUG] Instantiating the service container class org.apache.fulcrum.yaafi.framework.container.ServiceContainerImpl
[DEBUG] Using the following configuration : <?xml version="1.0" encoding="UTF-8"?><fulcrum-yaafi><containerFlavour>yaafi</containerFlavour><containerClazzName>org.apache.fulcrum.yaafi.framework.container.ServiceContainerImpl</containerClazzName><componentRoles><location>src/test/resources/TestRoleConfig.xml</location><isEncrypted>false</isEncrypted></componentRoles><componentConfiguration><location>src/test/resources/TestComponentConfig.xml</location><isEncrypted>false</isEncrypted></componentConfiguration><parameters><location/><isEncrypted>false</isEncrypted></parameters></fulcrum-yaafi>
[DEBUG] Using the following container type : yaafi
[DEBUG] YAAFI Service Framework is starting up
[DEBUG] Setting applicationRootDir to <https://builds.apache.org/job/Torque4-trunk/ws/torque4-trunk/torque-runtime>
[DEBUG] Setting tempRootDir to /tmp
[DEBUG] Looking for src/test/resources/TestRoleConfig.xml in the root directory
[DEBUG] Found src/test/resources/TestRoleConfig.xml as <https://builds.apache.org/job/Torque4-trunk/ws/torque4-trunk/torque-runtime/src/test/resources/TestRoleConfig.xml>
[DEBUG] Looking for src/test/resources/TestComponentConfig.xml in the root directory
[DEBUG] Found src/test/resources/TestComponentConfig.xml as <https://builds.apache.org/job/Torque4-trunk/ws/torque4-trunk/torque-runtime/src/test/resources/TestComponentConfig.xml>
[DEBUG] Looking for /componentConfiguration.properties in the root directory
[DEBUG] Looking for /componentConfiguration.properties as absolute file location
[DEBUG] Looking for /componentConfiguration.properties using the class loader
[WARNING] Unable to find any resource with the name '/componentConfiguration.properties'
[DEBUG] Unable to load the following optional file :/componentConfiguration.properties
[DEBUG] Using the following componentConfigurationProperties: {java.runtime.name=Java(TM)
SE Runtime Environment, urn:avalon:temp=/tmp, sun.boot.library.path=/home/jenkins/tools/java/jdk1.6.0_45-32/jre/lib/i386,
java.vm.version=20.45-b01, urn:avalon:home=<https://builds.apache.org/job/Torque4-trunk/ws/torque4-trunk/torque-runtime,>
java.vm.vendor=Sun Microsystems Inc., java.vendor.url=http://java.sun.com/, path.separator=:,
java.vm.name=Java HotSpot(TM) Server VM, file.encoding.pkg=sun.io, user.country=US, sun.java.launcher=SUN_STANDARD,
sun.os.patch.level=unknown, urn:avalon:name=fulcrum-yaafi, java.vm.specification.name=Java
Virtual Machine Specification, user.dir=<https://builds.apache.org/job/Torque4-trunk/ws/torque4-trunk/torque-runtime,>
urn:avalon:partition=root, java.runtime.version=1.6.0_45-b06, java.awt.graphicsenv=sun.awt.X11GraphicsEnvironment,
basedir=<https://builds.apache.org/job/Torque4-trunk/ws/torque4-trunk/torque-runtime,>
java.endorsed.dirs=/home/jenkins/tools/java/jdk1.6.0_45-32/jre/lib/endorsed, os.arch=i386,
surefire.real.class.path=<https://builds.apache.org/job/Torque4-trunk/ws/torque4-trunk/torque-runtime/target/surefire/surefirebooter4883036843216816128.jar,>
java.io.tmpdir=/tmp, line.separator=
, java.vm.specification.vendor=Sun Microsystems Inc., os.name=Linux, sun.jnu.encoding=ISO-8859-1,
java.library.path=/home/jenkins/tools/java/jdk1.6.0_45-32/jre/lib/i386/server:/home/jenkins/tools/java/jdk1.6.0_45-32/jre/lib/i386:/home/jenkins/tools/java/jdk1.6.0_45-32/jre/../lib/i386:/usr/java/packages/lib/i386:/lib:/usr/lib,
surefire.test.class.path=<https://builds.apache.org/job/Torque4-trunk/ws/torque4-trunk/torque-runtime/target/test-classes>:<https://builds.apache.org/job/Torque4-trunk/ws/torque4-trunk/torque-runtime/target/generated-classes/cobertura>:/home/jenkins/jenkins-slave/maven-repositories/1/commons-collections/commons-collections/3.2.1/commons-collections-3.2.1.jar:/home/jenkins/jenkins-slave/maven-repositories/1/commons-configuration/commons-configuration/1.6/commons-configuration-1.6.jar:/home/jenkins/jenkins-slave/maven-repositories/1/commons-digester/commons-digester/1.8/commons-digester-1.8.jar:/home/jenkins/jenkins-slave/maven-repositories/1/commons-beanutils/commons-beanutils-core/1.8.0/commons-beanutils-core-1.8.0.jar:/home/jenkins/jenkins-slave/maven-repositories/1/commons-dbcp/commons-dbcp/1.3/commons-dbcp-1.3.jar:/home/jenkins/jenkins-slave/maven-repositories/1/commons-lang/commons-lang/2.6/commons-lang-2.6.jar:/home/jenkins/jenkins-slave/maven-repositories/1/commons-logging/commons-logging/1.1.1/commons-logging-1.1.1.jar:/home/jenkins/jenkins-slave/maven-repositories/1/commons-pool/commons-pool/1.5.6/commons-pool-1.5.6.jar:/home/jenkins/jenkins-slave/maven-repositories/1/org/apache/jcs/jcs/1.3/jcs-1.3.jar:/home/jenkins/jenkins-slave/maven-repositories/1/concurrent/concurrent/1.0/concurrent-1.0.jar:/home/jenkins/jenkins-slave/maven-repositories/1/junit/junit/3.8.1/junit-3.8.1.jar:/home/jenkins/jenkins-slave/maven-repositories/1/org/apache/avalon/framework/avalon-framework-api/4.3.1/avalon-framework-api-4.3.1.jar:/home/jenkins/jenkins-slave/maven-repositories/1/org/apache/fulcrum/fulcrum-testcontainer/1.0.6/fulcrum-testcontainer-1.0.6.jar:/home/jenkins/jenkins-slave/maven-repositories/1/org/apache/fulcrum/fulcrum-yaafi/1.0.6/fulcrum-yaafi-1.0.6.jar:/home/jenkins/jenkins-slave/maven-repositories/1/org/apache/avalon/framework/avalon-framework-impl/4.3.1/avalon-framework-impl-4.3.1.jar:/home/jenkins/jenkins-slave/maven-repositories/1/org/mockito/mockito-all/1.9.0/mockito-all-1.9.0.jar:/home/jenkins/jenkins-slave/maven-repositories/1/net/sourceforge/cobertura/cobertura/1.9.2/cobertura-1.9.2.jar:/home/jenkins/jenkins-slave/maven-repositories/1/org/apache/ant/ant/1.7.0/ant-1.7.0.jar:/home/jenkins/jenkins-slave/maven-repositories/1/org/apache/ant/ant-launcher/1.7.0/ant-launcher-1.7.0.jar:,
java.specification.name=Java Platform API Specification, java.class.version=50.0, sun.management.compiler=HotSpot
Tiered Compilers, maven.repo.local=/home/jenkins/jenkins-slave/maven-repositories/1, os.version=3.13.0-36-lowlatency,
user.home=/home/jenkins, user.timezone=Etc/UTC, java.awt.printerjob=sun.print.PSPrinterJob,
java.specification.version=1.6, file.encoding=ISO-8859-1, user.name=jenkins, java.class.path=<https://builds.apache.org/job/Torque4-trunk/ws/torque4-trunk/torque-runtime/target/test-classes>:<https://builds.apache.org/job/Torque4-trunk/ws/torque4-trunk/torque-runtime/target/generated-classes/cobertura>:/home/jenkins/jenkins-slave/maven-repositories/1/commons-collections/commons-collections/3.2.1/commons-collections-3.2.1.jar:/home/jenkins/jenkins-slave/maven-repositories/1/commons-configuration/commons-configuration/1.6/commons-configuration-1.6.jar:/home/jenkins/jenkins-slave/maven-repositories/1/commons-digester/commons-digester/1.8/commons-digester-1.8.jar:/home/jenkins/jenkins-slave/maven-repositories/1/commons-beanutils/commons-beanutils-core/1.8.0/commons-beanutils-core-1.8.0.jar:/home/jenkins/jenkins-slave/maven-repositories/1/commons-dbcp/commons-dbcp/1.3/commons-dbcp-1.3.jar:/home/jenkins/jenkins-slave/maven-repositories/1/commons-lang/commons-lang/2.6/commons-lang-2.6.jar:/home/jenkins/jenkins-slave/maven-repositories/1/commons-logging/commons-logging/1.1.1/commons-logging-1.1.1.jar:/home/jenkins/jenkins-slave/maven-repositories/1/commons-pool/commons-pool/1.5.6/commons-pool-1.5.6.jar:/home/jenkins/jenkins-slave/maven-repositories/1/org/apache/jcs/jcs/1.3/jcs-1.3.jar:/home/jenkins/jenkins-slave/maven-repositories/1/concurrent/concurrent/1.0/concurrent-1.0.jar:/home/jenkins/jenkins-slave/maven-repositories/1/junit/junit/3.8.1/junit-3.8.1.jar:/home/jenkins/jenkins-slave/maven-repositories/1/org/apache/avalon/framework/avalon-framework-api/4.3.1/avalon-framework-api-4.3.1.jar:/home/jenkins/jenkins-slave/maven-repositories/1/org/apache/fulcrum/fulcrum-testcontainer/1.0.6/fulcrum-testcontainer-1.0.6.jar:/home/jenkins/jenkins-slave/maven-repositories/1/org/apache/fulcrum/fulcrum-yaafi/1.0.6/fulcrum-yaafi-1.0.6.jar:/home/jenkins/jenkins-slave/maven-repositories/1/org/apache/avalon/framework/avalon-framework-impl/4.3.1/avalon-framework-impl-4.3.1.jar:/home/jenkins/jenkins-slave/maven-repositories/1/org/mockito/mockito-all/1.9.0/mockito-all-1.9.0.jar:/home/jenkins/jenkins-slave/maven-repositories/1/net/sourceforge/cobertura/cobertura/1.9.2/cobertura-1.9.2.jar:/home/jenkins/jenkins-slave/maven-repositories/1/org/apache/ant/ant/1.7.0/ant-1.7.0.jar:/home/jenkins/jenkins-slave/maven-repositories/1/org/apache/ant/ant-launcher/1.7.0/ant-launcher-1.7.0.jar:,
java.vm.specification.version=1.0, sun.arch.data.model=32, java.home=/home/jenkins/tools/java/jdk1.6.0_45-32/jre,
sun.java.command=<https://builds.apache.org/job/Torque4-trunk/ws/torque4-trunk/torque-runtime/target/surefire/surefirebooter4883036843216816128.jar>
<https://builds.apache.org/job/Torque4-trunk/ws/torque4-trunk/torque-runtime/target/surefire/surefire8221353262558723232tmp>
<https://builds.apache.org/job/Torque4-trunk/ws/torque4-trunk/torque-runtime/target/surefire/surefire_303184039368299913697tmp,>
java.specification.vendor=Sun Microsystems Inc., user.language=en, java.vm.info=mixed mode,
java.version=1.6.0_45, java.ext.dirs=/home/jenkins/tools/java/jdk1.6.0_45-32/jre/lib/ext:/usr/java/packages/lib/ext,
sun.boot.class.path=/home/jenkins/tools/java/jdk1.6.0_45-32/jre/lib/resources.jar:/home/jenkins/tools/java/jdk1.6.0_45-32/jre/lib/rt.jar:/home/jenkins/tools/java/jdk1.6.0_45-32/jre/lib/sunrsasign.jar:/home/jenkins/tools/java/jdk1.6.0_45-32/jre/lib/jsse.jar:/home/jenkins/tools/java/jdk1.6.0_45-32/jre/lib/jce.jar:/home/jenkins/tools/java/jdk1.6.0_45-32/jre/lib/charsets.jar:/home/jenkins/tools/java/jdk1.6.0_45-32/jre/lib/modules/jdk.boot.jar:/home/jenkins/tools/java/jdk1.6.0_45-32/jre/classes,
java.vendor=Sun Microsystems Inc., localRepository=/home/jenkins/jenkins-slave/maven-repositories/1,
file.separator=/, derby.stream.error.file=target/derby.log, java.vendor.url.bug=http://java.sun.com/cgi-bin/bugreport.cgi,
sun.cpu.endian=little, sun.io.unicode.encoding=UnicodeLittle, sun.cpu.isalist=}
[DEBUG] Looking for /parameters.properties in the root directory
[DEBUG] Looking for /parameters.properties as absolute file location
[DEBUG] Looking for /parameters.properties using the class loader
[WARNING] Unable to find any resource with the name '/parameters.properties'
[DEBUG] Configuring the service component TorqueComponent
[DEBUG] Incarnating the service TorqueComponent
[DEBUG] Instantiating the implementation class for TorqueComponent
[DEBUG] Incarnating the service TorqueComponent
[DEBUG] LogEnabled.enableLogging() for TorqueComponent
[DEBUG] Contextualizable.contextualize() for TorqueComponent
[DEBUG] Configurable.configure() for TorqueComponent
[DEBUG] configure(TorqueComponent::<no value>:@null:20:22)
[DEBUG] Config File changes to src/test/resources/Torque.properties
[DEBUG] Config File is <https://builds.apache.org/job/Torque4-trunk/ws/torque4-trunk/torque-runtime/src/test/resources/Torque.properties>
[DEBUG] Initializable.initialize() for TorqueComponent
[DEBUG] initialize()
[DEBUG] YAAFI Avalon Service Container is up and running
[INFO] YaffiContainer ready.
[DEBUG] Located the service 'org.apache.torque.avalon.Torque' in the local container
[DEBUG] Disposing of container...
[DEBUG] Disposing all services
[DEBUG] Decommision the service TorqueComponent
[DEBUG] Decommisioning the service TorqueComponent
[DEBUG] Disposable.dispose() for TorqueComponent
[DEBUG] dispose()
[DEBUG] Disposing the service TorqueComponent
[DEBUG] All services are disposed
[INFO] YaffiContainer has been disposed.
[DEBUG] Starting container...
[DEBUG] Loading the service container class org.apache.fulcrum.yaafi.framework.container.ServiceContainerImpl
[DEBUG] Instantiating the service container class org.apache.fulcrum.yaafi.framework.container.ServiceContainerImpl
[DEBUG] Using the following configuration : <?xml version="1.0" encoding="UTF-8"?><fulcrum-yaafi><containerFlavour>yaafi</containerFlavour><containerClazzName>org.apache.fulcrum.yaafi.framework.container.ServiceContainerImpl</containerClazzName><componentRoles><location>src/test/resources/TestRoleConfig.xml</location><isEncrypted>false</isEncrypted></componentRoles><componentConfiguration><location>src/test/resources/TestComponentConfig.xml</location><isEncrypted>false</isEncrypted></componentConfiguration><parameters><location/><isEncrypted>false</isEncrypted></parameters></fulcrum-yaafi>
[DEBUG] Using the following container type : yaafi
[DEBUG] YAAFI Service Framework is starting up
[DEBUG] Setting applicationRootDir to <https://builds.apache.org/job/Torque4-trunk/ws/torque4-trunk/torque-runtime>
[DEBUG] Setting tempRootDir to /tmp
[DEBUG] Looking for src/test/resources/TestRoleConfig.xml in the root directory
[DEBUG] Found src/test/resources/TestRoleConfig.xml as <https://builds.apache.org/job/Torque4-trunk/ws/torque4-trunk/torque-runtime/src/test/resources/TestRoleConfig.xml>
[DEBUG] Looking for src/test/resources/TestComponentConfig.xml in the root directory
[DEBUG] Found src/test/resources/TestComponentConfig.xml as <https://builds.apache.org/job/Torque4-trunk/ws/torque4-trunk/torque-runtime/src/test/resources/TestComponentConfig.xml>
[DEBUG] Looking for /componentConfiguration.properties in the root directory
[DEBUG] Looking for /componentConfiguration.properties as absolute file location
[DEBUG] Looking for /componentConfiguration.properties using the class loader
[WARNING] Unable to find any resource with the name '/componentConfiguration.properties'
[DEBUG] Unable to load the following optional file :/componentConfiguration.properties
[DEBUG] Using the following componentConfigurationProperties: {java.runtime.name=Java(TM)
SE Runtime Environment, urn:avalon:temp=/tmp, sun.boot.library.path=/home/jenkins/tools/java/jdk1.6.0_45-32/jre/lib/i386,
java.vm.version=20.45-b01, urn:avalon:home=<https://builds.apache.org/job/Torque4-trunk/ws/torque4-trunk/torque-runtime,>
java.vm.vendor=Sun Microsystems Inc., java.vendor.url=http://java.sun.com/, path.separator=:,
java.vm.name=Java HotSpot(TM) Server VM, file.encoding.pkg=sun.io, user.country=US, sun.java.launcher=SUN_STANDARD,
sun.os.patch.level=unknown, urn:avalon:name=fulcrum-yaafi, java.vm.specification.name=Java
Virtual Machine Specification, user.dir=<https://builds.apache.org/job/Torque4-trunk/ws/torque4-trunk/torque-runtime,>
urn:avalon:partition=root, java.runtime.version=1.6.0_45-b06, java.awt.graphicsenv=sun.awt.X11GraphicsEnvironment,
basedir=<https://builds.apache.org/job/Torque4-trunk/ws/torque4-trunk/torque-runtime,>
java.endorsed.dirs=/home/jenkins/tools/java/jdk1.6.0_45-32/jre/lib/endorsed, os.arch=i386,
surefire.real.class.path=<https://builds.apache.org/job/Torque4-trunk/ws/torque4-trunk/torque-runtime/target/surefire/surefirebooter4883036843216816128.jar,>
java.io.tmpdir=/tmp, line.separator=
, java.vm.specification.vendor=Sun Microsystems Inc., os.name=Linux, sun.jnu.encoding=ISO-8859-1,
java.library.path=/home/jenkins/tools/java/jdk1.6.0_45-32/jre/lib/i386/server:/home/jenkins/tools/java/jdk1.6.0_45-32/jre/lib/i386:/home/jenkins/tools/java/jdk1.6.0_45-32/jre/../lib/i386:/usr/java/packages/lib/i386:/lib:/usr/lib,
surefire.test.class.path=<https://builds.apache.org/job/Torque4-trunk/ws/torque4-trunk/torque-runtime/target/test-classes>:<https://builds.apache.org/job/Torque4-trunk/ws/torque4-trunk/torque-runtime/target/generated-classes/cobertura>:/home/jenkins/jenkins-slave/maven-repositories/1/commons-collections/commons-collections/3.2.1/commons-collections-3.2.1.jar:/home/jenkins/jenkins-slave/maven-repositories/1/commons-configuration/commons-configuration/1.6/commons-configuration-1.6.jar:/home/jenkins/jenkins-slave/maven-repositories/1/commons-digester/commons-digester/1.8/commons-digester-1.8.jar:/home/jenkins/jenkins-slave/maven-repositories/1/commons-beanutils/commons-beanutils-core/1.8.0/commons-beanutils-core-1.8.0.jar:/home/jenkins/jenkins-slave/maven-repositories/1/commons-dbcp/commons-dbcp/1.3/commons-dbcp-1.3.jar:/home/jenkins/jenkins-slave/maven-repositories/1/commons-lang/commons-lang/2.6/commons-lang-2.6.jar:/home/jenkins/jenkins-slave/maven-repositories/1/commons-logging/commons-logging/1.1.1/commons-logging-1.1.1.jar:/home/jenkins/jenkins-slave/maven-repositories/1/commons-pool/commons-pool/1.5.6/commons-pool-1.5.6.jar:/home/jenkins/jenkins-slave/maven-repositories/1/org/apache/jcs/jcs/1.3/jcs-1.3.jar:/home/jenkins/jenkins-slave/maven-repositories/1/concurrent/concurrent/1.0/concurrent-1.0.jar:/home/jenkins/jenkins-slave/maven-repositories/1/junit/junit/3.8.1/junit-3.8.1.jar:/home/jenkins/jenkins-slave/maven-repositories/1/org/apache/avalon/framework/avalon-framework-api/4.3.1/avalon-framework-api-4.3.1.jar:/home/jenkins/jenkins-slave/maven-repositories/1/org/apache/fulcrum/fulcrum-testcontainer/1.0.6/fulcrum-testcontainer-1.0.6.jar:/home/jenkins/jenkins-slave/maven-repositories/1/org/apache/fulcrum/fulcrum-yaafi/1.0.6/fulcrum-yaafi-1.0.6.jar:/home/jenkins/jenkins-slave/maven-repositories/1/org/apache/avalon/framework/avalon-framework-impl/4.3.1/avalon-framework-impl-4.3.1.jar:/home/jenkins/jenkins-slave/maven-repositories/1/org/mockito/mockito-all/1.9.0/mockito-all-1.9.0.jar:/home/jenkins/jenkins-slave/maven-repositories/1/net/sourceforge/cobertura/cobertura/1.9.2/cobertura-1.9.2.jar:/home/jenkins/jenkins-slave/maven-repositories/1/org/apache/ant/ant/1.7.0/ant-1.7.0.jar:/home/jenkins/jenkins-slave/maven-repositories/1/org/apache/ant/ant-launcher/1.7.0/ant-launcher-1.7.0.jar:,
java.specification.name=Java Platform API Specification, java.class.version=50.0, sun.management.compiler=HotSpot
Tiered Compilers, maven.repo.local=/home/jenkins/jenkins-slave/maven-repositories/1, os.version=3.13.0-36-lowlatency,
user.home=/home/jenkins, user.timezone=Etc/UTC, java.awt.printerjob=sun.print.PSPrinterJob,
java.specification.version=1.6, file.encoding=ISO-8859-1, user.name=jenkins, java.class.path=<https://builds.apache.org/job/Torque4-trunk/ws/torque4-trunk/torque-runtime/target/test-classes>:<https://builds.apache.org/job/Torque4-trunk/ws/torque4-trunk/torque-runtime/target/generated-classes/cobertura>:/home/jenkins/jenkins-slave/maven-repositories/1/commons-collections/commons-collections/3.2.1/commons-collections-3.2.1.jar:/home/jenkins/jenkins-slave/maven-repositories/1/commons-configuration/commons-configuration/1.6/commons-configuration-1.6.jar:/home/jenkins/jenkins-slave/maven-repositories/1/commons-digester/commons-digester/1.8/commons-digester-1.8.jar:/home/jenkins/jenkins-slave/maven-repositories/1/commons-beanutils/commons-beanutils-core/1.8.0/commons-beanutils-core-1.8.0.jar:/home/jenkins/jenkins-slave/maven-repositories/1/commons-dbcp/commons-dbcp/1.3/commons-dbcp-1.3.jar:/home/jenkins/jenkins-slave/maven-repositories/1/commons-lang/commons-lang/2.6/commons-lang-2.6.jar:/home/jenkins/jenkins-slave/maven-repositories/1/commons-logging/commons-logging/1.1.1/commons-logging-1.1.1.jar:/home/jenkins/jenkins-slave/maven-repositories/1/commons-pool/commons-pool/1.5.6/commons-pool-1.5.6.jar:/home/jenkins/jenkins-slave/maven-repositories/1/org/apache/jcs/jcs/1.3/jcs-1.3.jar:/home/jenkins/jenkins-slave/maven-repositories/1/concurrent/concurrent/1.0/concurrent-1.0.jar:/home/jenkins/jenkins-slave/maven-repositories/1/junit/junit/3.8.1/junit-3.8.1.jar:/home/jenkins/jenkins-slave/maven-repositories/1/org/apache/avalon/framework/avalon-framework-api/4.3.1/avalon-framework-api-4.3.1.jar:/home/jenkins/jenkins-slave/maven-repositories/1/org/apache/fulcrum/fulcrum-testcontainer/1.0.6/fulcrum-testcontainer-1.0.6.jar:/home/jenkins/jenkins-slave/maven-repositories/1/org/apache/fulcrum/fulcrum-yaafi/1.0.6/fulcrum-yaafi-1.0.6.jar:/home/jenkins/jenkins-slave/maven-repositories/1/org/apache/avalon/framework/avalon-framework-impl/4.3.1/avalon-framework-impl-4.3.1.jar:/home/jenkins/jenkins-slave/maven-repositories/1/org/mockito/mockito-all/1.9.0/mockito-all-1.9.0.jar:/home/jenkins/jenkins-slave/maven-repositories/1/net/sourceforge/cobertura/cobertura/1.9.2/cobertura-1.9.2.jar:/home/jenkins/jenkins-slave/maven-repositories/1/org/apache/ant/ant/1.7.0/ant-1.7.0.jar:/home/jenkins/jenkins-slave/maven-repositories/1/org/apache/ant/ant-launcher/1.7.0/ant-launcher-1.7.0.jar:,
java.vm.specification.version=1.0, sun.arch.data.model=32, java.home=/home/jenkins/tools/java/jdk1.6.0_45-32/jre,
sun.java.command=<https://builds.apache.org/job/Torque4-trunk/ws/torque4-trunk/torque-runtime/target/surefire/surefirebooter4883036843216816128.jar>
<https://builds.apache.org/job/Torque4-trunk/ws/torque4-trunk/torque-runtime/target/surefire/surefire8221353262558723232tmp>
<https://builds.apache.org/job/Torque4-trunk/ws/torque4-trunk/torque-runtime/target/surefire/surefire_303184039368299913697tmp,>
java.specification.vendor=Sun Microsystems Inc., user.language=en, java.vm.info=mixed mode,
java.version=1.6.0_45, java.ext.dirs=/home/jenkins/tools/java/jdk1.6.0_45-32/jre/lib/ext:/usr/java/packages/lib/ext,
sun.boot.class.path=/home/jenkins/tools/java/jdk1.6.0_45-32/jre/lib/resources.jar:/home/jenkins/tools/java/jdk1.6.0_45-32/jre/lib/rt.jar:/home/jenkins/tools/java/jdk1.6.0_45-32/jre/lib/sunrsasign.jar:/home/jenkins/tools/java/jdk1.6.0_45-32/jre/lib/jsse.jar:/home/jenkins/tools/java/jdk1.6.0_45-32/jre/lib/jce.jar:/home/jenkins/tools/java/jdk1.6.0_45-32/jre/lib/charsets.jar:/home/jenkins/tools/java/jdk1.6.0_45-32/jre/lib/modules/jdk.boot.jar:/home/jenkins/tools/java/jdk1.6.0_45-32/jre/classes,
java.vendor=Sun Microsystems Inc., localRepository=/home/jenkins/jenkins-slave/maven-repositories/1,
file.separator=/, derby.stream.error.file=target/derby.log, java.vendor.url.bug=http://java.sun.com/cgi-bin/bugreport.cgi,
sun.cpu.endian=little, sun.io.unicode.encoding=UnicodeLittle, sun.cpu.isalist=}
[DEBUG] Looking for /parameters.properties in the root directory
[DEBUG] Looking for /parameters.properties as absolute file location
[DEBUG] Looking for /parameters.properties using the class loader
[WARNING] Unable to find any resource with the name '/parameters.properties'
[DEBUG] Configuring the service component TorqueComponent
[DEBUG] Incarnating the service TorqueComponent
[DEBUG] Instantiating the implementation class for TorqueComponent
[DEBUG] Incarnating the service TorqueComponent
[DEBUG] LogEnabled.enableLogging() for TorqueComponent
[DEBUG] Contextualizable.contextualize() for TorqueComponent
[DEBUG] Configurable.configure() for TorqueComponent
[DEBUG] configure(TorqueComponent::<no value>:@null:20:22)
[DEBUG] Config File changes to src/test/resources/Torque.properties
[DEBUG] Config File is <https://builds.apache.org/job/Torque4-trunk/ws/torque4-trunk/torque-runtime/src/test/resources/Torque.properties>
[DEBUG] Initializable.initialize() for TorqueComponent
[DEBUG] initialize()
[DEBUG] YAAFI Avalon Service Container is up and running
[INFO] YaffiContainer ready.
[DEBUG] Located the service 'org.apache.torque.avalon.Torque' in the local container
[DEBUG] Disposing of container...
[DEBUG] Disposing all services
[DEBUG] Decommision the service TorqueComponent
[DEBUG] Decommisioning the service TorqueComponent
[DEBUG] Disposable.dispose() for TorqueComponent
[DEBUG] dispose()
[DEBUG] Disposing the service TorqueComponent
[DEBUG] All services are disposed
[INFO] YaffiContainer has been disposed.
Tests run: 2, Failures: 0, Errors: 0, Skipped: 0, Time elapsed: 0.093 sec - in org.apache.torque.avalon.AvalonTest
Running org.apache.torque.TorqueRuntimeExceptionTest
Tests run: 1, Failures: 0, Errors: 0, Skipped: 0, Time elapsed: 0.001 sec - in org.apache.torque.TorqueRuntimeExceptionTest
Running org.apache.torque.ColumnImplTest
Tests run: 41, Failures: 0, Errors: 0, Skipped: 0, Time elapsed: 0.062 sec - in org.apache.torque.ColumnImplTest
Running org.apache.torque.TorqueInstanceTest
Tests run: 5, Failures: 0, Errors: 0, Skipped: 0, Time elapsed: 0.006 sec - in org.apache.torque.TorqueInstanceTest
Running org.apache.torque.sql.SqlBuilderTest
Tests run: 125, Failures: 0, Errors: 0, Skipped: 0, Time elapsed: 0.279 sec - in org.apache.torque.sql.SqlBuilderTest
Running org.apache.torque.sql.QueryTest
Tests run: 2, Failures: 0, Errors: 0, Skipped: 0, Time elapsed: 0 sec - in org.apache.torque.sql.QueryTest
Running org.apache.torque.map.ColumnMapTest
Tests run: 3, Failures: 0, Errors: 0, Skipped: 0, Time elapsed: 0.002 sec - in org.apache.torque.map.ColumnMapTest
Running org.apache.torque.util.UniqueListTest
Tests run: 2, Failures: 0, Errors: 0, Skipped: 0, Time elapsed: 0.001 sec - in org.apache.torque.util.UniqueListTest
Running org.apache.torque.util.BasePeerImplTest
Tests run: 14, Failures: 0, Errors: 0, Skipped: 0, Time elapsed: 0.158 sec - in org.apache.torque.util.BasePeerImplTest
Running org.apache.torque.util.functions.SumTest
Tests run: 4, Failures: 0, Errors: 0, Skipped: 0, Time elapsed: 0 sec - in org.apache.torque.util.functions.SumTest
Running org.apache.torque.util.functions.MinTest
Tests run: 4, Failures: 0, Errors: 0, Skipped: 0, Time elapsed: 0.001 sec - in org.apache.torque.util.functions.MinTest
Running org.apache.torque.util.functions.CountTest
Tests run: 4, Failures: 0, Errors: 0, Skipped: 0, Time elapsed: 0 sec - in org.apache.torque.util.functions.CountTest
Running org.apache.torque.util.functions.AggregateFunctionTest
Tests run: 12, Failures: 0, Errors: 0, Skipped: 0, Time elapsed: 0.001 sec - in org.apache.torque.util.functions.AggregateFunctionTest
Running org.apache.torque.util.functions.MaxTest
Tests run: 4, Failures: 0, Errors: 0, Skipped: 0, Time elapsed: 0 sec - in org.apache.torque.util.functions.MaxTest
Running org.apache.torque.util.functions.AvgTest
Tests run: 4, Failures: 0, Errors: 0, Skipped: 0, Time elapsed: 0 sec - in org.apache.torque.util.functions.AvgTest
Running org.apache.torque.util.functions.AbstractFunctionTest
Tests run: 11, Failures: 0, Errors: 0, Skipped: 0, Time elapsed: 0.008 sec - in org.apache.torque.util.functions.AbstractFunctionTest
Running org.apache.torque.util.SummaryHelperTest
Tests run: 1, Failures: 0, Errors: 0, Skipped: 0, Time elapsed: 0.014 sec - in org.apache.torque.util.SummaryHelperTest
Cobertura: Loaded information on 111 classes.
Cobertura: Saved information on 111 classes.

Results :

Tests run: 346, Failures: 0, Errors: 0, Skipped: 0

[JENKINS] Recording test results
[INFO] 
[INFO] --- cobertura-maven-plugin:2.3:cobertura (default-cli) @ torque-runtime ---
[INFO] Cobertura 1.9.2 - GNU GPL License (NO WARRANTY) - See COPYRIGHT file
Cobertura: Loaded information on 111 classes.
Report time: 1805ms

[INFO] Cobertura Report generation was successful.
[INFO] Cobertura 1.9.2 - GNU GPL License (NO WARRANTY) - See COPYRIGHT file
Cobertura: Loaded information on 111 classes.
Report time: 1646ms

[INFO] Cobertura Report generation was successful.
[INFO] 
[INFO] --- findbugs-maven-plugin:2.5.2:findbugs (default-cli) @ torque-runtime ---
[INFO] Fork Value is true
     [java] Warnings generated: 3
[INFO] Done FindBugs Analysis....
[FINDBUGS] Finding all files that match the pattern findbugsXml.xml
[FINDBUGS] Parsing 1 files in <https://builds.apache.org/job/Torque4-trunk/ws/torque4-trunk/torque-runtime/target>
[FINDBUGS] Successfully parsed file <https://builds.apache.org/job/Torque4-trunk/ws/torque4-trunk/torque-runtime/target/findbugsXml.xml>
of module Torque Runtime with 3 warnings.
[FINDBUGS] Computing warning deltas based on reference build #503
[INFO] 
[INFO] --- maven-checkstyle-plugin:2.13:checkstyle (default-cli) @ torque-runtime ---
[CHECKSTYLE] No report found for mojo checkstyle
[INFO] ------------------------------------------------------------------------
[INFO] Reactor Summary:
[INFO] 
[INFO] Torque Maven Parent ............................... SUCCESS [32.300s]
[INFO] Torque Runtime .................................... FAILURE [1:41.674s]
[INFO] Torque Generator .................................. SKIPPED
[INFO] Torque Templates .................................. SKIPPED
[INFO] Torque Generator Maven 2 Plugin ................... SKIPPED
[INFO] Torque Generator Ant tasks ........................ SKIPPED
[INFO] Torque Site ....................................... SKIPPED
[INFO] ------------------------------------------------------------------------
[INFO] BUILD FAILURE
[INFO] ------------------------------------------------------------------------
[INFO] Total time: 2:17.584s
[INFO] Finished at: Sun Oct 05 02:18:20 UTC 2014
[INFO] Final Memory: 44M/235M
[INFO] ------------------------------------------------------------------------
Waiting for Jenkins to finish collecting data
[ERROR] Failed to execute goal org.apache.maven.plugins:maven-checkstyle-plugin:2.13:checkstyle
(default-cli) on project torque-runtime: An error has occurred in Checkstyle report generation.
Failed during checkstyle configuration: cannot initialize module TreeWalker - Unable to instantiate
DoubleCheckedLocking: Unable to instantiate DoubleCheckedLockingCheck -> [Help 1]
[ERROR] 
[ERROR] To see the full stack trace of the errors, re-run Maven with the -e switch.
[ERROR] Re-run Maven using the -X switch to enable full debug logging.
[ERROR] 
[ERROR] For more information about the errors and possible solutions, please read the following
articles:
[ERROR] [Help 1] http://cwiki.apache.org/confluence/display/MAVEN/MojoExecutionException
[ERROR] 
[ERROR] After correcting the problems, you can resume the build with the command
[ERROR]   mvn <goals> -rf :torque-runtime
[JENKINS] Archiving <https://builds.apache.org/job/Torque4-trunk/ws/torque4-trunk/torque-ant-tasks/pom.xml>
to org.apache.torque/torque-ant-tasks/4.1-SNAPSHOT/torque-ant-tasks-4.1-SNAPSHOT.pom
Sending artifact delta relative to Torque4-trunk » Torque Generator Ant tasks #502
Archived 1 artifacts
Archive block size is 32768
Received 0 blocks and 4087 bytes
Compression is 0.0%
Took 45 ms
[JENKINS] Archiving <https://builds.apache.org/job/Torque4-trunk/ws/torque4-trunk/pom.xml>
to org.apache.torque/torque/4.1-SNAPSHOT/torque-4.1-SNAPSHOT.pom
<https://builds.apache.org/job/Torque4-trunk/ws/torque4-trunk/pom.xml> is not inside
<https://builds.apache.org/job/Torque4-trunk/ws/torque4-trunk/torque4-trunk/;> will
archive in a separate pass
No artifacts from Torque4-trunk » Torque Maven Parent #503 to compare, so performing full
copy of artifacts
[JENKINS] Archiving <https://builds.apache.org/job/Torque4-trunk/ws/torque4-trunk/torque-runtime/pom.xml>
to org.apache.torque/torque-runtime/4.1-SNAPSHOT/torque-runtime-4.1-SNAPSHOT.pom
[JENKINS] Archiving <https://builds.apache.org/job/Torque4-trunk/ws/torque4-trunk/torque-runtime/target/torque-runtime-4.1-SNAPSHOT.jar>
to org.apache.torque/torque-runtime/4.1-SNAPSHOT/torque-runtime-4.1-SNAPSHOT.jar
[JENKINS] Archiving <https://builds.apache.org/job/Torque4-trunk/ws/torque4-trunk/torque-runtime/target/torque-runtime-4.1-SNAPSHOT-sources.jar>
to org.apache.torque/torque-runtime/4.1-SNAPSHOT/torque-runtime-4.1-SNAPSHOT-sources.jar
No artifacts from Torque4-trunk » Torque Runtime #503 to compare, so performing full copy
of artifacts
[JENKINS] Archiving <https://builds.apache.org/job/Torque4-trunk/ws/torque4-trunk/torque-generator/pom.xml>
to org.apache.torque/torque-generator/4.1-SNAPSHOT/torque-generator-4.1-SNAPSHOT.pom
No artifacts from Torque4-trunk » Torque Generator #503 to compare, so performing full copy
of artifacts
[JENKINS] Archiving <https://builds.apache.org/job/Torque4-trunk/ws/torque4-trunk/torque-templates/pom.xml>
to org.apache.torque/torque-templates/4.1-SNAPSHOT/torque-templates-4.1-SNAPSHOT.pom
Sending artifact delta relative to Torque4-trunk » Torque Templates #502
Archived 1 artifacts
Archive block size is 32768
Received 0 blocks and 5509 bytes
Compression is 0.0%
Took 41 ms
[JENKINS] Archiving <https://builds.apache.org/job/Torque4-trunk/ws/torque4-trunk/torque-site/pom.xml>
to org.apache.torque/torque-site/4.1-SNAPSHOT/torque-site-4.1-SNAPSHOT.pom
Sending artifact delta relative to Torque4-trunk » Torque Site #502
Archived 1 artifacts
Archive block size is 32768
Received 0 blocks and 11873 bytes
Compression is 0.0%
Took 36 ms
[JENKINS] Archiving <https://builds.apache.org/job/Torque4-trunk/ws/torque4-trunk/torque-maven-plugin/pom.xml>
to org.apache.torque/torque-maven-plugin/4.1-SNAPSHOT/torque-maven-plugin-4.1-SNAPSHOT.pom
Sending artifact delta relative to Torque4-trunk » Torque Generator Maven 2 Plugin #502
Archived 1 artifacts
Archive block size is 32768
Received 0 blocks and 4194 bytes
Compression is 0.0%
Took 27 ms
Sending e-mails to: torque-dev@db.apache.org
Sending e-mails to: torque-dev@db.apache.org
channel stopped
Skipping Cobertura coverage report as build was not UNSTABLE or better ...

---------------------------------------------------------------------
To unsubscribe, e-mail: torque-dev-unsubscribe@db.apache.org
For additional commands, e-mail: torque-dev-help@db.apache.org


Mime
View raw message