db-torque-dev mailing list archives

Site index · List index
Message view « Date » · « Thread »
Top « Date » · « Thread »
From Apache Jenkins Server <jenk...@builds.apache.org>
Subject Build failed in Jenkins: torque4-test-project-derby #375
Date Sat, 06 Sep 2014 19:39:21 GMT
See <https://builds.apache.org/job/torque4-test-project-derby/375/changes>

Changes:

[tfischer] TORQUE-308 correct wrong schema location for XSDs

------------------------------------------
Started by upstream project "Torque4-trunk" build number 492
originally caused by:
 Started by an SCM change
Building remotely on H4 (Mapreduce zookeeper Hadoop Pig falcon ubuntu Hdfs) in workspace <https://builds.apache.org/job/torque4-test-project-derby/ws/>
Checking out a fresh workspace because there's no workspace at <https://builds.apache.org/job/torque4-test-project-derby/ws/>
Cleaning local Directory .
Checking out http://svn.apache.org/repos/asf/db/torque/torque4/trunk/torque-test at revision
'2014-09-06T19:39:13.144 +0000'
A         src
A         src/main
A         src/main/torque-gen
A         src/main/torque-gen/conf
A         src/main/torque-gen/conf/control.xml
A         src/main/torque-gen/templates
A         src/main/torque-gen/templates/peer
A         src/main/torque-gen/templates/peer/base
A         src/main/torque-gen/templates/peer/base/classAnnotations.vm
A         src/main/torque-gen/outlets
A         src/main/torque-gen/outlets/peer.xml
A         src/main/schema
A         src/main/schema/included-from-included-schema.xml
A         src/main/schema/default-value-schema.xml
A         src/main/schema/foreign-key-schema.xml
AU        src/main/schema/test-schema.xml
AU        src/main/schema/ext-schema.xml
AU        src/main/schema/extext-schema.xml
AU        src/main/schema/id-table-schema.xml
A         src/main/schema/types-schema.xml
A         src/main/schema/databaseMapInit-schema.xml
A         src/main/schema/qualified-table-name-schema.xml
AU        src/main/schema/bookstore-schema.xml
A         src/main/schema/included-schema.xml
A         src/main/schema/index.xml
A         src/main/schema/save-method-in-peer-schema.xml
A         src/main/schema/pk-schema.xml
A         src/main/java
A         src/main/java/org
A         src/main/java/org/apache
A         src/main/java/org/apache/torque
A         src/main/java/org/apache/torque/OptimisticLockingPeerInterface.java
A         src/main/java/org/apache/torque/OptimisticLockingInterface.java
A         src/main/java/org/apache/torque/TestPeerInterface.java
AU        src/main/java/org/apache/torque/TestInterface.java
A         src/main/plugin-config
A         src/main/plugin-config/findbugs-exclude.xml
A         src/test
A         src/test/resources
AU        src/test/resources/commons-logging.properties
AU        src/test/resources/log4j.properties
AU        src/test/resources/cache.ccf
AU        src/test/resources/TurbineResources.properties
AU        src/test/resources/TestRoleConfig.xml
AU        src/test/resources/TestComponentConfig.xml
A         src/test/sql
AU        src/test/sql/schema.sql
AU        src/test/sql/schema.sql.ref.xml
A         src/test/profile
A         src/test/profile/jmcnally
AU        src/test/profile/jmcnally/Torque.properties
A         src/test/profile/tv
A         src/test/profile/tv/Torque.properties
A         src/test/profile/hsqldb
AU        src/test/profile/hsqldb/Torque.properties
A         src/test/profile/derbyEmbedded
A         src/test/profile/derbyEmbedded/notes.txt
A         src/test/profile/derbyEmbedded/Torque.properties
A         src/test/profile/mssql
A         src/test/profile/mssql/Torque.properties
A         src/test/profile/postgresql
AU        src/test/profile/postgresql/Torque.properties
A         src/test/profile/derby
A         src/test/profile/derby/notes.txt
AU        src/test/profile/derby/Torque.properties
A         src/test/profile/mysql
AU        src/test/profile/mysql/Torque.properties
A         src/test/profile/oracle
AU        src/test/profile/oracle/Torque.properties
A         src/test/profile/henning
AU        src/test/profile/henning/Torque.properties
A         src/test/java
A         src/test/java/org
A         src/test/java/org/apache
A         src/test/java/org/apache/torque
A         src/test/java/org/apache/torque/sql
AU        src/test/java/org/apache/torque/sql/DatabaseTools.java
AU        src/test/java/org/apache/torque/sql/SkipSqlTest.java
AU        src/test/java/org/apache/torque/PkSchemaData.java
AU        src/test/java/org/apache/torque/DocsTest.java
AU        src/test/java/org/apache/torque/BeanTestConditional.java
AU        src/test/java/org/apache/torque/BaseDatabaseTestCase.java
A         src/test/java/org/apache/torque/oid
AU        src/test/java/org/apache/torque/oid/IDBrokerTest.java
A         src/test/java/org/apache/torque/om
AU        src/test/java/org/apache/torque/om/OMByNameMethodsTest.java
A         src/test/java/org/apache/torque/util
AU        src/test/java/org/apache/torque/util/BasePeerTest.java
AU        src/test/java/org/apache/torque/util/LargeSelectTest.java
AU        src/test/java/org/apache/torque/util/SummaryHelperTest.java
AU        src/test/java/org/apache/torque/util/CopyTestConditional.java
A         src/test/java/org/apache/torque/util/ExceptionMapperTest.java
A         src/test/java/org/apache/torque/map
AU        src/test/java/org/apache/torque/map/DatabaseMapTest.java
AU        src/test/java/org/apache/torque/ManagerTestConditional.java
A         src/test/java/org/apache/torque/test
AU        src/test/java/org/apache/torque/test/InheritanceClassnameTestChild1.java
AU        src/test/java/org/apache/torque/test/InheritanceClassnameTestChild2.java
AU        src/test/java/org/apache/torque/InitShutdownTest.java
A         src/test/java/org/apache/torque/adapter
AU        src/test/java/org/apache/torque/adapter/AdapterTest.java
A         src/test/java/org/apache/torque/avalon
AU        src/test/java/org/apache/torque/avalon/AvalonMapBuildersTest.java
AU        src/test/java/org/apache/torque/DataTest.java
AU        src/test/java/org/apache/torque/JndiConfigurationTest.java
AU        src/test/java/org/apache/torque/ForeignKeySchemaData.java
A         src/test/java/org/apache/torque/generated
A         src/test/java/org/apache/torque/generated/dataobject
AU        src/test/java/org/apache/torque/generated/dataobject/GetRelatedObjectsJoinTest.java
AU        src/test/java/org/apache/torque/generated/dataobject/GetRelatedObjectsTest.java
AU        src/test/java/org/apache/torque/generated/dataobject/ViewTest.java
AU        src/test/java/org/apache/torque/generated/dataobject/ForeignKeyGetterTest.java
AU        src/test/java/org/apache/torque/generated/dataobject/SaveTest.java
AU        src/test/java/org/apache/torque/generated/dataobject/ForeignKeyAdderTest.java
AU        src/test/java/org/apache/torque/generated/dataobject/ValueEqualsTest.java
A         src/test/java/org/apache/torque/generated/peer
AU        src/test/java/org/apache/torque/generated/peer/DeleteTest.java
AU        src/test/java/org/apache/torque/generated/peer/ImplInitialisationTest.java
A         src/test/java/org/apache/torque/generated/peer/DoUpdateTest.java
AU        src/test/java/org/apache/torque/generated/peer/OptimisticLockingSelectForUpdateTest.java
AU        src/test/java/org/apache/torque/generated/peer/OptimisticLockingSimpleSelectTest.java
AU        src/test/java/org/apache/torque/generated/peer/SelectInTest.java
AU        src/test/java/org/apache/torque/generated/peer/RetrieveByPkTest.java
AU        src/test/java/org/apache/torque/generated/peer/QualifiedTableNameTest.java
AU        src/test/java/org/apache/torque/generated/peer/FillerTest.java
AU        src/test/java/org/apache/torque/generated/peer/DefaultValuesFromDatabaseTest.java
AU        src/test/java/org/apache/torque/generated/peer/SelectTest.java
AU        src/test/java/org/apache/torque/generated/peer/WhereClauseSubselectTest.java
AU        src/test/java/org/apache/torque/generated/peer/SaveMethodsInPeerTest.java
AU        src/test/java/org/apache/torque/generated/peer/SelectFunctionTest.java
AU        src/test/java/org/apache/torque/generated/peer/BaseOptimisticLockingTest.java
A         src/test/java/org/apache/torque/generated/peer/DoInsertTest.java
AU        src/test/java/org/apache/torque/generated/peer/DefaultValuesFromJavaTest.java
AU        src/test/java/org/apache/torque/generated/peer/SetAndSaveTest.java
AU        src/test/java/org/apache/torque/generated/peer/JoinTest.java
A         src/test/java/org/apache/torque/datatypes
AU        src/test/java/org/apache/torque/datatypes/BooleanIntCharTest.java
A         src/test/java/org/apache/torque/datatypes/LongvarbinaryTest.java
A         src/test/java/org/apache/torque/datatypes/VarbinaryTest.java
AU        src/test/java/org/apache/torque/datatypes/BitTest.java
AU        src/test/java/org/apache/torque/datatypes/BlobTest.java
AU        src/test/java/org/apache/torque/datatypes/ClobTest.java
AU        src/test/java/org/apache/torque/datatypes/DateTimeTimestampTest.java
A         src/test/java/org/apache/torque/datatypes/BinaryTest.java
AU        src/test/java/org/apache/torque/datatypes/ByteTypeTest.java
AU        pom.xml
A         LICENSE.txt
A         NOTICE
A         torque-gen.properties
 U        .
At revision 1622917
Parsing POMs
ERROR: Failed to parse POMs
java.io.IOException: remote file operation failed: <https://builds.apache.org/job/torque4-test-project-derby/ws/>
at hudson.remoting.Channel@2c764f74:H4
	at hudson.FilePath.act(FilePath.java:910)
	at hudson.FilePath.act(FilePath.java:887)
	at hudson.maven.MavenModuleSetBuild$MavenModuleSetBuildExecution.parsePoms(MavenModuleSetBuild.java:953)
	at hudson.maven.MavenModuleSetBuild$MavenModuleSetBuildExecution.doRun(MavenModuleSetBuild.java:681)
	at hudson.model.AbstractBuild$AbstractBuildExecution.run(AbstractBuild.java:585)
	at hudson.model.Run.execute(Run.java:1676)
	at hudson.maven.MavenModuleSetBuild.run(MavenModuleSetBuild.java:529)
	at hudson.model.ResourceController.execute(ResourceController.java:88)
	at hudson.model.Executor.run(Executor.java:231)
Caused by: hudson.remoting.ProxyException: hudson.maven.MavenModuleSetBuild$MavenExecutionException:
org.apache.maven.project.ProjectBuildingException: Some problems were encountered while processing
the POMs:
[FATAL] Non-resolvable parent POM: Could not find artifact org.apache.torque:torque:pom:4.1-SNAPSHOT
and 'parent.relativePath' points at wrong local POM @ line 21, column 11

	at hudson.maven.MavenModuleSetBuild$PomParser.invoke(MavenModuleSetBuild.java:1357)
	at hudson.maven.MavenModuleSetBuild$PomParser.invoke(MavenModuleSetBuild.java:1091)
	at hudson.FilePath$FileCallableWrapper.call(FilePath.java:2462)
	at hudson.remoting.UserRequest.perform(UserRequest.java:118)
	at hudson.remoting.UserRequest.perform(UserRequest.java:48)
	at hudson.remoting.Request$2.run(Request.java:328)
	at hudson.remoting.InterceptingExecutorService$1.call(InterceptingExecutorService.java:72)
	at java.util.concurrent.FutureTask$Sync.innerRun(FutureTask.java:303)
	at java.util.concurrent.FutureTask.run(FutureTask.java:138)
	at java.util.concurrent.ThreadPoolExecutor$Worker.runTask(ThreadPoolExecutor.java:895)
	at java.util.concurrent.ThreadPoolExecutor$Worker.run(ThreadPoolExecutor.java:918)
	at java.lang.Thread.run(Thread.java:662)
Caused by: hudson.remoting.ProxyException: org.apache.maven.project.ProjectBuildingException:
Some problems were encountered while processing the POMs:
[FATAL] Non-resolvable parent POM: Could not find artifact org.apache.torque:torque:pom:4.1-SNAPSHOT
and 'parent.relativePath' points at wrong local POM @ line 21, column 11

	at org.apache.maven.project.DefaultProjectBuilder.build(DefaultProjectBuilder.java:364)
	at hudson.maven.MavenEmbedder.buildProjects(MavenEmbedder.java:361)
	at hudson.maven.MavenEmbedder.readProjects(MavenEmbedder.java:331)
	at hudson.maven.MavenEmbedder.readProject(MavenEmbedder.java:322)
	at hudson.maven.MavenModuleSetBuild$PomParser.invoke(MavenModuleSetBuild.java:1300)
	... 11 more

---------------------------------------------------------------------
To unsubscribe, e-mail: torque-dev-unsubscribe@db.apache.org
For additional commands, e-mail: torque-dev-help@db.apache.org


Mime
View raw message